activemq-commits mailing list archives

Site index · List index
Message view « Date » · « Thread »
Top « Date » · « Thread »
From Apache Jenkins Server <jenk...@builds.apache.org>
Subject Build failed in Jenkins: ActiveMQ-Java7-All-UnitTests #408
Date Wed, 04 May 2016 18:48:23 GMT
See <https://builds.apache.org/job/ActiveMQ-Java7-All-UnitTests/408/changes>

Changes:

[gtully] https://issues.apache.org/jira/browse/AMQ-5603 - don't async preallocate

------------------------------------------
[...truncated 2191 lines...]
Tests run: 2, Failures: 0, Errors: 0, Skipped: 0, Time elapsed: 3.797 sec - in org.apache.activemq.broker.region.DestinationRemoveRestartTest
Running org.apache.activemq.broker.region.QueueDuplicatesFromStoreTest
Killed
Running org.apache.activemq.broker.region.QueueOptimizedDispatchExceptionTest
Tests run: 1, Failures: 0, Errors: 0, Skipped: 0, Time elapsed: 1.025 sec - in org.apache.activemq.broker.region.QueueOptimizedDispatchExceptionTest
Running org.apache.activemq.broker.region.QueuePurgeTest
Running org.apache.activemq.broker.region.QueueResendDuringShutdownTest
Tests run: 3, Failures: 0, Errors: 0, Skipped: 0, Time elapsed: 10.995 sec - in org.apache.activemq.broker.region.QueueResendDuringShutdownTest
Running org.apache.activemq.broker.region.SubscriptionAddRemoveQueueTest
Tests run: 1, Failures: 0, Errors: 0, Skipped: 0, Time elapsed: 4.751 sec - in org.apache.activemq.broker.region.SubscriptionAddRemoveQueueTest
Running org.apache.activemq.broker.region.UniquePropertyMessageEvictionStrategyTest
Tests run: 1, Failures: 0, Errors: 0, Skipped: 0, Time elapsed: 12.47 sec - in org.apache.activemq.broker.region.UniquePropertyMessageEvictionStrategyTest
Running org.apache.activemq.broker.region.cursors.AbstractStoreCursorNpeTest
Tests run: 1, Failures: 0, Errors: 0, Skipped: 0, Time elapsed: 4.517 sec - in org.apache.activemq.broker.region.cursors.AbstractStoreCursorNpeTest
Running org.apache.activemq.broker.region.cursors.CursorDurableTest
Tests run: 2, Failures: 0, Errors: 0, Skipped: 0, Time elapsed: 20.701 sec - in org.apache.activemq.broker.region.cursors.CursorDurableTest
Running org.apache.activemq.broker.region.cursors.CursorQueueStoreTest
Tests run: 5, Failures: 0, Errors: 0, Skipped: 0, Time elapsed: 120.204 sec - in org.apache.activemq.broker.region.cursors.CursorQueueStoreTest
Running org.apache.activemq.broker.region.cursors.KahaDBPendingMessageCursorTest
Tests run: 30, Failures: 0, Errors: 0, Skipped: 0, Time elapsed: 184.424 sec - in org.apache.activemq.broker.region.cursors.KahaDBPendingMessageCursorTest
Running org.apache.activemq.broker.region.cursors.MemoryPendingMessageCursorTest
Tests run: 24, Failures: 0, Errors: 0, Skipped: 0, Time elapsed: 22.598 sec - in org.apache.activemq.broker.region.cursors.MemoryPendingMessageCursorTest
Running org.apache.activemq.broker.region.cursors.MultiKahaDBPendingMessageCursorTest
Tests run: 30, Failures: 0, Errors: 0, Skipped: 0, Time elapsed: 175.774 sec - in org.apache.activemq.broker.region.cursors.MultiKahaDBPendingMessageCursorTest
Running org.apache.activemq.broker.region.cursors.NegativeQueueTest
Tests run: 4, Failures: 0, Errors: 0, Skipped: 0, Time elapsed: 697.753 sec - in org.apache.activemq.broker.region.cursors.NegativeQueueTest
Running org.apache.activemq.broker.region.cursors.OrderPendingListTest
Tests run: 9, Failures: 0, Errors: 0, Skipped: 0, Time elapsed: 0.386 sec - in org.apache.activemq.broker.region.cursors.OrderPendingListTest
Running org.apache.activemq.broker.region.cursors.PrioritizedPendingListTest
Tests run: 9, Failures: 0, Errors: 0, Skipped: 0, Time elapsed: 0.379 sec - in org.apache.activemq.broker.region.cursors.PrioritizedPendingListTest
Running org.apache.activemq.broker.region.cursors.StoreBasedCursorTest
Tests run: 5, Failures: 0, Errors: 0, Skipped: 0, Time elapsed: 24.916 sec - in org.apache.activemq.broker.region.cursors.StoreBasedCursorTest
Running org.apache.activemq.broker.region.cursors.StoreQueueCursorJDBCNoDuplicateTest
Tests run: 1, Failures: 0, Errors: 0, Skipped: 0, Time elapsed: 10.783 sec - in org.apache.activemq.broker.region.cursors.StoreQueueCursorJDBCNoDuplicateTest
Running org.apache.activemq.broker.region.cursors.StoreQueueCursorKahaDBNoDuplicateTest
Tests run: 1, Failures: 0, Errors: 0, Skipped: 0, Time elapsed: 2.011 sec - in org.apache.activemq.broker.region.cursors.StoreQueueCursorKahaDBNoDuplicateTest
Running org.apache.activemq.broker.region.cursors.StoreQueueCursorLevelDBNoDuplicateTest
Tests run: 1, Failures: 0, Errors: 0, Skipped: 0, Time elapsed: 2.322 sec - in org.apache.activemq.broker.region.cursors.StoreQueueCursorLevelDBNoDuplicateTest
Running org.apache.activemq.broker.region.cursors.StoreQueueCursorMemoryNoDuplicateTest
Tests run: 1, Failures: 0, Errors: 0, Skipped: 0, Time elapsed: 0.826 sec - in org.apache.activemq.broker.region.cursors.StoreQueueCursorMemoryNoDuplicateTest
Running org.apache.activemq.broker.region.cursors.StoreQueueCursorNoDuplicateTest
Tests run: 1, Failures: 0, Errors: 0, Skipped: 0, Time elapsed: 2.1 sec - in org.apache.activemq.broker.region.cursors.StoreQueueCursorNoDuplicateTest
Running org.apache.activemq.broker.region.cursors.StoreQueueCursorOrderTest
Tests run: 5, Failures: 0, Errors: 0, Skipped: 0, Time elapsed: 9.746 sec - in org.apache.activemq.broker.region.cursors.StoreQueueCursorOrderTest
Running org.apache.activemq.broker.region.group.MessageGroupHashBucketTest
Tests run: 2, Failures: 0, Errors: 0, Skipped: 0, Time elapsed: 0.068 sec - in org.apache.activemq.broker.region.group.MessageGroupHashBucketTest
Running org.apache.activemq.broker.region.group.MessageGroupMapTest
Tests run: 2, Failures: 0, Errors: 0, Skipped: 0, Time elapsed: 0.079 sec - in org.apache.activemq.broker.region.group.MessageGroupMapTest
Running org.apache.activemq.broker.region.group.MessageGroupTest
Tests run: 3, Failures: 0, Errors: 0, Skipped: 0, Time elapsed: 1.961 sec - in org.apache.activemq.broker.region.group.MessageGroupTest
Running org.apache.activemq.broker.scheduler.JmsCronSchedulerTest
Tests run: 2, Failures: 0, Errors: 0, Skipped: 0, Time elapsed: 171.239 sec - in org.apache.activemq.broker.scheduler.JmsCronSchedulerTest
Running org.apache.activemq.broker.scheduler.JmsSchedulerTest
Tests run: 6, Failures: 0, Errors: 0, Skipped: 0, Time elapsed: 108.268 sec - in org.apache.activemq.broker.scheduler.JmsSchedulerTest
Running org.apache.activemq.broker.scheduler.JobSchedulerBrokerShutdownTest
Tests run: 1, Failures: 0, Errors: 0, Skipped: 0, Time elapsed: 11.279 sec - in org.apache.activemq.broker.scheduler.JobSchedulerBrokerShutdownTest
Running org.apache.activemq.broker.scheduler.JobSchedulerManagementTest
Tests run: 7, Failures: 0, Errors: 0, Skipped: 0, Time elapsed: 88.784 sec - in org.apache.activemq.broker.scheduler.JobSchedulerManagementTest
Running org.apache.activemq.broker.scheduler.JobSchedulerStoreCheckpointTest
Tests run: 2, Failures: 0, Errors: 0, Skipped: 0, Time elapsed: 78.992 sec - in org.apache.activemq.broker.scheduler.JobSchedulerStoreCheckpointTest
Running org.apache.activemq.broker.scheduler.JobSchedulerStoreTest
Tests run: 1, Failures: 0, Errors: 0, Skipped: 0, Time elapsed: 21.741 sec - in org.apache.activemq.broker.scheduler.JobSchedulerStoreTest
Running org.apache.activemq.broker.scheduler.JobSchedulerTest
Tests run: 10, Failures: 0, Errors: 0, Skipped: 0, Time elapsed: 111.214 sec - in org.apache.activemq.broker.scheduler.JobSchedulerTest
Running org.apache.activemq.broker.scheduler.JobSchedulerTxTest
Tests run: 2, Failures: 0, Errors: 0, Skipped: 0, Time elapsed: 19.015 sec - in org.apache.activemq.broker.scheduler.JobSchedulerTxTest
Running org.apache.activemq.broker.scheduler.KahaDBSchedulerIndexRebuildTest
Tests run: 2, Failures: 0, Errors: 0, Skipped: 0, Time elapsed: 40.543 sec - in org.apache.activemq.broker.scheduler.KahaDBSchedulerIndexRebuildTest
Running org.apache.activemq.broker.scheduler.KahaDBSchedulerMissingJournalLogsTest
Tests run: 2, Failures: 0, Errors: 0, Skipped: 0, Time elapsed: 12.115 sec - in org.apache.activemq.broker.scheduler.KahaDBSchedulerMissingJournalLogsTest
Running org.apache.activemq.broker.scheduler.LostScheduledMessagesTest
Tests run: 2, Failures: 0, Errors: 0, Skipped: 0, Time elapsed: 37.731 sec - in org.apache.activemq.broker.scheduler.LostScheduledMessagesTest
Running org.apache.activemq.broker.scheduler.ReduceMemoryFootprintTest
Tests run: 2, Failures: 0, Errors: 0, Skipped: 0, Time elapsed: 7.974 sec - in org.apache.activemq.broker.scheduler.ReduceMemoryFootprintTest
Running org.apache.activemq.broker.scheduler.SchedulerDBVersionTest
Tests run: 2, Failures: 0, Errors: 0, Skipped: 1, Time elapsed: 4.495 sec - in org.apache.activemq.broker.scheduler.SchedulerDBVersionTest
Running org.apache.activemq.broker.scheduler.memory.InMemeoryJmsSchedulerTest
Tests run: 6, Failures: 0, Errors: 0, Skipped: 0, Time elapsed: 72.273 sec - in org.apache.activemq.broker.scheduler.memory.InMemeoryJmsSchedulerTest
Running org.apache.activemq.broker.scheduler.memory.InMemoryJmsCronSchedulerTest
Tests run: 2, Failures: 0, Errors: 0, Skipped: 0, Time elapsed: 157.119 sec - in org.apache.activemq.broker.scheduler.memory.InMemoryJmsCronSchedulerTest
Running org.apache.activemq.broker.scheduler.memory.InMemoryJobSchedulerManagementTest
Tests run: 7, Failures: 0, Errors: 0, Skipped: 0, Time elapsed: 76.391 sec - in org.apache.activemq.broker.scheduler.memory.InMemoryJobSchedulerManagementTest
Running org.apache.activemq.broker.scheduler.memory.InMemoryJobSchedulerStoreTest
Tests run: 1, Failures: 0, Errors: 0, Skipped: 0, Time elapsed: 0.523 sec - in org.apache.activemq.broker.scheduler.memory.InMemoryJobSchedulerStoreTest
Running org.apache.activemq.broker.scheduler.memory.InMemoryJobSchedulerTest

Results :

Tests run: 1406, Failures: 0, Errors: 0, Skipped: 2

[JENKINS] Recording test results
[INFO] ------------------------------------------------------------------------
[INFO] Reactor Summary:
[INFO] 
[INFO] ActiveMQ .......................................... SUCCESS [4.181s]
[INFO] ActiveMQ :: Client ................................ SUCCESS [1:40.247s]
[INFO] ActiveMQ :: Openwire Legacy Support ............... SUCCESS [4.471s]
[INFO] ActiveMQ :: JAAS .................................. SUCCESS [41.504s]
[INFO] ActiveMQ :: Broker ................................ SUCCESS [1:29.065s]
[INFO] ActiveMQ :: KahaDB Store .......................... SUCCESS [8:44.586s]
[INFO] ActiveMQ :: STOMP Protocol ........................ SUCCESS [11:50.026s]
[INFO] ActiveMQ :: MQTT Protocol ......................... SUCCESS [22:29.643s]
[INFO] ActiveMQ :: JDBC Store ............................ SUCCESS [9.996s]
[INFO] ActiveMQ :: LevelDB Store ......................... SUCCESS [10:15.923s]
[INFO] ActiveMQ :: Generic JMS Pool ...................... SUCCESS [50.597s]
[INFO] ActiveMQ :: Pool .................................. SUCCESS [6.105s]
[INFO] ActiveMQ :: RA .................................... SUCCESS [2:43.881s]
[INFO] ActiveMQ :: Spring ................................ SUCCESS [1:04.361s]
[INFO] ActiveMQ :: AMQP .................................. SUCCESS [9:10.818s]
[INFO] ActiveMQ :: Console ............................... SUCCESS [7.476s]
[INFO] ActiveMQ :: Partition Management .................. SUCCESS [19.417s]
[INFO] ActiveMQ :: Runtime Configuration ................. SUCCESS [8:51.611s]
[INFO] ActiveMQ :: Tooling ............................... SUCCESS [1.851s]
[INFO] ActiveMQ :: JUnit Rule ............................ SUCCESS [7.786s]
[INFO] ActiveMQ :: Unit Tests ............................ FAILURE [2:03:27.284s]
[INFO] ------------------------------------------------------------------------
[INFO] BUILD FAILURE
[INFO] ------------------------------------------------------------------------
[INFO] Total time: 3:25:26.061s
[INFO] Finished at: Wed May 04 18:48:11 UTC 2016
[INFO] Final Memory: 104M/1044M
[INFO] ------------------------------------------------------------------------
Waiting for Jenkins to finish collecting data
[ERROR] Failed to execute goal org.apache.maven.plugins:maven-surefire-plugin:2.16:test (default-test)
on project activemq-unit-tests: ExecutionException; nested exception is java.util.concurrent.ExecutionException:
java.lang.RuntimeException: The forked VM terminated without saying properly goodbye. VM crash
or System.exit called ?
[ERROR] Command was/bin/sh -c cd <https://builds.apache.org/job/ActiveMQ-Java7-All-UnitTests/ws/activemq-unit-tests>
&& /home/jenkins/jenkins-slave/tools/hudson.model.JDK/JDK_1.7_latest_/jre/bin/java
-Xmx512m -jar <https://builds.apache.org/job/ActiveMQ-Java7-All-UnitTests/ws/activemq-unit-tests/target/surefire/surefirebooter3846372975757697557.jar>
<https://builds.apache.org/job/ActiveMQ-Java7-All-UnitTests/ws/activemq-unit-tests/target/surefire/surefire4814390737740048202tmp>
<https://builds.apache.org/job/ActiveMQ-Java7-All-UnitTests/ws/activemq-unit-tests/target/surefire/surefire_3063601717868096643043tmp>
[ERROR] -> [Help 1]
org.apache.maven.lifecycle.LifecycleExecutionException: Failed to execute goal org.apache.maven.plugins:maven-surefire-plugin:2.16:test
(default-test) on project activemq-unit-tests: ExecutionException; nested exception is java.util.concurrent.ExecutionException:
java.lang.RuntimeException: The forked VM terminated without saying properly goodbye. VM crash
or System.exit called ?
Command was/bin/sh -c cd <https://builds.apache.org/job/ActiveMQ-Java7-All-UnitTests/ws/activemq-unit-tests>
&& /home/jenkins/jenkins-slave/tools/hudson.model.JDK/JDK_1.7_latest_/jre/bin/java
-Xmx512m -jar <https://builds.apache.org/job/ActiveMQ-Java7-All-UnitTests/ws/activemq-unit-tests/target/surefire/surefirebooter3846372975757697557.jar>
<https://builds.apache.org/job/ActiveMQ-Java7-All-UnitTests/ws/activemq-unit-tests/target/surefire/surefire4814390737740048202tmp>
<https://builds.apache.org/job/ActiveMQ-Java7-All-UnitTests/ws/activemq-unit-tests/target/surefire/surefire_3063601717868096643043tmp>
	at org.apache.maven.lifecycle.internal.MojoExecutor.execute(MojoExecutor.java:213)
	at org.apache.maven.lifecycle.internal.MojoExecutor.execute(MojoExecutor.java:153)
	at org.apache.maven.lifecycle.internal.MojoExecutor.execute(MojoExecutor.java:145)
	at org.apache.maven.lifecycle.internal.LifecycleModuleBuilder.buildProject(LifecycleModuleBuilder.java:84)
	at org.apache.maven.lifecycle.internal.LifecycleModuleBuilder.buildProject(LifecycleModuleBuilder.java:59)
	at org.apache.maven.lifecycle.internal.LifecycleStarter.singleThreadedBuild(LifecycleStarter.java:183)
	at org.apache.maven.lifecycle.internal.LifecycleStarter.execute(LifecycleStarter.java:161)
	at org.apache.maven.DefaultMaven.doExecute(DefaultMaven.java:320)
	at org.apache.maven.DefaultMaven.execute(DefaultMaven.java:156)
	at org.jvnet.hudson.maven3.launcher.Maven3Launcher.main(Maven3Launcher.java:117)
	at sun.reflect.NativeMethodAccessorImpl.invoke0(Native Method)
	at sun.reflect.NativeMethodAccessorImpl.invoke(NativeMethodAccessorImpl.java:57)
	at sun.reflect.DelegatingMethodAccessorImpl.invoke(DelegatingMethodAccessorImpl.java:43)
	at java.lang.reflect.Method.invoke(Method.java:606)
	at org.codehaus.plexus.classworlds.launcher.Launcher.launchStandard(Launcher.java:329)
	at org.codehaus.plexus.classworlds.launcher.Launcher.launch(Launcher.java:239)
	at org.jvnet.hudson.maven3.agent.Maven3Main.launch(Maven3Main.java:181)
	at sun.reflect.NativeMethodAccessorImpl.invoke0(Native Method)
	at sun.reflect.NativeMethodAccessorImpl.invoke(NativeMethodAccessorImpl.java:57)
	at sun.reflect.DelegatingMethodAccessorImpl.invoke(DelegatingMethodAccessorImpl.java:43)
	at java.lang.reflect.Method.invoke(Method.java:606)
	at hudson.maven.Maven3Builder.call(Maven3Builder.java:136)
	at hudson.maven.Maven3Builder.call(Maven3Builder.java:71)
	at hudson.remoting.UserRequest.perform(UserRequest.java:120)
	at hudson.remoting.UserRequest.perform(UserRequest.java:48)
	at hudson.remoting.Request$2.run(Request.java:326)
	at hudson.remoting.InterceptingExecutorService$1.call(InterceptingExecutorService.java:68)
	at java.util.concurrent.FutureTask.run(FutureTask.java:262)
	at java.util.concurrent.ThreadPoolExecutor.runWorker(ThreadPoolExecutor.java:1145)
	at java.util.concurrent.ThreadPoolExecutor$Worker.run(ThreadPoolExecutor.java:615)
	at java.lang.Thread.run(Thread.java:745)
Caused by: org.apache.maven.plugin.MojoFailureException: ExecutionException; nested exception
is java.util.concurrent.ExecutionException: java.lang.RuntimeException: The forked VM terminated
without saying properly goodbye. VM crash or System.exit called ?
Command was/bin/sh -c cd <https://builds.apache.org/job/ActiveMQ-Java7-All-UnitTests/ws/activemq-unit-tests>
&& /home/jenkins/jenkins-slave/tools/hudson.model.JDK/JDK_1.7_latest_/jre/bin/java
-Xmx512m -jar <https://builds.apache.org/job/ActiveMQ-Java7-All-UnitTests/ws/activemq-unit-tests/target/surefire/surefirebooter3846372975757697557.jar>
<https://builds.apache.org/job/ActiveMQ-Java7-All-UnitTests/ws/activemq-unit-tests/target/surefire/surefire4814390737740048202tmp>
<https://builds.apache.org/job/ActiveMQ-Java7-All-UnitTests/ws/activemq-unit-tests/target/surefire/surefire_3063601717868096643043tmp>
	at org.apache.maven.plugin.surefire.SurefirePlugin.assertNoException(SurefirePlugin.java:198)
	at org.apache.maven.plugin.surefire.SurefirePlugin.handleSummary(SurefirePlugin.java:188)
	at org.apache.maven.plugin.surefire.AbstractSurefireMojo.executeAfterPreconditionsChecked(AbstractSurefireMojo.java:852)
	at org.apache.maven.plugin.surefire.AbstractSurefireMojo.execute(AbstractSurefireMojo.java:720)
	at org.apache.maven.plugin.DefaultBuildPluginManager.executeMojo(DefaultBuildPluginManager.java:101)
	at org.apache.maven.lifecycle.internal.MojoExecutor.execute(MojoExecutor.java:209)
	... 30 more
Caused by: org.apache.maven.surefire.booter.SurefireBooterForkException: ExecutionException;
nested exception is java.util.concurrent.ExecutionException: java.lang.RuntimeException: The
forked VM terminated without saying properly goodbye. VM crash or System.exit called ?
Command was/bin/sh -c cd <https://builds.apache.org/job/ActiveMQ-Java7-All-UnitTests/ws/activemq-unit-tests>
&& /home/jenkins/jenkins-slave/tools/hudson.model.JDK/JDK_1.7_latest_/jre/bin/java
-Xmx512m -jar <https://builds.apache.org/job/ActiveMQ-Java7-All-UnitTests/ws/activemq-unit-tests/target/surefire/surefirebooter3846372975757697557.jar>
<https://builds.apache.org/job/ActiveMQ-Java7-All-UnitTests/ws/activemq-unit-tests/target/surefire/surefire4814390737740048202tmp>
<https://builds.apache.org/job/ActiveMQ-Java7-All-UnitTests/ws/activemq-unit-tests/target/surefire/surefire_3063601717868096643043tmp>
	at org.apache.maven.plugin.surefire.booterclient.ForkStarter.runSuitesForkPerTestSet(ForkStarter.java:316)
	at org.apache.maven.plugin.surefire.booterclient.ForkStarter.run(ForkStarter.java:169)
	at org.apache.maven.plugin.surefire.AbstractSurefireMojo.executeProvider(AbstractSurefireMojo.java:958)
	at org.apache.maven.plugin.surefire.AbstractSurefireMojo.executeAfterPreconditionsChecked(AbstractSurefireMojo.java:822)
	... 33 more
Caused by: java.util.concurrent.ExecutionException: java.lang.RuntimeException: The forked
VM terminated without saying properly goodbye. VM crash or System.exit called ?
Command was/bin/sh -c cd <https://builds.apache.org/job/ActiveMQ-Java7-All-UnitTests/ws/activemq-unit-tests>
&& /home/jenkins/jenkins-slave/tools/hudson.model.JDK/JDK_1.7_latest_/jre/bin/java
-Xmx512m -jar <https://builds.apache.org/job/ActiveMQ-Java7-All-UnitTests/ws/activemq-unit-tests/target/surefire/surefirebooter3846372975757697557.jar>
<https://builds.apache.org/job/ActiveMQ-Java7-All-UnitTests/ws/activemq-unit-tests/target/surefire/surefire4814390737740048202tmp>
<https://builds.apache.org/job/ActiveMQ-Java7-All-UnitTests/ws/activemq-unit-tests/target/surefire/surefire_3063601717868096643043tmp>
	at java.util.concurrent.FutureTask.report(FutureTask.java:122)
	at java.util.concurrent.FutureTask.get(FutureTask.java:188)
	at org.apache.maven.plugin.surefire.booterclient.ForkStarter.runSuitesForkPerTestSet(ForkStarter.java:300)
	... 36 more
Caused by: java.lang.RuntimeException: The forked VM terminated without saying properly goodbye.
VM crash or System.exit called ?
Command was/bin/sh -c cd <https://builds.apache.org/job/ActiveMQ-Java7-All-UnitTests/ws/activemq-unit-tests>
&& /home/jenkins/jenkins-slave/tools/hudson.model.JDK/JDK_1.7_latest_/jre/bin/java
-Xmx512m -jar <https://builds.apache.org/job/ActiveMQ-Java7-All-UnitTests/ws/activemq-unit-tests/target/surefire/surefirebooter3846372975757697557.jar>
<https://builds.apache.org/job/ActiveMQ-Java7-All-UnitTests/ws/activemq-unit-tests/target/surefire/surefire4814390737740048202tmp>
<https://builds.apache.org/job/ActiveMQ-Java7-All-UnitTests/ws/activemq-unit-tests/target/surefire/surefire_3063601717868096643043tmp>
	at org.apache.maven.plugin.surefire.booterclient.ForkStarter.fork(ForkStarter.java:485)
	at org.apache.maven.plugin.surefire.booterclient.ForkStarter.fork(ForkStarter.java:352)
	at org.apache.maven.plugin.surefire.booterclient.ForkStarter.access$300(ForkStarter.java:85)
	at org.apache.maven.plugin.surefire.booterclient.ForkStarter$2.call(ForkStarter.java:288)
	at org.apache.maven.plugin.surefire.booterclient.ForkStarter$2.call(ForkStarter.java:283)
	... 4 more
[ERROR] 
[ERROR] Re-run Maven using the -X switch to enable full debug logging.
[ERROR] 
[ERROR] For more information about the errors and possible solutions, please read the following
articles:
[ERROR] [Help 1] http://cwiki.apache.org/confluence/display/MAVEN/MojoFailureException
[ERROR] 
[ERROR] After correcting the problems, you can resume the build with the command
[ERROR]   mvn <goals> -rf :activemq-unit-tests
[JENKINS] Archiving <https://builds.apache.org/job/ActiveMQ-Java7-All-UnitTests/ws/activemq-unit-tests/pom.xml>
to org.apache.activemq/activemq-unit-tests/5.14.0-SNAPSHOT/activemq-unit-tests-5.14.0-SNAPSHOT.pom
Compressed 71.40 KB of artifacts by 44.8% relative to #407
[JENKINS] Archiving <https://builds.apache.org/job/ActiveMQ-Java7-All-UnitTests/ws/activemq-openwire-legacy/pom.xml>
to org.apache.activemq/activemq-openwire-legacy/5.14.0-SNAPSHOT/activemq-openwire-legacy-5.14.0-SNAPSHOT.pom
[JENKINS] Archiving <https://builds.apache.org/job/ActiveMQ-Java7-All-UnitTests/ws/activemq-openwire-legacy/target/activemq-openwire-legacy-5.14.0-SNAPSHOT.jar>
to org.apache.activemq/activemq-openwire-legacy/5.14.0-SNAPSHOT/activemq-openwire-legacy-5.14.0-SNAPSHOT.jar
[JENKINS] Archiving <https://builds.apache.org/job/ActiveMQ-Java7-All-UnitTests/ws/activemq-jdbc-store/pom.xml>
to org.apache.activemq/activemq-jdbc-store/5.14.0-SNAPSHOT/activemq-jdbc-store-5.14.0-SNAPSHOT.pom
[JENKINS] Archiving <https://builds.apache.org/job/ActiveMQ-Java7-All-UnitTests/ws/activemq-jdbc-store/target/activemq-jdbc-store-5.14.0-SNAPSHOT.jar>
to org.apache.activemq/activemq-jdbc-store/5.14.0-SNAPSHOT/activemq-jdbc-store-5.14.0-SNAPSHOT.jar
[JENKINS] Archiving <https://builds.apache.org/job/ActiveMQ-Java7-All-UnitTests/ws/activemq-amqp/pom.xml>
to org.apache.activemq/activemq-amqp/5.14.0-SNAPSHOT/activemq-amqp-5.14.0-SNAPSHOT.pom
[JENKINS] Archiving <https://builds.apache.org/job/ActiveMQ-Java7-All-UnitTests/ws/activemq-amqp/target/activemq-amqp-5.14.0-SNAPSHOT.jar>
to org.apache.activemq/activemq-amqp/5.14.0-SNAPSHOT/activemq-amqp-5.14.0-SNAPSHOT.jar
[JENKINS] Archiving <https://builds.apache.org/job/ActiveMQ-Java7-All-UnitTests/ws/activemq-jms-pool/pom.xml>
to org.apache.activemq/activemq-jms-pool/5.14.0-SNAPSHOT/activemq-jms-pool-5.14.0-SNAPSHOT.pom
[JENKINS] Archiving <https://builds.apache.org/job/ActiveMQ-Java7-All-UnitTests/ws/activemq-jms-pool/target/activemq-jms-pool-5.14.0-SNAPSHOT.jar>
to org.apache.activemq/activemq-jms-pool/5.14.0-SNAPSHOT/activemq-jms-pool-5.14.0-SNAPSHOT.jar
[JENKINS] Archiving <https://builds.apache.org/job/ActiveMQ-Java7-All-UnitTests/ws/activemq-tooling/activemq-junit/pom.xml>
to org.apache.activemq.tooling/activemq-junit/5.14.0-SNAPSHOT/activemq-junit-5.14.0-SNAPSHOT.pom
[JENKINS] Archiving <https://builds.apache.org/job/ActiveMQ-Java7-All-UnitTests/ws/activemq-tooling/activemq-junit/target/activemq-junit-5.14.0-SNAPSHOT.jar>
to org.apache.activemq.tooling/activemq-junit/5.14.0-SNAPSHOT/activemq-junit-5.14.0-SNAPSHOT.jar
[JENKINS] Archiving <https://builds.apache.org/job/ActiveMQ-Java7-All-UnitTests/ws/activemq-runtime-config/pom.xml>
to org.apache.activemq/activemq-runtime-config/5.14.0-SNAPSHOT/activemq-runtime-config-5.14.0-SNAPSHOT.pom
[JENKINS] Archiving <https://builds.apache.org/job/ActiveMQ-Java7-All-UnitTests/ws/activemq-runtime-config/target/activemq-runtime-config-5.14.0-SNAPSHOT.jar>
to org.apache.activemq/activemq-runtime-config/5.14.0-SNAPSHOT/activemq-runtime-config-5.14.0-SNAPSHOT.jar
[JENKINS] Archiving <https://builds.apache.org/job/ActiveMQ-Java7-All-UnitTests/ws/activemq-pool/pom.xml>
to org.apache.activemq/activemq-pool/5.14.0-SNAPSHOT/activemq-pool-5.14.0-SNAPSHOT.pom
[JENKINS] Archiving <https://builds.apache.org/job/ActiveMQ-Java7-All-UnitTests/ws/activemq-pool/target/activemq-pool-5.14.0-SNAPSHOT.jar>
to org.apache.activemq/activemq-pool/5.14.0-SNAPSHOT/activemq-pool-5.14.0-SNAPSHOT.jar
[JENKINS] Archiving <https://builds.apache.org/job/ActiveMQ-Java7-All-UnitTests/ws/activemq-stomp/pom.xml>
to org.apache.activemq/activemq-stomp/5.14.0-SNAPSHOT/activemq-stomp-5.14.0-SNAPSHOT.pom
[JENKINS] Archiving <https://builds.apache.org/job/ActiveMQ-Java7-All-UnitTests/ws/activemq-stomp/target/activemq-stomp-5.14.0-SNAPSHOT.jar>
to org.apache.activemq/activemq-stomp/5.14.0-SNAPSHOT/activemq-stomp-5.14.0-SNAPSHOT.jar
[JENKINS] Archiving <https://builds.apache.org/job/ActiveMQ-Java7-All-UnitTests/ws/activemq-mqtt/pom.xml>
to org.apache.activemq/activemq-mqtt/5.14.0-SNAPSHOT/activemq-mqtt-5.14.0-SNAPSHOT.pom
[JENKINS] Archiving <https://builds.apache.org/job/ActiveMQ-Java7-All-UnitTests/ws/activemq-mqtt/target/activemq-mqtt-5.14.0-SNAPSHOT.jar>
to org.apache.activemq/activemq-mqtt/5.14.0-SNAPSHOT/activemq-mqtt-5.14.0-SNAPSHOT.jar
[JENKINS] Archiving <https://builds.apache.org/job/ActiveMQ-Java7-All-UnitTests/ws/activemq-console/pom.xml>
to org.apache.activemq/activemq-console/5.14.0-SNAPSHOT/activemq-console-5.14.0-SNAPSHOT.pom
[JENKINS] Archiving <https://builds.apache.org/job/ActiveMQ-Java7-All-UnitTests/ws/activemq-console/target/activemq-console-5.14.0-SNAPSHOT.jar>
to org.apache.activemq/activemq-console/5.14.0-SNAPSHOT/activemq-console-5.14.0-SNAPSHOT.jar
Tests run: 10, Failures: 0, Errors: 0, Skipped: 0, Time elapsed: 63.409 sec - in org.apache.activemq.broker.scheduler.memory.InMemoryJobSchedulerTest
[JENKINS] Archiving <https://builds.apache.org/job/ActiveMQ-Java7-All-UnitTests/ws/activemq-client/pom.xml>
to org.apache.activemq/activemq-client/5.14.0-SNAPSHOT/activemq-client-5.14.0-SNAPSHOT.pom
[JENKINS] Archiving <https://builds.apache.org/job/ActiveMQ-Java7-All-UnitTests/ws/activemq-client/target/activemq-client-5.14.0-SNAPSHOT.jar>
to org.apache.activemq/activemq-client/5.14.0-SNAPSHOT/activemq-client-5.14.0-SNAPSHOT.jar
[JENKINS] Archiving <https://builds.apache.org/job/ActiveMQ-Java7-All-UnitTests/ws/pom.xml>
to org.apache.activemq/activemq-parent/5.14.0-SNAPSHOT/activemq-parent-5.14.0-SNAPSHOT.pom
Compressed 59.36 KB of artifacts by 53.9% relative to #407
[JENKINS] Archiving <https://builds.apache.org/job/ActiveMQ-Java7-All-UnitTests/ws/activemq-broker/pom.xml>
to org.apache.activemq/activemq-broker/5.14.0-SNAPSHOT/activemq-broker-5.14.0-SNAPSHOT.pom
[JENKINS] Archiving <https://builds.apache.org/job/ActiveMQ-Java7-All-UnitTests/ws/activemq-broker/target/activemq-broker-5.14.0-SNAPSHOT.jar>
to org.apache.activemq/activemq-broker/5.14.0-SNAPSHOT/activemq-broker-5.14.0-SNAPSHOT.jar
[JENKINS] Archiving <https://builds.apache.org/job/ActiveMQ-Java7-All-UnitTests/ws/activemq-broker/target/activemq-broker-5.14.0-SNAPSHOT-tests.jar>
to org.apache.activemq/activemq-broker/5.14.0-SNAPSHOT/activemq-broker-5.14.0-SNAPSHOT-tests.jar
[JENKINS] Archiving <https://builds.apache.org/job/ActiveMQ-Java7-All-UnitTests/ws/activemq-ra/pom.xml>
to org.apache.activemq/activemq-ra/5.14.0-SNAPSHOT/activemq-ra-5.14.0-SNAPSHOT.pom
[JENKINS] Archiving <https://builds.apache.org/job/ActiveMQ-Java7-All-UnitTests/ws/activemq-ra/target/activemq-ra-5.14.0-SNAPSHOT.jar>
to org.apache.activemq/activemq-ra/5.14.0-SNAPSHOT/activemq-ra-5.14.0-SNAPSHOT.jar
[JENKINS] Archiving <https://builds.apache.org/job/ActiveMQ-Java7-All-UnitTests/ws/activemq-ra/target/xbean/activemq-ra.xsd>
to org.apache.activemq/activemq-ra/5.14.0-SNAPSHOT/activemq-ra-5.14.0-SNAPSHOT.xsd
[JENKINS] Archiving <https://builds.apache.org/job/ActiveMQ-Java7-All-UnitTests/ws/activemq-ra/target/xbean/activemq-ra.xsd.html>
to org.apache.activemq/activemq-ra/5.14.0-SNAPSHOT/activemq-ra-5.14.0-SNAPSHOT-schema.html
[JENKINS] Archiving <https://builds.apache.org/job/ActiveMQ-Java7-All-UnitTests/ws/activemq-ra/target/xbean/activemq-ra.xsd.html>
to org.apache.activemq/activemq-ra/5.14.0-SNAPSHOT/activemq-ra-5.14.0-SNAPSHOT.xsd.html
[JENKINS] Archiving <https://builds.apache.org/job/ActiveMQ-Java7-All-UnitTests/ws/activemq-spring/pom.xml>
to org.apache.activemq/activemq-spring/5.14.0-SNAPSHOT/activemq-spring-5.14.0-SNAPSHOT.pom
[JENKINS] Archiving <https://builds.apache.org/job/ActiveMQ-Java7-All-UnitTests/ws/activemq-spring/target/activemq-spring-5.14.0-SNAPSHOT.jar>
to org.apache.activemq/activemq-spring/5.14.0-SNAPSHOT/activemq-spring-5.14.0-SNAPSHOT.jar
[JENKINS] Archiving <https://builds.apache.org/job/ActiveMQ-Java7-All-UnitTests/ws/activemq-spring/target/classes/activemq.xsd>
to org.apache.activemq/activemq-spring/5.14.0-SNAPSHOT/activemq-spring-5.14.0-SNAPSHOT.xsd
[JENKINS] Archiving <https://builds.apache.org/job/ActiveMQ-Java7-All-UnitTests/ws/activemq-spring/target/classes/activemq.xsd.html>
to org.apache.activemq/activemq-spring/5.14.0-SNAPSHOT/activemq-spring-5.14.0-SNAPSHOT-schema.html
Compressed 893.04 KB of artifacts by 75.2% relative to #407
[JENKINS] Archiving <https://builds.apache.org/job/ActiveMQ-Java7-All-UnitTests/ws/activemq-kahadb-store/pom.xml>
to org.apache.activemq/activemq-kahadb-store/5.14.0-SNAPSHOT/activemq-kahadb-store-5.14.0-SNAPSHOT.pom
[JENKINS] Archiving <https://builds.apache.org/job/ActiveMQ-Java7-All-UnitTests/ws/activemq-kahadb-store/target/activemq-kahadb-store-5.14.0-SNAPSHOT.jar>
to org.apache.activemq/activemq-kahadb-store/5.14.0-SNAPSHOT/activemq-kahadb-store-5.14.0-SNAPSHOT.jar
[JENKINS] Archiving <https://builds.apache.org/job/ActiveMQ-Java7-All-UnitTests/ws/activemq-jaas/pom.xml>
to org.apache.activemq/activemq-jaas/5.14.0-SNAPSHOT/activemq-jaas-5.14.0-SNAPSHOT.pom
[JENKINS] Archiving <https://builds.apache.org/job/ActiveMQ-Java7-All-UnitTests/ws/activemq-jaas/target/activemq-jaas-5.14.0-SNAPSHOT.jar>
to org.apache.activemq/activemq-jaas/5.14.0-SNAPSHOT/activemq-jaas-5.14.0-SNAPSHOT.jar
[JENKINS] Archiving <https://builds.apache.org/job/ActiveMQ-Java7-All-UnitTests/ws/activemq-tooling/pom.xml>
to org.apache.activemq.tooling/activemq-tooling/5.14.0-SNAPSHOT/activemq-tooling-5.14.0-SNAPSHOT.pom
[JENKINS] Archiving <https://builds.apache.org/job/ActiveMQ-Java7-All-UnitTests/ws/activemq-partition/pom.xml>
to org.apache.activemq/activemq-partition/5.14.0-SNAPSHOT/activemq-partition-5.14.0-SNAPSHOT.pom
[JENKINS] Archiving <https://builds.apache.org/job/ActiveMQ-Java7-All-UnitTests/ws/activemq-partition/target/activemq-partition-5.14.0-SNAPSHOT.jar>
to org.apache.activemq/activemq-partition/5.14.0-SNAPSHOT/activemq-partition-5.14.0-SNAPSHOT.jar
[JENKINS] Archiving <https://builds.apache.org/job/ActiveMQ-Java7-All-UnitTests/ws/activemq-leveldb-store/pom.xml>
to org.apache.activemq/activemq-leveldb-store/5.14.0-SNAPSHOT/activemq-leveldb-store-5.14.0-SNAPSHOT.pom
[JENKINS] Archiving <https://builds.apache.org/job/ActiveMQ-Java7-All-UnitTests/ws/activemq-leveldb-store/target/activemq-leveldb-store-5.14.0-SNAPSHOT.jar>
to org.apache.activemq/activemq-leveldb-store/5.14.0-SNAPSHOT/activemq-leveldb-store-5.14.0-SNAPSHOT.jar
[locks-and-latches] Releasing all the locks
[locks-and-latches] All the locks released
channel stopped

Mime
View raw message