activemq-commits mailing list archives

Site index · List index
Message view « Date » · « Thread »
Top « Date » · « Thread »
From Apache Jenkins Server <jenk...@builds.apache.org>
Subject Build failed in Jenkins: ActiveMQ-Artemis-Master #1052
Date Thu, 04 May 2017 15:48:53 GMT
See <https://builds.apache.org/job/ActiveMQ-Artemis-Master/1052/display/redirect?page=changes>

Changes:

[jbertram] Remove dangling git-link

------------------------------------------
[...truncated 3.16 MB...]
[main] 15:48:34,965 INFO  [org.apache.activemq.artemis.jms.tests] Got message 11
[main] 15:48:34,965 INFO  [org.apache.activemq.artemis.jms.tests] Got message 12
[main] 15:48:34,965 INFO  [org.apache.activemq.artemis.jms.tests] Got message 13
[main] 15:48:34,965 INFO  [org.apache.activemq.artemis.jms.tests] Got message 14
[main] 15:48:34,965 INFO  [org.apache.activemq.artemis.jms.tests] Got message 15
[main] 15:48:34,966 INFO  [org.apache.activemq.artemis.jms.tests] Got message 16
[main] 15:48:34,966 INFO  [org.apache.activemq.artemis.jms.tests] Got message 17
[main] 15:48:34,966 INFO  [org.apache.activemq.artemis.jms.tests] Got message 18
[main] 15:48:34,966 INFO  [org.apache.activemq.artemis.jms.tests] Got message 19
[main] 15:48:34,966 INFO  [org.apache.activemq.artemis.jms.tests] Got message 20
[main] 15:48:34,966 INFO  [org.apache.activemq.artemis.jms.tests] Got message 21
[main] 15:48:34,966 INFO  [org.apache.activemq.artemis.jms.tests] Got message 22
[main] 15:48:34,966 INFO  [org.apache.activemq.artemis.jms.tests] Got message 23
[main] 15:48:34,966 INFO  [org.apache.activemq.artemis.jms.tests] Got message 24
[main] 15:48:34,966 INFO  [org.apache.activemq.artemis.jms.tests] Got message 25
[main] 15:48:34,966 INFO  [org.apache.activemq.artemis.jms.tests] Got message 26
[main] 15:48:34,966 INFO  [org.apache.activemq.artemis.jms.tests] Got message 27
[main] 15:48:34,966 INFO  [org.apache.activemq.artemis.jms.tests] Got message 28
[main] 15:48:34,966 INFO  [org.apache.activemq.artemis.jms.tests] Got message 29
[main] 15:48:34,966 INFO  [org.apache.activemq.artemis.jms.tests] Got message 30
[main] 15:48:34,966 INFO  [org.apache.activemq.artemis.jms.tests] Got message 31
[main] 15:48:34,966 INFO  [org.apache.activemq.artemis.jms.tests] Got message 32
[main] 15:48:34,966 INFO  [org.apache.activemq.artemis.jms.tests] Got message 33
[main] 15:48:34,966 INFO  [org.apache.activemq.artemis.jms.tests] Got message 34
[main] 15:48:34,966 INFO  [org.apache.activemq.artemis.jms.tests] Got message 35
[main] 15:48:34,966 INFO  [org.apache.activemq.artemis.jms.tests] Got message 36
[main] 15:48:34,966 INFO  [org.apache.activemq.artemis.jms.tests] Got message 37
[main] 15:48:34,966 INFO  [org.apache.activemq.artemis.jms.tests] Got message 38
[main] 15:48:34,966 INFO  [org.apache.activemq.artemis.jms.tests] Got message 39
[main] 15:48:34,966 INFO  [org.apache.activemq.artemis.jms.tests] Got message 40
[main] 15:48:34,967 INFO  [org.apache.activemq.artemis.jms.tests] Got message 41
[main] 15:48:34,967 INFO  [org.apache.activemq.artemis.jms.tests] Got message 42
[main] 15:48:34,967 INFO  [org.apache.activemq.artemis.jms.tests] Got message 43
[main] 15:48:34,967 INFO  [org.apache.activemq.artemis.jms.tests] Got message 44
[main] 15:48:34,967 INFO  [org.apache.activemq.artemis.jms.tests] Got message 45
[main] 15:48:34,967 INFO  [org.apache.activemq.artemis.jms.tests] Got message 46
[main] 15:48:34,967 INFO  [org.apache.activemq.artemis.jms.tests] Got message 47
[main] 15:48:34,967 INFO  [org.apache.activemq.artemis.jms.tests] Got message 48
[main] 15:48:34,967 INFO  [org.apache.activemq.artemis.jms.tests] Got message 49
[main] 15:48:34,967 INFO  [org.apache.activemq.artemis.jms.tests] Got message 50
[main] 15:48:34,967 INFO  [org.apache.activemq.artemis.jms.tests] Got message 51
[main] 15:48:34,967 INFO  [org.apache.activemq.artemis.jms.tests] Got message 52
[main] 15:48:34,967 INFO  [org.apache.activemq.artemis.jms.tests] Got message 53
[main] 15:48:34,967 INFO  [org.apache.activemq.artemis.jms.tests] Got message 54
[main] 15:48:34,967 INFO  [org.apache.activemq.artemis.jms.tests] Got message 55
[main] 15:48:34,967 INFO  [org.apache.activemq.artemis.jms.tests] Got message 56
[main] 15:48:34,967 INFO  [org.apache.activemq.artemis.jms.tests] Got message 57
[main] 15:48:34,967 INFO  [org.apache.activemq.artemis.jms.tests] Got message 58
[main] 15:48:34,967 INFO  [org.apache.activemq.artemis.jms.tests] Got message 59
[main] 15:48:34,967 INFO  [org.apache.activemq.artemis.jms.tests] Got message 60
[main] 15:48:34,967 INFO  [org.apache.activemq.artemis.jms.tests] Got message 61
[main] 15:48:34,967 INFO  [org.apache.activemq.artemis.jms.tests] Got message 62
[main] 15:48:34,967 INFO  [org.apache.activemq.artemis.jms.tests] Got message 63
[main] 15:48:34,967 INFO  [org.apache.activemq.artemis.jms.tests] Got message 64
[main] 15:48:34,967 INFO  [org.apache.activemq.artemis.jms.tests] Got message 65
[main] 15:48:34,968 INFO  [org.apache.activemq.artemis.jms.tests] Got message 66
[main] 15:48:34,968 INFO  [org.apache.activemq.artemis.jms.tests] Got message 67
[main] 15:48:34,968 INFO  [org.apache.activemq.artemis.jms.tests] Got message 68
[main] 15:48:34,968 INFO  [org.apache.activemq.artemis.jms.tests] Got message 69
[main] 15:48:34,968 INFO  [org.apache.activemq.artemis.jms.tests] Got message 70
[main] 15:48:34,968 INFO  [org.apache.activemq.artemis.jms.tests] Got message 71
[main] 15:48:34,968 INFO  [org.apache.activemq.artemis.jms.tests] Got message 72
[main] 15:48:34,968 INFO  [org.apache.activemq.artemis.jms.tests] Got message 73
[main] 15:48:34,968 INFO  [org.apache.activemq.artemis.jms.tests] Got message 74
[main] 15:48:34,968 INFO  [org.apache.activemq.artemis.jms.tests] Got message 75
[main] 15:48:34,968 INFO  [org.apache.activemq.artemis.jms.tests] Got message 76
[main] 15:48:34,968 INFO  [org.apache.activemq.artemis.jms.tests] Got message 77
[main] 15:48:34,968 INFO  [org.apache.activemq.artemis.jms.tests] Got message 78
[main] 15:48:34,968 INFO  [org.apache.activemq.artemis.jms.tests] Got message 79
[main] 15:48:34,968 INFO  [org.apache.activemq.artemis.jms.tests] Got message 80
[main] 15:48:34,968 INFO  [org.apache.activemq.artemis.jms.tests] Got message 81
[main] 15:48:34,968 INFO  [org.apache.activemq.artemis.jms.tests] Got message 82
[main] 15:48:34,968 INFO  [org.apache.activemq.artemis.jms.tests] Got message 83
[main] 15:48:34,968 INFO  [org.apache.activemq.artemis.jms.tests] Got message 84
[main] 15:48:34,968 INFO  [org.apache.activemq.artemis.jms.tests] Got message 85
[main] 15:48:34,968 INFO  [org.apache.activemq.artemis.jms.tests] Got message 86
[main] 15:48:34,968 INFO  [org.apache.activemq.artemis.jms.tests] Got message 87
[main] 15:48:34,968 INFO  [org.apache.activemq.artemis.jms.tests] Got message 88
[main] 15:48:34,968 INFO  [org.apache.activemq.artemis.jms.tests] Got message 89
[main] 15:48:34,968 INFO  [org.apache.activemq.artemis.jms.tests] Got message 90
[main] 15:48:34,968 INFO  [org.apache.activemq.artemis.jms.tests] Got message 91
[main] 15:48:34,968 INFO  [org.apache.activemq.artemis.jms.tests] Got message 92
[main] 15:48:34,968 INFO  [org.apache.activemq.artemis.jms.tests] Got message 93
[main] 15:48:34,969 INFO  [org.apache.activemq.artemis.jms.tests] Got message 94
[main] 15:48:34,969 INFO  [org.apache.activemq.artemis.jms.tests] Got message 95
[main] 15:48:34,969 INFO  [org.apache.activemq.artemis.jms.tests] Got message 96
[main] 15:48:34,969 INFO  [org.apache.activemq.artemis.jms.tests] Got message 97
[main] 15:48:34,969 INFO  [org.apache.activemq.artemis.jms.tests] Got message 98
[main] 15:48:34,969 INFO  [org.apache.activemq.artemis.jms.tests] Got message 99
[main] 15:48:34,992 INFO  [org.apache.activemq.artemis.jms.tests] #*#*# Finished test: testManyQueue()...
[main] 15:48:34,993 INFO  [org.apache.activemq.artemis.jms.tests] #*#*# Starting test: testManyTopic()...
[main] 15:48:35,528 INFO  [org.apache.activemq.artemis.jms.tests] #*#*# Finished test: testManyTopic()...
[main] 15:48:35,529 INFO  [org.apache.activemq.artemis.jms.tests] #*#*# Starting test: testManyConsumersWithDifferentSelectors()...
[main] 15:48:36,547 INFO  [org.apache.activemq.artemis.jms.tests] #*#*# Finished test: testManyConsumersWithDifferentSelectors()...
[main] 15:48:36,548 INFO  [org.apache.activemq.artemis.jms.tests] #*#*# Starting test: testDeliveryModeOnSelector()...
[main] 15:48:37,559 INFO  [org.apache.activemq.artemis.jms.tests] #*#*# Finished test: testDeliveryModeOnSelector()...
[main] 15:48:37,607 INFO  [org.apache.activemq.artemis.core.server] AMQ221002: Apache ActiveMQ
Artemis Message Broker version 2.1.0-SNAPSHOT [1dfe282b-30e1-11e7-aecd-90b11c3893f4] stopped,
uptime 8.903 seconds
Tests run: 15, Failures: 0, Errors: 0, Skipped: 0, Time elapsed: 8.915 sec - in org.apache.activemq.artemis.jms.tests.selector.SelectorTest
Running org.apache.activemq.artemis.jms.tests.util.JNDIUtilTest
[main] 15:48:37,610 INFO  [org.apache.activemq.artemis.jms.tests] #*#*# Starting test: testRebind_1()...
[main] 15:48:37,612 INFO  [org.apache.activemq.artemis.jms.tests] Deleted dir: <https://builds.apache.org/job/ActiveMQ-Artemis-Master/ws/tests/jms-tests/target/data>
deleted: true
[main] 15:48:37,628 INFO  [org.apache.activemq.artemis.core.server] AMQ221000: live Message
Broker is starting with configuration Broker Configuration (clustered=false,journalDirectory=target/data/journal,bindingsDirectory=target/data/binding,largeMessagesDirectory=target/data/largemessages,pagingDirectory=target/data/paging)
[main] 15:48:37,628 INFO  [org.apache.activemq.artemis.core.server] AMQ221012: Using AIO Journal
[main] 15:48:37,629 INFO  [org.apache.activemq.artemis.core.server] AMQ221043: Protocol module
found: [artemis-server]. Adding protocol support for: CORE
[main] 15:48:37,635 INFO  [org.apache.activemq.artemis.core.server] AMQ221034: Waiting indefinitely
to obtain live lock
[main] 15:48:37,635 INFO  [org.apache.activemq.artemis.core.server] AMQ221035: Live Server
Obtained live lock
[main] 15:48:38,045 INFO  [org.apache.activemq.artemis.core.server] AMQ221020: Started EPOLL
Acceptor at localhost:61616 for protocols [CORE]
[main] 15:48:38,046 INFO  [org.apache.activemq.artemis.core.server] AMQ221007: Server is now
live
[main] 15:48:38,046 INFO  [org.apache.activemq.artemis.core.server] AMQ221001: Apache ActiveMQ
Artemis Message Broker version 2.1.0-SNAPSHOT [localhost, nodeID=234f64c0-30e1-11e7-aecd-90b11c3893f4]

[main] 15:48:38,066 INFO  [org.apache.activemq.artemis.jms.tests] #*#*# Finished test: testRebind_1()...
[main] 15:48:38,067 INFO  [org.apache.activemq.artemis.jms.tests] #*#*# Starting test: testRebind_2()...
[main] 15:48:38,067 INFO  [org.apache.activemq.artemis.jms.tests] #*#*# Finished test: testRebind_2()...
[main] 15:48:38,068 INFO  [org.apache.activemq.artemis.jms.tests] #*#*# Starting test: testRebind_3()...
[main] 15:48:38,068 INFO  [org.apache.activemq.artemis.jms.tests] #*#*# Finished test: testRebind_3()...
[main] 15:48:38,137 INFO  [org.apache.activemq.artemis.core.server] AMQ221002: Apache ActiveMQ
Artemis Message Broker version 2.1.0-SNAPSHOT [234f64c0-30e1-11e7-aecd-90b11c3893f4] stopped,
uptime 0.511 seconds
Tests run: 3, Failures: 0, Errors: 0, Skipped: 0, Time elapsed: 0.527 sec - in org.apache.activemq.artemis.jms.tests.util.JNDIUtilTest

Results :

Tests run: 427, Failures: 0, Errors: 0, Skipped: 0

[INFO] 
[INFO] --- maven-jar-plugin:2.4:test-jar (default) @ jms-tests ---
[INFO] Building jar: <https://builds.apache.org/job/ActiveMQ-Artemis-Master/ws/tests/jms-tests/target/jms-tests-2.1.0-SNAPSHOT-tests.jar>
[INFO] 
[INFO] --- maven-jar-plugin:2.4:jar (default-jar) @ jms-tests ---
[INFO] Building jar: <https://builds.apache.org/job/ActiveMQ-Artemis-Master/ws/tests/jms-tests/target/jms-tests-2.1.0-SNAPSHOT.jar>
[INFO] 
[INFO] --- maven-site-plugin:3.3:attach-descriptor (attach-descriptor) @ jms-tests ---
[INFO] 
[INFO] >>> maven-source-plugin:2.2.1:jar (attach-sources) > generate-sources @
jms-tests >>>
[INFO] 
[INFO] --- maven-enforcer-plugin:1.4:enforce (enforce-maven) @ jms-tests ---
[INFO] 
[INFO] --- maven-enforcer-plugin:1.4:enforce (enforce-java) @ jms-tests ---
[INFO] 
[INFO] <<< maven-source-plugin:2.2.1:jar (attach-sources) < generate-sources @
jms-tests <<<
[INFO] 
[INFO] --- maven-source-plugin:2.2.1:jar (attach-sources) @ jms-tests ---
[INFO] Building jar: <https://builds.apache.org/job/ActiveMQ-Artemis-Master/ws/tests/jms-tests/target/jms-tests-2.1.0-SNAPSHOT-sources.jar>
[INFO] 
[INFO] >>> maven-source-plugin:2.2.1:jar (default) > generate-sources @ jms-tests
>>>
[INFO] 
[INFO] --- maven-enforcer-plugin:1.4:enforce (enforce-maven) @ jms-tests ---
[INFO] 
[INFO] --- maven-enforcer-plugin:1.4:enforce (enforce-java) @ jms-tests ---
[INFO] 
[INFO] <<< maven-source-plugin:2.2.1:jar (default) < generate-sources @ jms-tests
<<<
[INFO] 
[INFO] --- maven-source-plugin:2.2.1:jar (default) @ jms-tests ---
[INFO] 
[INFO] --- dependency-check-maven:1.4.3:check (default) @ jms-tests ---
[INFO] Skipping dependency-check
[INFO] 
[INFO] --- maven-install-plugin:2.4:install (default-install) @ jms-tests ---
[INFO] Installing <https://builds.apache.org/job/ActiveMQ-Artemis-Master/ws/tests/jms-tests/target/jms-tests-2.1.0-SNAPSHOT.jar>
to /home/jenkins/.m2/repository/org/apache/activemq/tests/jms-tests/2.1.0-SNAPSHOT/jms-tests-2.1.0-SNAPSHOT.jar
[INFO] Installing <https://builds.apache.org/job/ActiveMQ-Artemis-Master/ws/tests/jms-tests/pom.xml>
to /home/jenkins/.m2/repository/org/apache/activemq/tests/jms-tests/2.1.0-SNAPSHOT/jms-tests-2.1.0-SNAPSHOT.pom
[INFO] Installing <https://builds.apache.org/job/ActiveMQ-Artemis-Master/ws/tests/jms-tests/target/jms-tests-2.1.0-SNAPSHOT-tests.jar>
to /home/jenkins/.m2/repository/org/apache/activemq/tests/jms-tests/2.1.0-SNAPSHOT/jms-tests-2.1.0-SNAPSHOT-tests.jar
[INFO] Installing <https://builds.apache.org/job/ActiveMQ-Artemis-Master/ws/tests/jms-tests/target/jms-tests-2.1.0-SNAPSHOT-sources.jar>
to /home/jenkins/.m2/repository/org/apache/activemq/tests/jms-tests/2.1.0-SNAPSHOT/jms-tests-2.1.0-SNAPSHOT-sources.jar
[INFO] Installing <https://builds.apache.org/job/ActiveMQ-Artemis-Master/ws/tests/jms-tests/target/jms-tests-2.1.0-SNAPSHOT-sources.jar>
to /home/jenkins/.m2/repository/org/apache/activemq/tests/jms-tests/2.1.0-SNAPSHOT/jms-tests-2.1.0-SNAPSHOT-sources.jar
[INFO]                                                                         
[INFO] ------------------------------------------------------------------------
[INFO] Building ActiveMQ Artemis Features 2.1.0-SNAPSHOT
[INFO] ------------------------------------------------------------------------
[INFO] 
[INFO] --- maven-enforcer-plugin:1.4:enforce (enforce-maven) @ artemis-features ---
[INFO] 
[INFO] --- maven-enforcer-plugin:1.4:enforce (enforce-java) @ artemis-features ---
[INFO] 
[INFO] --- maven-remote-resources-plugin:1.5:process (process-resource-bundles) @ artemis-features
---
[INFO] 
[INFO] --- maven-resources-plugin:2.6:resources (filter) @ artemis-features ---
[INFO] Using 'UTF-8' encoding to copy filtered resources.
[INFO] Copying 3 resources
[INFO] Copying 3 resources
[INFO] 
[INFO] --- karaf-maven-plugin:4.1.1:verify (verify) @ artemis-features ---
[INFO] ------------------------------------------------------------------------
[INFO] Reactor Summary:
[INFO] 
[INFO] ActiveMQ Artemis Parent ............................ SUCCESS [  4.218 s]
[INFO] ActiveMQ Artemis Commons ........................... SUCCESS [ 11.623 s]
[INFO] ActiveMQ Artemis Core Client ....................... SUCCESS [  8.859 s]
[INFO] ActiveMQ Artemis Selector Implementation ........... SUCCESS [  2.656 s]
[INFO] ActiveMQ Artemis JMS Client ........................ SUCCESS [  3.637 s]
[INFO] ActiveMQ Artemis Native POM ........................ SUCCESS [  6.787 s]
[INFO] ActiveMQ Artemis Journal ........................... SUCCESS [  2.511 s]
[INFO] ActiveMQ Artemis JDBC Store ........................ SUCCESS [  4.292 s]
[INFO] ActiveMQ Artemis Server ............................ SUCCESS [ 51.673 s]
[INFO] ActiveMQ Artemis Protocols ......................... SUCCESS [  0.343 s]
[INFO] ActiveMQ Artemis AMQP Protocol ..................... SUCCESS [  3.665 s]
[INFO] ActiveMQ Artemis STOMP Protocol .................... SUCCESS [  1.523 s]
[INFO] ActiveMQ Artemis OpenWire Protocol ................. SUCCESS [  1.619 s]
[INFO] ActiveMQ Artemis HQClient Protocol ................. SUCCESS [  0.625 s]
[INFO] ActiveMQ Artemis HornetQ Protocol .................. SUCCESS [  0.714 s]
[INFO] ActiveMQ Artemis MQTT Protocol ..................... SUCCESS [  1.123 s]
[INFO] ActiveMQ Artemis DTO ............................... SUCCESS [  1.739 s]
[INFO] ActiveMQ Artemis Service Extensions ................ SUCCESS [  1.491 s]
[INFO] ActiveMQ Artemis JMS Server ........................ SUCCESS [  1.394 s]
[INFO] ActiveMQ Artemis CDI Integration ................... SUCCESS [  4.391 s]
[INFO] ActiveMQ Artemis Boot .............................. SUCCESS [  0.418 s]
[INFO] ActiveMQ Artemis Tools ............................. SUCCESS [  1.017 s]
[INFO] ActiveMQ Artemis CLI ............................... SUCCESS [ 22.995 s]
[INFO] ActiveMQ Artemis Web ............................... SUCCESS [  4.210 s]
[INFO] ActiveMQ Artemis Web ............................... SUCCESS [ 57.951 s]
[INFO] ActiveMQ Artemis JUnit Rules ....................... SUCCESS [  8.051 s]
[INFO] ActiveMQ Artemis RAR POM ........................... SUCCESS [  1.984 s]
[INFO] ActiveMQ Artemis REST Interface Implementation ..... SUCCESS [01:25 min]
[INFO] ActiveMQ Artemis Maven Plugin ...................... SUCCESS [  3.144 s]
[INFO] ActiveMQ Artemis Server OSGi ....................... SUCCESS [  3.051 s]
[INFO] ActiveMQ Artemis Spring Integration ................ SUCCESS [  0.636 s]
[INFO] Apache ActiveMQ Artemis Distribution ............... SUCCESS [ 17.632 s]
[INFO] ActiveMQ Artemis Tests POM ......................... SUCCESS [  0.707 s]
[INFO] ActiveMQ Artemis Unit Tests ........................ SUCCESS [02:33 min]
[INFO] ActiveMQ Artemis Joram Tests ....................... SUCCESS [ 35.278 s]
[INFO] ActiveMQ Artemis timing Tests ...................... SUCCESS [  0.933 s]
[INFO] ActiveMQ Artemis JMS Tests ......................... SUCCESS [03:12 min]
[INFO] ActiveMQ Artemis Features .......................... FAILURE [  0.953 s]
[INFO] ActiveMQ Artemis Test Support ...................... SKIPPED
[INFO] ActiveMQ Artemis Integration Tests ................. SKIPPED
[INFO] ActiveMQ Artemis soak Tests ........................ SKIPPED
[INFO] ActiveMQ Artemis stress Tests ...................... SKIPPED
[INFO] ActiveMQ Artemis performance Tests ................. SKIPPED
[INFO] Smoke Tests ........................................ SKIPPED
[INFO] ActiveMQ Artemis Extra Tests ....................... SKIPPED
[INFO] ------------------------------------------------------------------------
[INFO] BUILD FAILURE
[INFO] ------------------------------------------------------------------------
[INFO] Total time: 11:45 min
[INFO] Finished at: 2017-05-04T15:48:39+00:00
[INFO] Final Memory: 260M/4769M
[INFO] ------------------------------------------------------------------------
[ERROR] Failed to execute goal org.apache.karaf.tooling:karaf-maven-plugin:4.1.1:verify (verify)
on project artemis-features: Execution verify of goal org.apache.karaf.tooling:karaf-maven-plugin:4.1.1:verify
failed: Plugin org.apache.karaf.tooling:karaf-maven-plugin:4.1.1 or one of its dependencies
could not be resolved: Failure to find org.apache.felix:maven-bundle-plugin:jar:3.3.0 in http://sevntu-checkstyle.github.io/sevntu.checkstyle/maven2
was cached in the local repository, resolution will not be reattempted until the update interval
of sevntu-maven has elapsed or updates are forced -> [Help 1]
[ERROR] 
[ERROR] To see the full stack trace of the errors, re-run Maven with the -e switch.
[ERROR] Re-run Maven using the -X switch to enable full debug logging.
[ERROR] 
[ERROR] For more information about the errors and possible solutions, please read the following
articles:
[ERROR] [Help 1] http://cwiki.apache.org/confluence/display/MAVEN/PluginResolutionException
[ERROR] 
[ERROR] After correcting the problems, you can resume the build with the command
[ERROR]   mvn <goals> -rf :artemis-features
Build step 'Invoke top-level Maven targets' marked build as failure
Performing Post build task...
Could not match :Too many files with unapproved license  : False
Logical operation result is FALSE
Skipping script  : cat ratReport.txt
END OF POST BUILD TASK 	: 0
Recording test results

Mime
View raw message