activemq-commits mailing list archives

Site index · List index
Message view « Date » · « Thread »
Top « Date » · « Thread »
From Apache Jenkins Server <jenk...@builds.apache.org>
Subject Build failed in Jenkins: ActiveMQ-Trunk-Deploy » ActiveMQ :: Client #1904
Date Fri, 15 Sep 2017 14:19:15 GMT
See <https://builds.apache.org/job/ActiveMQ-Trunk-Deploy/org.apache.activemq$activemq-client/1904/display/redirect?page=changes>

Changes:

[christopher.l.shannon] AMQ-6811 - fix reduceMemoryFootprint when no message body

------------------------------------------
[INFO]                                                                         
[INFO] ------------------------------------------------------------------------
[INFO] Building ActiveMQ :: Client 5.16.0-SNAPSHOT
[INFO] ------------------------------------------------------------------------
[INFO] 
[INFO] --- maven-clean-plugin:3.0.0:clean (default-clean) @ activemq-client ---
[INFO] Deleting <https://builds.apache.org/job/ActiveMQ-Trunk-Deploy/org.apache.activemq$activemq-client/ws/target>
[INFO] 
[INFO] --- maven-bundle-plugin:2.3.7:cleanVersions (cleanVersions) @ activemq-client ---
[INFO] 
[INFO] --- javacc-maven-plugin:2.6:javacc (default) @ activemq-client ---
Java Compiler Compiler Version 5.0 (Parser Generator)
(type "javacc" with no arguments for help)
Reading from file <https://builds.apache.org/job/ActiveMQ-Trunk-Deploy/org.apache.activemq$activemq-client/ws/src/main/grammar/SelectorParser.jj>
. . .
Note: UNICODE_INPUT option is specified. Please make sure you create the parser/lexer using
a Reader with the correct character encoding.
File "TokenMgrError.java" does not exist.  Will create one.
File "ParseException.java" does not exist.  Will create one.
File "Token.java" does not exist.  Will create one.
File "SimpleCharStream.java" does not exist.  Will create one.
Parser generated successfully.
[INFO] Processed 1 grammar
[INFO] 
[INFO] --- build-helper-maven-plugin:1.8:add-source (add-source) @ activemq-client ---
[INFO] Source directory: <https://builds.apache.org/job/ActiveMQ-Trunk-Deploy/org.apache.activemq$activemq-client/ws/target/generated-sources/javacc>
added.
[INFO] 
[INFO] --- maven-remote-resources-plugin:1.5:process (process-resource-bundles) @ activemq-client
---
[INFO] 
[INFO] --- maven-resources-plugin:2.7:resources (default-resources) @ activemq-client ---
[INFO] Using 'UTF-8' encoding to copy filtered resources.
[INFO] Copying 17 resources
[INFO] Copying 1 resource
[INFO] Copying 3 resources
[INFO] 
[INFO] --- maven-compiler-plugin:3.3:compile (default-compile) @ activemq-client ---
[INFO] Changes detected - recompiling the module!
[INFO] Compiling 712 source files to <https://builds.apache.org/job/ActiveMQ-Trunk-Deploy/org.apache.activemq$activemq-client/ws/target/classes>
[INFO] <https://builds.apache.org/job/ActiveMQ-Trunk-Deploy/org.apache.activemq$activemq-client/ws/src/main/java/org/apache/activemq/openwire/v9/BaseDataStreamMarshaller.java>:
Some input files use unchecked or unsafe operations.
[INFO] <https://builds.apache.org/job/ActiveMQ-Trunk-Deploy/org.apache.activemq$activemq-client/ws/src/main/java/org/apache/activemq/openwire/v9/BaseDataStreamMarshaller.java>:
Recompile with -Xlint:unchecked for details.
[INFO] -------------------------------------------------------------
[WARNING] COMPILATION WARNING : 
[INFO] -------------------------------------------------------------
[WARNING] <https://builds.apache.org/job/ActiveMQ-Trunk-Deploy/org.apache.activemq$activemq-client/ws/src/main/java/org/apache/activemq/transport/multicast/MulticastTransportFactory.java>:[25,41]
org.apache.activemq.transport.udp.UdpTransportFactory in org.apache.activemq.transport.udp
has been deprecated
[WARNING] <https://builds.apache.org/job/ActiveMQ-Trunk-Deploy/org.apache.activemq$activemq-client/ws/src/main/java/org/apache/activemq/transport/udp/UdpTransportFactory.java>:[35,46]
org.apache.activemq.transport.reliable.ReliableTransport in org.apache.activemq.transport.reliable
has been deprecated
[WARNING] <https://builds.apache.org/job/ActiveMQ-Trunk-Deploy/org.apache.activemq$activemq-client/ws/src/main/java/org/apache/activemq/transport/udp/UdpTransportServer.java>:[35,46]
org.apache.activemq.transport.reliable.ReliableTransport in org.apache.activemq.transport.reliable
has been deprecated
[WARNING] <https://builds.apache.org/job/ActiveMQ-Trunk-Deploy/org.apache.activemq$activemq-client/ws/src/main/java/org/apache/activemq/transport/reliable/ReplayStrategy.java>:[38,30]
org.apache.activemq.transport.reliable.ReliableTransport in org.apache.activemq.transport.reliable
has been deprecated
[WARNING] <https://builds.apache.org/job/ActiveMQ-Trunk-Deploy/org.apache.activemq$activemq-client/ws/src/main/java/org/apache/activemq/transport/reliable/ReplayStrategy.java>:[40,27]
org.apache.activemq.transport.reliable.ReliableTransport in org.apache.activemq.transport.reliable
has been deprecated
[WARNING] <https://builds.apache.org/job/ActiveMQ-Trunk-Deploy/org.apache.activemq$activemq-client/ws/src/main/java/org/apache/activemq/transport/multicast/MulticastTransportFactory.java>:[33,48]
org.apache.activemq.transport.udp.UdpTransportFactory in org.apache.activemq.transport.udp
has been deprecated
[WARNING] <https://builds.apache.org/job/ActiveMQ-Trunk-Deploy/org.apache.activemq$activemq-client/ws/src/main/java/org/apache/activemq/transport/reliable/ExceptionIfDroppedReplayStrategy.java>:[38,37]
org.apache.activemq.transport.reliable.ReliableTransport in org.apache.activemq.transport.reliable
has been deprecated
[WARNING] <https://builds.apache.org/job/ActiveMQ-Trunk-Deploy/org.apache.activemq$activemq-client/ws/src/main/java/org/apache/activemq/transport/reliable/ExceptionIfDroppedReplayStrategy.java>:[49,34]
org.apache.activemq.transport.reliable.ReliableTransport in org.apache.activemq.transport.reliable
has been deprecated
[WARNING] <https://builds.apache.org/job/ActiveMQ-Trunk-Deploy/org.apache.activemq$activemq-client/ws/src/main/java/org/apache/activemq/transport/reliable/DefaultReplayStrategy.java>:[38,37]
org.apache.activemq.transport.reliable.ReliableTransport in org.apache.activemq.transport.reliable
has been deprecated
[WARNING] <https://builds.apache.org/job/ActiveMQ-Trunk-Deploy/org.apache.activemq$activemq-client/ws/src/main/java/org/apache/activemq/transport/reliable/DefaultReplayStrategy.java>:[53,34]
org.apache.activemq.transport.reliable.ReliableTransport in org.apache.activemq.transport.reliable
has been deprecated
[INFO] 10 warnings 
[INFO] -------------------------------------------------------------
[INFO] -------------------------------------------------------------
[ERROR] COMPILATION ERROR : 
[INFO] -------------------------------------------------------------
[ERROR] <https://builds.apache.org/job/ActiveMQ-Trunk-Deploy/org.apache.activemq$activemq-client/ws/src/main/java/org/apache/activemq/command/ActiveMQMessageIsMarshalledTest.java>:[19,24]
package org.junit does not exist
[ERROR] <https://builds.apache.org/job/ActiveMQ-Trunk-Deploy/org.apache.activemq$activemq-client/ws/src/main/java/org/apache/activemq/command/ActiveMQMessageIsMarshalledTest.java>:[19,1]
static import only from classes and interfaces
[ERROR] <https://builds.apache.org/job/ActiveMQ-Trunk-Deploy/org.apache.activemq$activemq-client/ws/src/main/java/org/apache/activemq/command/ActiveMQMessageIsMarshalledTest.java>:[20,24]
package org.junit does not exist
[ERROR] <https://builds.apache.org/job/ActiveMQ-Trunk-Deploy/org.apache.activemq$activemq-client/ws/src/main/java/org/apache/activemq/command/ActiveMQMessageIsMarshalledTest.java>:[20,1]
static import only from classes and interfaces
[ERROR] <https://builds.apache.org/job/ActiveMQ-Trunk-Deploy/org.apache.activemq$activemq-client/ws/src/main/java/org/apache/activemq/command/ActiveMQMessageIsMarshalledTest.java>:[28,17]
package org.junit does not exist
[ERROR] <https://builds.apache.org/job/ActiveMQ-Trunk-Deploy/org.apache.activemq$activemq-client/ws/src/main/java/org/apache/activemq/command/ActiveMQMessageIsMarshalledTest.java>:[29,24]
package org.junit.runner does not exist
[ERROR] <https://builds.apache.org/job/ActiveMQ-Trunk-Deploy/org.apache.activemq$activemq-client/ws/src/main/java/org/apache/activemq/command/ActiveMQMessageIsMarshalledTest.java>:[30,25]
package org.junit.runners does not exist
[ERROR] <https://builds.apache.org/job/ActiveMQ-Trunk-Deploy/org.apache.activemq$activemq-client/ws/src/main/java/org/apache/activemq/command/ActiveMQMessageIsMarshalledTest.java>:[31,39]
package org.junit.runners.Parameterized does not exist
[ERROR] <https://builds.apache.org/job/ActiveMQ-Trunk-Deploy/org.apache.activemq$activemq-client/ws/src/main/java/org/apache/activemq/command/ActiveMQMessageIsMarshalledTest.java>:[36,2]
cannot find symbol
  symbol: class RunWith
[ERROR] <https://builds.apache.org/job/ActiveMQ-Trunk-Deploy/org.apache.activemq$activemq-client/ws/src/main/java/org/apache/activemq/command/ActiveMQMessageIsMarshalledTest.java>:[43,6]
cannot find symbol
  symbol:   class Parameters
  location: class org.apache.activemq.command.ActiveMQMessageIsMarshalledTest
[ERROR] <https://builds.apache.org/job/ActiveMQ-Trunk-Deploy/org.apache.activemq$activemq-client/ws/src/main/java/org/apache/activemq/command/ActiveMQMessageIsMarshalledTest.java>:[60,6]
cannot find symbol
  symbol:   class Test
  location: class org.apache.activemq.command.ActiveMQMessageIsMarshalledTest
[ERROR] <https://builds.apache.org/job/ActiveMQ-Trunk-Deploy/org.apache.activemq$activemq-client/ws/src/main/java/org/apache/activemq/command/ActiveMQMessageIsMarshalledTest.java>:[66,6]
cannot find symbol
  symbol:   class Test
  location: class org.apache.activemq.command.ActiveMQMessageIsMarshalledTest
[ERROR] <https://builds.apache.org/job/ActiveMQ-Trunk-Deploy/org.apache.activemq$activemq-client/ws/src/main/java/org/apache/activemq/command/ActiveMQMessageIsMarshalledTest.java>:[72,6]
cannot find symbol
  symbol:   class Test
  location: class org.apache.activemq.command.ActiveMQMessageIsMarshalledTest
[ERROR] <https://builds.apache.org/job/ActiveMQ-Trunk-Deploy/org.apache.activemq$activemq-client/ws/src/main/java/org/apache/activemq/command/ActiveMQMessageIsMarshalledTest.java>:[78,6]
cannot find symbol
  symbol:   class Test
  location: class org.apache.activemq.command.ActiveMQMessageIsMarshalledTest
[ERROR] <https://builds.apache.org/job/ActiveMQ-Trunk-Deploy/org.apache.activemq$activemq-client/ws/src/main/java/org/apache/activemq/command/ActiveMQMessageIsMarshalledTest.java>:[83,9]
cannot find symbol
  symbol:   method assertTrue(boolean)
  location: class org.apache.activemq.command.ActiveMQMessageIsMarshalledTest
[ERROR] <https://builds.apache.org/job/ActiveMQ-Trunk-Deploy/org.apache.activemq$activemq-client/ws/src/main/java/org/apache/activemq/command/ActiveMQMessageIsMarshalledTest.java>:[177,13]
cannot find symbol
  symbol:   method assertFalse(boolean)
  location: class org.apache.activemq.command.ActiveMQMessageIsMarshalledTest
[ERROR] <https://builds.apache.org/job/ActiveMQ-Trunk-Deploy/org.apache.activemq$activemq-client/ws/src/main/java/org/apache/activemq/command/ActiveMQMessageIsMarshalledTest.java>:[179,13]
cannot find symbol
  symbol:   method assertFalse(boolean)
  location: class org.apache.activemq.command.ActiveMQMessageIsMarshalledTest
[ERROR] <https://builds.apache.org/job/ActiveMQ-Trunk-Deploy/org.apache.activemq$activemq-client/ws/src/main/java/org/apache/activemq/command/ActiveMQMessageIsMarshalledTest.java>:[182,13]
cannot find symbol
  symbol:   method assertTrue(boolean)
  location: class org.apache.activemq.command.ActiveMQMessageIsMarshalledTest
[ERROR] <https://builds.apache.org/job/ActiveMQ-Trunk-Deploy/org.apache.activemq$activemq-client/ws/src/main/java/org/apache/activemq/command/ActiveMQMessageIsMarshalledTest.java>:[183,13]
cannot find symbol
  symbol:   method assertTrue(boolean)
  location: class org.apache.activemq.command.ActiveMQMessageIsMarshalledTest
[ERROR] <https://builds.apache.org/job/ActiveMQ-Trunk-Deploy/org.apache.activemq$activemq-client/ws/src/main/java/org/apache/activemq/command/ActiveMQMessageIsMarshalledTest.java>:[184,13]
cannot find symbol
  symbol:   method assertTrue(boolean)
  location: class org.apache.activemq.command.ActiveMQMessageIsMarshalledTest
[INFO] 20 errors 
[INFO] -------------------------------------------------------------

Mime
View raw message