activemq-commits mailing list archives

Site index · List index
Message view « Date » · « Thread »
Top « Date » · « Thread »
From Apache Jenkins Server <jenk...@builds.apache.org>
Subject Build failed in Jenkins: ActiveMQ-Java8 #1088
Date Fri, 10 Nov 2017 13:49:00 GMT
See <https://builds.apache.org/job/ActiveMQ-Java8/1088/display/redirect?page=changes>

Changes:

[christopher.l.shannon] AMQ-6858 - Fix several durable subscription bridge propagation issues

------------------------------------------
[...truncated 341.12 KB...]
Tests run: 3, Failures: 0, Errors: 0, Skipped: 0, Time elapsed: 8.145 sec - in org.apache.activemq.usecases.QueueBrowsingTest
Running org.apache.activemq.usecases.QueueOrderSingleTransactedConsumerTest
Tests run: 4, Failures: 0, Errors: 0, Skipped: 0, Time elapsed: 3.747 sec - in org.apache.activemq.usecases.QueueOrderSingleTransactedConsumerTest
Running org.apache.activemq.usecases.QueueRepeaterTest
Tests run: 1, Failures: 0, Errors: 0, Skipped: 0, Time elapsed: 1.994 sec - in org.apache.activemq.usecases.QueueRepeaterTest
Running org.apache.activemq.usecases.QueueZeroPrefetchLazyDispatchPriorityTest
Tests run: 5, Failures: 0, Errors: 0, Skipped: 0, Time elapsed: 61.231 sec - in org.apache.activemq.usecases.QueueZeroPrefetchLazyDispatchPriorityTest
Running org.apache.activemq.usecases.RequestReplyTempDestRemovalAdvisoryRaceTest
Tests run: 8, Failures: 0, Errors: 0, Skipped: 0, Time elapsed: 120.215 sec - in org.apache.activemq.usecases.RequestReplyTempDestRemovalAdvisoryRaceTest
Running org.apache.activemq.usecases.RequestReplyToTopicViaThreeNetworkHopsTest
Tests run: 1, Failures: 0, Errors: 0, Skipped: 0, Time elapsed: 12.762 sec - in org.apache.activemq.usecases.RequestReplyToTopicViaThreeNetworkHopsTest
Running org.apache.activemq.usecases.SingleBrokerVirtualDestinationsWithWildcardLevelDBTest
Tests run: 4, Failures: 0, Errors: 0, Skipped: 0, Time elapsed: 45.248 sec - in org.apache.activemq.usecases.SingleBrokerVirtualDestinationsWithWildcardLevelDBTest
Running org.apache.activemq.usecases.StartAndConcurrentStopBrokerTest
Tests run: 1, Failures: 0, Errors: 0, Skipped: 0, Time elapsed: 1.9 sec - in org.apache.activemq.usecases.StartAndConcurrentStopBrokerTest
Running org.apache.activemq.usecases.SubscribeClosePublishThenConsumeTest
Tests run: 1, Failures: 0, Errors: 0, Skipped: 0, Time elapsed: 2.299 sec - in org.apache.activemq.usecases.SubscribeClosePublishThenConsumeTest
Running org.apache.activemq.usecases.ThreeBrokerTempDestDemandSubscriptionCleanupTest
Tests run: 2, Failures: 0, Errors: 0, Skipped: 0, Time elapsed: 11.68 sec - in org.apache.activemq.usecases.ThreeBrokerTempDestDemandSubscriptionCleanupTest
Running org.apache.activemq.usecases.ThreeBrokerVirtualTopicNetworkLevelDBTest
Tests run: 1, Failures: 0, Errors: 0, Skipped: 0, Time elapsed: 24.47 sec - in org.apache.activemq.usecases.ThreeBrokerVirtualTopicNetworkLevelDBTest
Running org.apache.activemq.usecases.TopicDurableConnectStatsTest
Tests run: 1, Failures: 0, Errors: 0, Skipped: 0, Time elapsed: 3.577 sec - in org.apache.activemq.usecases.TopicDurableConnectStatsTest
Running org.apache.activemq.usecases.TopicProducerDurableSubFlowControlTest
Tests run: 1, Failures: 0, Errors: 0, Skipped: 0, Time elapsed: 28.322 sec - in org.apache.activemq.usecases.TopicProducerDurableSubFlowControlTest
Running org.apache.activemq.usecases.TopicProducerToSubFileCursorTest
Tests run: 1, Failures: 0, Errors: 0, Skipped: 0, Time elapsed: 22.973 sec - in org.apache.activemq.usecases.TopicProducerToSubFileCursorTest
Running org.apache.activemq.usecases.TopicSubscriptionZeroPrefetchTest
Tests run: 11, Failures: 0, Errors: 0, Skipped: 0, Time elapsed: 6.266 sec - in org.apache.activemq.usecases.TopicSubscriptionZeroPrefetchTest
Running org.apache.activemq.usecases.TransactionRollbackOrderTest
Tests run: 1, Failures: 0, Errors: 0, Skipped: 0, Time elapsed: 2.889 sec - in org.apache.activemq.usecases.TransactionRollbackOrderTest
Running org.apache.activemq.usecases.TransactionTest
Tests run: 1, Failures: 0, Errors: 0, Skipped: 0, Time elapsed: 1.926 sec - in org.apache.activemq.usecases.TransactionTest
Running org.apache.activemq.usecases.TwoBrokerDurableForwardStaticRestartTest
Tests run: 1, Failures: 0, Errors: 0, Skipped: 0, Time elapsed: 10.544 sec - in org.apache.activemq.usecases.TwoBrokerDurableForwardStaticRestartTest
Running org.apache.activemq.usecases.TwoBrokerVirtualTopicForwardingTest
Tests run: 3, Failures: 0, Errors: 0, Skipped: 0, Time elapsed: 16.156 sec - in org.apache.activemq.usecases.TwoBrokerVirtualTopicForwardingTest
Running org.apache.activemq.usecases.TwoBrokerVirtualTopicSelectorAwareForwardingTest
Tests run: 6, Failures: 0, Errors: 0, Skipped: 0, Time elapsed: 42.209 sec - in org.apache.activemq.usecases.TwoBrokerVirtualTopicSelectorAwareForwardingTest
Running org.apache.activemq.usecases.TwoSecureBrokerRequestReplyTest
Tests run: 1, Failures: 0, Errors: 0, Skipped: 0, Time elapsed: 48.49 sec - in org.apache.activemq.usecases.TwoSecureBrokerRequestReplyTest
Running org.apache.activemq.usecases.UsageBlockedDispatchTest
Tests run: 1, Failures: 0, Errors: 0, Skipped: 0, Time elapsed: 8.452 sec - in org.apache.activemq.usecases.UsageBlockedDispatchTest
Running org.apache.activemq.usecases.VerifyNetworkConsumersDisconnectTest
Tests run: 3, Failures: 0, Errors: 0, Skipped: 0, Time elapsed: 43.25 sec - in org.apache.activemq.usecases.VerifyNetworkConsumersDisconnectTest
Running org.apache.activemq.usecases.VirtualTopicNetworkClusterReactivationTest
Tests run: 1, Failures: 0, Errors: 0, Skipped: 0, Time elapsed: 7.33 sec - in org.apache.activemq.usecases.VirtualTopicNetworkClusterReactivationTest
Running org.apache.activemq.util.LinkedNodeTest
Tests run: 3, Failures: 0, Errors: 0, Skipped: 0, Time elapsed: 0.139 sec - in org.apache.activemq.util.LinkedNodeTest
Running org.apache.activemq.util.ReflectionSupportTest
Tests run: 3, Failures: 0, Errors: 0, Skipped: 0, Time elapsed: 0.336 sec - in org.apache.activemq.util.ReflectionSupportTest
Running org.apache.activemq.xbean.DestinationBridgeAccessorsTest
Tests run: 1, Failures: 0, Errors: 0, Skipped: 0, Time elapsed: 3.337 sec - in org.apache.activemq.xbean.DestinationBridgeAccessorsTest
Running org.apache.activemq.xbean.JDBCPersistenceAdapterXBeanConfigTest
Tests run: 1, Failures: 0, Errors: 0, Skipped: 0, Time elapsed: 6.547 sec - in org.apache.activemq.xbean.JDBCPersistenceAdapterXBeanConfigTest
Running org.apache.activemq.xbean.ManagementContextXBeanConfigTest
Tests run: 3, Failures: 0, Errors: 0, Skipped: 0, Time elapsed: 4.229 sec - in org.apache.activemq.xbean.ManagementContextXBeanConfigTest
Running org.apache.activemq.xbean.MultipleTestsWithEmbeddedBrokerAndPersistenceTest
Tests run: 2, Failures: 0, Errors: 0, Skipped: 0, Time elapsed: 2.39 sec - in org.apache.activemq.xbean.MultipleTestsWithEmbeddedBrokerAndPersistenceTest
Running org.apache.activemq.xbean.MultipleTestsWithEmbeddedBrokerTest
Tests run: 2, Failures: 0, Errors: 0, Skipped: 0, Time elapsed: 1.728 sec - in org.apache.activemq.xbean.MultipleTestsWithEmbeddedBrokerTest
Running org.apache.activemq.xbean.XBeanConfigTest
Tests run: 1, Failures: 0, Errors: 0, Skipped: 0, Time elapsed: 2.722 sec - in org.apache.activemq.xbean.XBeanConfigTest
Running org.apache.activemq.xbean.XBeanStartFalseTest
Tests run: 1, Failures: 0, Errors: 0, Skipped: 0, Time elapsed: 2.516 sec - in org.apache.activemq.xbean.XBeanStartFalseTest

Results :

Failed tests: 
  ActiveMQXAConnectionTxInterruptTest.testInterruptWhilePendingResponseToAck:217 no errors:
[java.lang.AssertionError]
  AMQ4930Test.testWithStatsDisabled:72->doTestBrowsePending:120 No growth: 184098 >=
193728.0
  AMQ6463Test>CombinationTestSupport.runBare:113->CombinationTestSupport.runBare:107->testBlockedSechedulerSendNoError:76
got blocked event
  DuplicateFromStoreTest.testDuplicateMessage:146 no messages pending, i.e. dlq empty expected:<0>
but was:<8637>
  DurableSyncNetworkBridgeTest.testRemoveSubscriptionWithBridgeOfflineIncludedChanged:227->DynamicNetworkTestSupport.assertNCDurableSubsCount:144
null
  PeriodicDiskUsageLimitTest.testDiskUsageAdjustLower:112->assertRampDown:260 Store Usage
should ramp down

Tests in error: 
  RedeliveryPolicyTest>CombinationTestSupport.runBare:107->testRepeatedRedeliveryBrokerCloseReceiveNoCommit:491
ยป JMS

Tests run: 4409, Failures: 6, Errors: 1, Skipped: 109

[ERROR] There are test failures.

Please refer to <https://builds.apache.org/job/ActiveMQ-Java8/ws/activemq-unit-tests/target/surefire-reports>
for the individual test results.
[JENKINS] Recording test results
[INFO] 
[INFO] --- maven-jar-plugin:2.4:jar (default-jar) @ activemq-unit-tests ---
[INFO] Building jar: <https://builds.apache.org/job/ActiveMQ-Java8/ws/activemq-unit-tests/target/activemq-unit-tests-5.16.0-SNAPSHOT.jar>
[INFO] 
[INFO] --- maven-site-plugin:3.5.1:attach-descriptor (attach-descriptor) @ activemq-unit-tests
---
[INFO] 
[INFO] --- maven-antrun-plugin:1.3:run (package) @ activemq-unit-tests ---
[INFO] Executing tasks
     [echo] Deleting unwanted resources from the test-jar
   [delete] DEPRECATED - Use of the implicit FileSet is deprecated.  Use a nested fileset
element instead.
   [delete] Deleting <https://builds.apache.org/job/ActiveMQ-Java8/ws/activemq-unit-tests/target/test-classes/activemq-browse.properties>
   [delete] Deleting <https://builds.apache.org/job/ActiveMQ-Java8/ws/activemq-unit-tests/target/test-classes/activemq-partition.xml>
   [delete] Deleting <https://builds.apache.org/job/ActiveMQ-Java8/ws/activemq-unit-tests/target/test-classes/activemq.xml>
   [delete] Deleting <https://builds.apache.org/job/ActiveMQ-Java8/ws/activemq-unit-tests/target/test-classes/cert-groups.properties>
   [delete] Deleting <https://builds.apache.org/job/ActiveMQ-Java8/ws/activemq-unit-tests/target/test-classes/cert-users-LARGE.properties>
   [delete] Deleting <https://builds.apache.org/job/ActiveMQ-Java8/ws/activemq-unit-tests/target/test-classes/cert-users-SMALL.properties>
   [delete] Deleting <https://builds.apache.org/job/ActiveMQ-Java8/ws/activemq-unit-tests/target/test-classes/client.keystore>
   [delete] Deleting <https://builds.apache.org/job/ActiveMQ-Java8/ws/activemq-unit-tests/target/test-classes/credentials.properties>
   [delete] Deleting <https://builds.apache.org/job/ActiveMQ-Java8/ws/activemq-unit-tests/target/test-classes/dummy.keystore>
   [delete] Deleting <https://builds.apache.org/job/ActiveMQ-Java8/ws/activemq-unit-tests/target/test-classes/groups-JaasDualAuthenticationNetworkBridge.properties>
   [delete] Deleting <https://builds.apache.org/job/ActiveMQ-Java8/ws/activemq-unit-tests/target/test-classes/handleReplyToActivemq.xml>
   [delete] Deleting <https://builds.apache.org/job/ActiveMQ-Java8/ws/activemq-unit-tests/target/test-classes/jmx.access>
   [delete] Deleting <https://builds.apache.org/job/ActiveMQ-Java8/ws/activemq-unit-tests/target/test-classes/jmx.password>
   [delete] Deleting <https://builds.apache.org/job/ActiveMQ-Java8/ws/activemq-unit-tests/target/test-classes/jndi.properties>
   [delete] Deleting <https://builds.apache.org/job/ActiveMQ-Java8/ws/activemq-unit-tests/target/test-classes/log4j.properties>
   [delete] Deleting <https://builds.apache.org/job/ActiveMQ-Java8/ws/activemq-unit-tests/target/test-classes/login-JaasDualAuthenticationNetworkBridge.config>
   [delete] Deleting <https://builds.apache.org/job/ActiveMQ-Java8/ws/activemq-unit-tests/target/test-classes/login.config>
   [delete] Deleting <https://builds.apache.org/job/ActiveMQ-Java8/ws/activemq-unit-tests/target/test-classes/provider.properties>
   [delete] Deleting <https://builds.apache.org/job/ActiveMQ-Java8/ws/activemq-unit-tests/target/test-classes/server.keystore>
   [delete] Deleting <https://builds.apache.org/job/ActiveMQ-Java8/ws/activemq-unit-tests/target/test-classes/spring-embedded-xbean-bean-ref.xml>
   [delete] Deleting <https://builds.apache.org/job/ActiveMQ-Java8/ws/activemq-unit-tests/target/test-classes/spring-embedded-xbean-local.xml>
   [delete] Deleting <https://builds.apache.org/job/ActiveMQ-Java8/ws/activemq-unit-tests/target/test-classes/spring-embedded-xbean-noversion.xml>
   [delete] Deleting <https://builds.apache.org/job/ActiveMQ-Java8/ws/activemq-unit-tests/target/test-classes/spring-embedded-xbean.xml>
   [delete] Deleting <https://builds.apache.org/job/ActiveMQ-Java8/ws/activemq-unit-tests/target/test-classes/spring-embedded.xml>
   [delete] Deleting <https://builds.apache.org/job/ActiveMQ-Java8/ws/activemq-unit-tests/target/test-classes/spring-jndi.xml>
   [delete] Deleting <https://builds.apache.org/job/ActiveMQ-Java8/ws/activemq-unit-tests/target/test-classes/spring-queue.xml>
   [delete] Deleting <https://builds.apache.org/job/ActiveMQ-Java8/ws/activemq-unit-tests/target/test-classes/spring-start-false.xml>
   [delete] Deleting <https://builds.apache.org/job/ActiveMQ-Java8/ws/activemq-unit-tests/target/test-classes/spring.xml>
   [delete] Deleting <https://builds.apache.org/job/ActiveMQ-Java8/ws/activemq-unit-tests/target/test-classes/ssl-domain-JaasDualAuthenticationNetworkBridge.properties>
   [delete] Deleting <https://builds.apache.org/job/ActiveMQ-Java8/ws/activemq-unit-tests/target/test-classes/test.properties>
   [delete] Deleting <https://builds.apache.org/job/ActiveMQ-Java8/ws/activemq-unit-tests/target/test-classes/users-JaasDualAuthenticationNetworkBridge.properties>
[INFO] Executed tasks
[INFO] 
[INFO] --- maven-jar-plugin:2.4:test-jar (default) @ activemq-unit-tests ---
[INFO] Building jar: <https://builds.apache.org/job/ActiveMQ-Java8/ws/activemq-unit-tests/target/activemq-unit-tests-5.16.0-SNAPSHOT-tests.jar>
[INFO] 
[INFO] --- ianal-maven-plugin:1.0-alpha-1:verify-legal-files (default) @ activemq-unit-tests
---
[INFO] Checking legal files in: activemq-unit-tests-5.16.0-SNAPSHOT.jar
[INFO] Checking legal files in: activemq-unit-tests-5.16.0-SNAPSHOT-tests.jar
[INFO] 
[INFO] --- maven-install-plugin:2.5.2:install (default-install) @ activemq-unit-tests ---
[INFO] Installing <https://builds.apache.org/job/ActiveMQ-Java8/ws/activemq-unit-tests/target/activemq-unit-tests-5.16.0-SNAPSHOT.jar>
to /home/jenkins/jenkins-slave/maven-repositories/1/org/apache/activemq/activemq-unit-tests/5.16.0-SNAPSHOT/activemq-unit-tests-5.16.0-SNAPSHOT.jar
[INFO] Installing <https://builds.apache.org/job/ActiveMQ-Java8/ws/activemq-unit-tests/pom.xml>
to /home/jenkins/jenkins-slave/maven-repositories/1/org/apache/activemq/activemq-unit-tests/5.16.0-SNAPSHOT/activemq-unit-tests-5.16.0-SNAPSHOT.pom
[INFO] Installing <https://builds.apache.org/job/ActiveMQ-Java8/ws/activemq-unit-tests/target/activemq-unit-tests-5.16.0-SNAPSHOT-tests.jar>
to /home/jenkins/jenkins-slave/maven-repositories/1/org/apache/activemq/activemq-unit-tests/5.16.0-SNAPSHOT/activemq-unit-tests-5.16.0-SNAPSHOT-tests.jar
[INFO] 
[INFO] >>> maven-source-plugin:3.0.0:jar (default-cli) > generate-sources @ activemq-unit-tests
>>>
[INFO] 
[INFO] --- maven-bundle-plugin:2.3.7:cleanVersions (cleanVersions) @ activemq-unit-tests ---
[WARNING] Failed to getClass for org.apache.maven.plugins.source.SourceJarMojo
[INFO] 
[INFO] <<< maven-source-plugin:3.0.0:jar (default-cli) < generate-sources @ activemq-unit-tests
<<<
[INFO] 
[INFO] --- maven-source-plugin:3.0.0:jar (default-cli) @ activemq-unit-tests ---
[INFO] Building jar: <https://builds.apache.org/job/ActiveMQ-Java8/ws/activemq-unit-tests/target/activemq-unit-tests-5.16.0-SNAPSHOT-sources.jar>
ERROR: qnode1 is offline; cannot locate JDK 1.8 (latest)
ERROR: qnode1 is offline; cannot locate Maven 3.3.9
ERROR: qnode1 is offline; cannot locate JDK 1.8 (latest)
ERROR: qnode1 is offline; cannot locate Maven 3.3.9
ERROR: qnode1 is offline; cannot locate JDK 1.8 (latest)
ERROR: qnode1 is offline; cannot locate Maven 3.3.9
Sending e-mails to: commits@activemq.apache.org
ERROR: qnode1 is offline; cannot locate JDK 1.8 (latest)
ERROR: qnode1 is offline; cannot locate Maven 3.3.9
ERROR: qnode1 is offline; cannot locate JDK 1.8 (latest)
ERROR: qnode1 is offline; cannot locate Maven 3.3.9
ERROR: qnode1 is offline; cannot locate JDK 1.8 (latest)
ERROR: qnode1 is offline; cannot locate Maven 3.3.9
ERROR: qnode1 is offline; cannot locate JDK 1.8 (latest)
ERROR: qnode1 is offline; cannot locate Maven 3.3.9
ERROR: qnode1 is offline; cannot locate JDK 1.8 (latest)
ERROR: qnode1 is offline; cannot locate Maven 3.3.9
ERROR: qnode1 is offline; cannot locate JDK 1.8 (latest)
ERROR: qnode1 is offline; cannot locate Maven 3.3.9
ERROR: qnode1 is offline; cannot locate JDK 1.8 (latest)
ERROR: qnode1 is offline; cannot locate Maven 3.3.9
ERROR: qnode1 is offline; cannot locate JDK 1.8 (latest)
ERROR: qnode1 is offline; cannot locate Maven 3.3.9
ERROR: qnode1 is offline; cannot locate JDK 1.8 (latest)
ERROR: qnode1 is offline; cannot locate Maven 3.3.9
ERROR: qnode1 is offline; cannot locate JDK 1.8 (latest)
ERROR: qnode1 is offline; cannot locate Maven 3.3.9
Sending e-mails to: commits@activemq.apache.org
ERROR: qnode1 is offline; cannot locate JDK 1.8 (latest)
ERROR: qnode1 is offline; cannot locate Maven 3.3.9
ERROR: qnode1 is offline; cannot locate JDK 1.8 (latest)
ERROR: qnode1 is offline; cannot locate Maven 3.3.9
ERROR: qnode1 is offline; cannot locate JDK 1.8 (latest)
ERROR: qnode1 is offline; cannot locate Maven 3.3.9
ERROR: qnode1 is offline; cannot locate JDK 1.8 (latest)
ERROR: qnode1 is offline; cannot locate Maven 3.3.9
ERROR: qnode1 is offline; cannot locate JDK 1.8 (latest)
ERROR: qnode1 is offline; cannot locate Maven 3.3.9
ERROR: qnode1 is offline; cannot locate JDK 1.8 (latest)
ERROR: qnode1 is offline; cannot locate Maven 3.3.9
ERROR: qnode1 is offline; cannot locate JDK 1.8 (latest)
ERROR: qnode1 is offline; cannot locate Maven 3.3.9
ERROR: qnode1 is offline; cannot locate JDK 1.8 (latest)
ERROR: qnode1 is offline; cannot locate Maven 3.3.9
ERROR: qnode1 is offline; cannot locate JDK 1.8 (latest)
ERROR: qnode1 is offline; cannot locate Maven 3.3.9
Sending e-mails to: commits@activemq.apache.org
[locks-and-latches] Releasing all the locks
[locks-and-latches] All the locks released
ERROR: Failed to parse POMs
java.io.IOException: Backing channel 'qnode1' is disconnected.
	at hudson.remoting.RemoteInvocationHandler.channelOrFail(RemoteInvocationHandler.java:192)
	at hudson.remoting.RemoteInvocationHandler.invoke(RemoteInvocationHandler.java:257)
	at com.sun.proxy.$Proxy131.isAlive(Unknown Source)
	at hudson.Launcher$RemoteLauncher$ProcImpl.isAlive(Launcher.java:1138)
	at hudson.maven.ProcessCache$MavenProcess.call(ProcessCache.java:166)
	at hudson.maven.MavenModuleSetBuild$MavenModuleSetBuildExecution.doRun(MavenModuleSetBuild.java:879)
	at hudson.model.AbstractBuild$AbstractBuildExecution.run(AbstractBuild.java:496)
	at hudson.model.Run.execute(Run.java:1737)
	at hudson.maven.MavenModuleSetBuild.run(MavenModuleSetBuild.java:543)
	at hudson.model.ResourceController.execute(ResourceController.java:97)
	at hudson.model.Executor.run(Executor.java:419)
Caused by: hudson.remoting.Channel$OrderlyShutdown: hudson.remoting.ProxyException: java.util.concurrent.TimeoutException:
Ping started at 1510318023371 hasn't completed by 1510318263372
	at hudson.remoting.Channel$CloseCommand.execute(Channel.java:1138)
	at hudson.remoting.Channel$1.handle(Channel.java:535)
	at hudson.remoting.SynchronousCommandTransport$ReaderThread.run(SynchronousCommandTransport.java:83)
Caused by: Command close created at
	at hudson.remoting.Command.<init>(Command.java:60)
	at hudson.remoting.Channel$CloseCommand.<init>(Channel.java:1132)
	at hudson.remoting.Channel$CloseCommand.<init>(Channel.java:1130)
	at hudson.remoting.Channel.close(Channel.java:1290)
	at hudson.slaves.ChannelPinger$1.onDead(ChannelPinger.java:180)
	at hudson.remoting.PingThread.ping(PingThread.java:130)
	at hudson.remoting.PingThread.run(PingThread.java:86)
Caused by: hudson.remoting.ProxyException: java.util.concurrent.TimeoutException: Ping started
at 1510318023371 hasn't completed by 1510318263372
	... 2 more
FATAL: channel is already closed
hudson.remoting.ProxyException: java.util.concurrent.TimeoutException: Ping started at 1510318023371
hasn't completed by 1510318263372
Caused: Command close created at
	at hudson.remoting.Command.<init>(Command.java:60)
	at hudson.remoting.Channel$CloseCommand.<init>(Channel.java:1132)
	at hudson.remoting.Channel$CloseCommand.<init>(Channel.java:1130)
	at hudson.remoting.Channel.close(Channel.java:1290)
	at hudson.slaves.ChannelPinger$1.onDead(ChannelPinger.java:180)
	at hudson.remoting.PingThread.ping(PingThread.java:130)
	at hudson.remoting.PingThread.run(PingThread.java:86)
Caused: hudson.remoting.Channel$OrderlyShutdown: hudson.remoting.ProxyException: java.util.concurrent.TimeoutException:
Ping started at 1510318023371 hasn't completed by 1510318263372
	at hudson.remoting.Channel$CloseCommand.execute(Channel.java:1138)
	at hudson.remoting.Channel$1.handle(Channel.java:535)
	at hudson.remoting.SynchronousCommandTransport$ReaderThread.run(SynchronousCommandTransport.java:83)
Caused: hudson.remoting.ChannelClosedException: channel is already closed
	at hudson.remoting.Channel.send(Channel.java:613)
	at hudson.remoting.Request.call(Request.java:130)
	at hudson.remoting.Channel.call(Channel.java:838)
	at hudson.Launcher$RemoteLauncher.kill(Launcher.java:1079)
	at hudson.model.AbstractBuild$AbstractBuildExecution.run(AbstractBuild.java:502)
	at hudson.model.Run.execute(Run.java:1737)
	at hudson.maven.MavenModuleSetBuild.run(MavenModuleSetBuild.java:543)
	at hudson.model.ResourceController.execute(ResourceController.java:97)
	at hudson.model.Executor.run(Executor.java:419)

Mime
View raw message