activemq-commits mailing list archives

Site index · List index
Message view « Date » · « Thread »
Top « Date » · « Thread »
From Apache Jenkins Server <jenk...@builds.apache.org>
Subject Build failed in Jenkins: ActiveMQ-Artemis-Master #1796
Date Thu, 03 May 2018 19:12:48 GMT
See <https://builds.apache.org/job/ActiveMQ-Artemis-Master/1796/display/redirect?page=changes>

Changes:

[tabish121] ARTEMIS-1847 Fix test after netty upgrade

------------------------------------------
[...truncated 324.82 KB...]
Running org.apache.activemq.artemis.core.server.files.FileStoreMonitorTest
[main] 19:09:06,895 INFO  [org.apache.activemq.artemis.core.server] **** start #test testSimpleTick()
***
tick:: / (/dev/sda1) usage::0.7457914421716174
under:: / (/dev/sda1) usage::0.7457914421716174
tick:: / (/dev/sda1) usage::1.0
over:: / (/dev/sda1) usage::1.0
[main] 19:09:06,899 INFO  [org.apache.activemq.artemis.core.server] **** end #test testSimpleTick()
***
[main] 19:09:06,899 INFO  [org.apache.activemq.artemis.core.server] **** start #test testScheduler()
***
TickS::0.7457914421716174
TickS::0.7457914421716174
TickS::0.7457914421716174
TickS::0.7457914421716174
TickS::0.7457914421716174
[main] 19:09:07,106 INFO  [org.apache.activemq.artemis.core.server] **** end #test testScheduler()
***
Tests run: 2, Failures: 0, Errors: 0, Skipped: 0, Time elapsed: 0.211 sec - in org.apache.activemq.artemis.core.server.files.FileStoreMonitorTest
Running org.apache.activemq.artemis.core.server.group.impl.ClusteredResetMockTest
[main] 19:09:07,108 INFO  [org.apache.activemq.artemis.core.server] **** start #test testMultipleSenders()
***
[main] 19:09:07,204 INFO  [org.apache.activemq.artemis.core.server] **** end #test testMultipleSenders()
***
Tests run: 1, Failures: 0, Errors: 0, Skipped: 0, Time elapsed: 0.097 sec - in org.apache.activemq.artemis.core.server.group.impl.ClusteredResetMockTest
Running org.apache.activemq.artemis.core.server.impl.CompositeAddressTest
Tests run: 1, Failures: 0, Errors: 0, Skipped: 0, Time elapsed: 0 sec - in org.apache.activemq.artemis.core.server.impl.CompositeAddressTest
Running org.apache.activemq.artemis.core.server.impl.EmbeddedServerTest
[main] 19:09:07,207 INFO  [org.apache.activemq.artemis.core.server] AMQ221000: live Message
Broker is starting with configuration Broker Configuration (clustered=false,journalDirectory=target/data/journal,bindingsDirectory=data/bindings,largeMessagesDirectory=data/largemessages,pagingDirectory=data/paging)
[main] 19:09:07,208 INFO  [org.apache.activemq.artemis.core.server] AMQ221043: Protocol module
found: [artemis-server]. Adding protocol support for: CORE
[main] 19:09:07,235 INFO  [org.apache.activemq.artemis.core.server] AMQ221007: Server is now
live
[main] 19:09:07,235 INFO  [org.apache.activemq.artemis.core.server] AMQ221001: Apache ActiveMQ
Artemis Message Broker version 2.6.0-SNAPSHOT [localhost, nodeID=73dca1f8-4f05-11e8-a9d8-0242ca825248]

[main] 19:09:07,239 INFO  [org.apache.activemq.artemis.core.server] AMQ221002: Apache ActiveMQ
Artemis Message Broker version 2.6.0-SNAPSHOT [73dca1f8-4f05-11e8-a9d8-0242ca825248] stopped,
uptime 0.031 seconds
[main] 19:09:07,240 INFO  [org.apache.activemq.artemis.core.server] AMQ221000: live Message
Broker is starting with configuration Broker Configuration (clustered=false,journalDirectory=target/data/journal,bindingsDirectory=data/bindings,largeMessagesDirectory=data/largemessages,pagingDirectory=data/paging)
[main] 19:09:07,241 INFO  [org.apache.activemq.artemis.core.server] AMQ221043: Protocol module
found: [artemis-server]. Adding protocol support for: CORE
[main] 19:09:07,250 INFO  [org.apache.activemq.artemis.core.server] AMQ221007: Server is now
live
[main] 19:09:07,250 INFO  [org.apache.activemq.artemis.core.server] AMQ221001: Apache ActiveMQ
Artemis Message Broker version 2.6.0-SNAPSHOT [localhost, nodeID=73e1ab0a-4f05-11e8-a9d8-0242ca825248]

[main] 19:09:07,255 INFO  [org.apache.activemq.artemis.core.server] AMQ221002: Apache ActiveMQ
Artemis Message Broker version 2.6.0-SNAPSHOT [73e1ab0a-4f05-11e8-a9d8-0242ca825248] stopped,
uptime 0.015 seconds
[main] 19:09:07,256 INFO  [org.apache.activemq.artemis.core.server] AMQ221000: live Message
Broker is starting with configuration Broker Configuration (clustered=false,journalDirectory=target/data/journal,bindingsDirectory=data/bindings,largeMessagesDirectory=data/largemessages,pagingDirectory=data/paging)
[main] 19:09:07,256 INFO  [org.apache.activemq.artemis.core.server] AMQ221043: Protocol module
found: [artemis-server]. Adding protocol support for: CORE
[main] 19:09:07,264 INFO  [org.apache.activemq.artemis.core.server] AMQ221007: Server is now
live
[main] 19:09:07,264 INFO  [org.apache.activemq.artemis.core.server] AMQ221001: Apache ActiveMQ
Artemis Message Broker version 2.6.0-SNAPSHOT [localhost, nodeID=73e41c0b-4f05-11e8-a9d8-0242ca825248]

[main] 19:09:07,265 INFO  [org.apache.activemq.artemis.core.server] AMQ221002: Apache ActiveMQ
Artemis Message Broker version 2.6.0-SNAPSHOT [73e41c0b-4f05-11e8-a9d8-0242ca825248] stopped,
uptime 0.010 seconds
Tests run: 2, Failures: 0, Errors: 0, Skipped: 0, Time elapsed: 0.059 sec - in org.apache.activemq.artemis.core.server.impl.EmbeddedServerTest
Running org.apache.activemq.artemis.core.server.impl.ScheduledDeliveryHandlerTest
Tests run: 6, Failures: 0, Errors: 0, Skipped: 0, Time elapsed: 1.247 sec - in org.apache.activemq.artemis.core.server.impl.ScheduledDeliveryHandlerTest
Running org.apache.activemq.artemis.core.server.impl.jdbc.JdbcLeaseLockTest
[main] 19:09:08,516 INFO  [org.apache.activemq.artemis.core.server] **** start #test shouldRenewExpiredLockNotAcquiredByOthers[create_tables_prior_test=true]()
***
[main] 19:09:19,638 INFO  [org.apache.activemq.artemis.core.server] **** end #test shouldRenewExpiredLockNotAcquiredByOthers[create_tables_prior_test=true]()
***
[main] 19:09:19,642 INFO  [org.apache.activemq.artemis.core.server] **** start #test shouldNotCorruptGuardedState[create_tables_prior_test=true]()
***
[main] 19:09:29,591 INFO  [org.apache.activemq.artemis.core.server] **** end #test shouldNotCorruptGuardedState[create_tables_prior_test=true]()
***
[main] 19:09:29,592 INFO  [org.apache.activemq.artemis.core.server] **** start #test shouldNotRenewLockAcquiredByOthers[create_tables_prior_test=true]()
***
[main] 19:09:40,355 INFO  [org.apache.activemq.artemis.core.server] **** end #test shouldNotRenewLockAcquiredByOthers[create_tables_prior_test=true]()
***
[main] 19:09:40,356 INFO  [org.apache.activemq.artemis.core.server] **** start #test shouldNotAcquireLockWhenAlreadyHeldByOthers[create_tables_prior_test=true]()
***
[main] 19:09:48,991 INFO  [org.apache.activemq.artemis.core.server] **** end #test shouldNotAcquireLockWhenAlreadyHeldByOthers[create_tables_prior_test=true]()
***
[main] 19:09:48,992 INFO  [org.apache.activemq.artemis.core.server] **** start #test shouldNotRenewReleasedLock[create_tables_prior_test=true]()
***
[main] 19:09:57,113 INFO  [org.apache.activemq.artemis.core.server] **** end #test shouldNotRenewReleasedLock[create_tables_prior_test=true]()
***
[main] 19:09:57,114 INFO  [org.apache.activemq.artemis.core.server] **** start #test shouldOtherAcquireExpiredLock[create_tables_prior_test=true]()
***
[main] 19:10:07,442 INFO  [org.apache.activemq.artemis.core.server] **** end #test shouldOtherAcquireExpiredLock[create_tables_prior_test=true]()
***
[main] 19:10:07,442 INFO  [org.apache.activemq.artemis.core.server] **** start #test shouldRenewAcquiredLock[create_tables_prior_test=true]()
***
[main] 19:10:16,247 INFO  [org.apache.activemq.artemis.core.server] **** end #test shouldRenewAcquiredLock[create_tables_prior_test=true]()
***
[main] 19:10:16,248 INFO  [org.apache.activemq.artemis.core.server] **** start #test shouldAcquireLock[create_tables_prior_test=true]()
***
[main] 19:10:24,709 INFO  [org.apache.activemq.artemis.core.server] **** end #test shouldAcquireLock[create_tables_prior_test=true]()
***
[main] 19:10:24,710 INFO  [org.apache.activemq.artemis.core.server] **** start #test shouldNotAcquireLockTwice[create_tables_prior_test=true]()
***
[main] 19:10:33,331 INFO  [org.apache.activemq.artemis.core.server] **** end #test shouldNotAcquireLockTwice[create_tables_prior_test=true]()
***
[main] 19:10:33,332 INFO  [org.apache.activemq.artemis.core.server] **** start #test shouldAcquireExpiredLock[create_tables_prior_test=true]()
***
[main] 19:10:44,218 INFO  [org.apache.activemq.artemis.core.server] **** end #test shouldAcquireExpiredLock[create_tables_prior_test=true]()
***
[main] 19:10:44,219 INFO  [org.apache.activemq.artemis.core.server] **** start #test shouldRenewExpiredLockNotAcquiredByOthers[create_tables_prior_test=false]()
***
[main] 19:10:55,337 INFO  [org.apache.activemq.artemis.core.server] **** end #test shouldRenewExpiredLockNotAcquiredByOthers[create_tables_prior_test=false]()
***
[main] 19:10:55,338 INFO  [org.apache.activemq.artemis.core.server] **** start #test shouldNotCorruptGuardedState[create_tables_prior_test=false]()
***
[main] 19:11:04,908 INFO  [org.apache.activemq.artemis.core.server] **** end #test shouldNotCorruptGuardedState[create_tables_prior_test=false]()
***
[main] 19:11:04,909 INFO  [org.apache.activemq.artemis.core.server] **** start #test shouldNotRenewLockAcquiredByOthers[create_tables_prior_test=false]()
***
[main] 19:11:15,844 INFO  [org.apache.activemq.artemis.core.server] **** end #test shouldNotRenewLockAcquiredByOthers[create_tables_prior_test=false]()
***
[main] 19:11:15,845 INFO  [org.apache.activemq.artemis.core.server] **** start #test shouldNotAcquireLockWhenAlreadyHeldByOthers[create_tables_prior_test=false]()
***
[main] 19:11:24,099 INFO  [org.apache.activemq.artemis.core.server] **** end #test shouldNotAcquireLockWhenAlreadyHeldByOthers[create_tables_prior_test=false]()
***
[main] 19:11:24,100 INFO  [org.apache.activemq.artemis.core.server] **** start #test shouldNotRenewReleasedLock[create_tables_prior_test=false]()
***
[main] 19:11:32,087 INFO  [org.apache.activemq.artemis.core.server] **** end #test shouldNotRenewReleasedLock[create_tables_prior_test=false]()
***
[main] 19:11:32,088 INFO  [org.apache.activemq.artemis.core.server] **** start #test shouldOtherAcquireExpiredLock[create_tables_prior_test=false]()
***
[main] 19:11:41,975 INFO  [org.apache.activemq.artemis.core.server] **** end #test shouldOtherAcquireExpiredLock[create_tables_prior_test=false]()
***
[main] 19:11:41,976 INFO  [org.apache.activemq.artemis.core.server] **** start #test shouldRenewAcquiredLock[create_tables_prior_test=false]()
***
[main] 19:11:49,829 INFO  [org.apache.activemq.artemis.core.server] **** end #test shouldRenewAcquiredLock[create_tables_prior_test=false]()
***
[main] 19:11:49,830 INFO  [org.apache.activemq.artemis.core.server] **** start #test shouldAcquireLock[create_tables_prior_test=false]()
***
[main] 19:11:57,001 INFO  [org.apache.activemq.artemis.core.server] **** end #test shouldAcquireLock[create_tables_prior_test=false]()
***
[main] 19:11:57,002 INFO  [org.apache.activemq.artemis.core.server] **** start #test shouldNotAcquireLockTwice[create_tables_prior_test=false]()
***
[main] 19:12:04,848 INFO  [org.apache.activemq.artemis.core.server] **** end #test shouldNotAcquireLockTwice[create_tables_prior_test=false]()
***
[main] 19:12:04,848 INFO  [org.apache.activemq.artemis.core.server] **** start #test shouldAcquireExpiredLock[create_tables_prior_test=false]()
***
[main] 19:12:14,677 INFO  [org.apache.activemq.artemis.core.server] **** end #test shouldAcquireExpiredLock[create_tables_prior_test=false]()
***
Tests run: 20, Failures: 0, Errors: 0, Skipped: 0, Time elapsed: 186.163 sec - in org.apache.activemq.artemis.core.server.impl.jdbc.JdbcLeaseLockTest
Running org.apache.activemq.artemis.core.server.impl.jdbc.JdbcSharedStateManagerTest
[main] 19:12:14,680 INFO  [org.apache.activemq.artemis.core.server] **** start #test shouldStartTwoIfTableNotExist()
***
[main] 19:12:22,424 INFO  [org.apache.activemq.artemis.core.server] **** end #test shouldStartTwoIfTableNotExist()
***
[main] 19:12:22,424 INFO  [org.apache.activemq.artemis.core.server] **** start #test shouldStartIfTableNotExist()
***
[main] 19:12:30,854 INFO  [org.apache.activemq.artemis.core.server] **** end #test shouldStartIfTableNotExist()
***
[main] 19:12:30,855 INFO  [org.apache.activemq.artemis.core.server] **** start #test shouldStartIfTableExistInitialized()
***
[main] 19:12:38,249 INFO  [org.apache.activemq.artemis.core.server] **** end #test shouldStartIfTableExistInitialized()
***
[main] 19:12:38,250 INFO  [org.apache.activemq.artemis.core.server] **** start #test shouldStartIfTableExistEmpty()
***
[main] 19:12:45,550 INFO  [org.apache.activemq.artemis.core.server] **** end #test shouldStartIfTableExistEmpty()
***
Tests run: 4, Failures: 0, Errors: 0, Skipped: 0, Time elapsed: 30.871 sec - in org.apache.activemq.artemis.core.server.impl.jdbc.JdbcSharedStateManagerTest
Running org.apache.activemq.artemis.core.server.management.JMXAccessControlListTest
Tests run: 14, Failures: 0, Errors: 0, Skipped: 0, Time elapsed: 0.012 sec - in org.apache.activemq.artemis.core.server.management.JMXAccessControlListTest
Running org.apache.activemq.artemis.core.settings.AddressSettingsTest
[main] 19:12:45,565 INFO  [org.apache.activemq.artemis.core.server] **** start #test testMultipleMergeAll()
***
[main] 19:12:45,568 INFO  [org.apache.activemq.artemis.core.server] **** end #test testMultipleMergeAll()
***
[main] 19:12:45,569 INFO  [org.apache.activemq.artemis.core.server] **** start #test testMultipleMerge()
***
[main] 19:12:45,571 INFO  [org.apache.activemq.artemis.core.server] **** end #test testMultipleMerge()
***
[main] 19:12:45,572 INFO  [org.apache.activemq.artemis.core.server] **** start #test testDefaults()
***
[main] 19:12:45,575 INFO  [org.apache.activemq.artemis.core.server] **** end #test testDefaults()
***
[main] 19:12:45,576 INFO  [org.apache.activemq.artemis.core.server] **** start #test testSingleMerge()
***
[main] 19:12:45,578 INFO  [org.apache.activemq.artemis.core.server] **** end #test testSingleMerge()
***
Tests run: 4, Failures: 0, Errors: 0, Skipped: 0, Time elapsed: 0.014 sec - in org.apache.activemq.artemis.core.settings.AddressSettingsTest
Running org.apache.activemq.artemis.core.settings.RepositoryTest
[main] 19:12:45,580 INFO  [org.apache.activemq.artemis.core.server] **** start #test testMultipleWildcards()
***
[main] 19:12:45,586 INFO  [org.apache.activemq.artemis.core.server] **** end #test testMultipleWildcards()
***
[main] 19:12:45,586 INFO  [org.apache.activemq.artemis.core.server] **** start #test testMatchingDocs()
***
[main] 19:12:45,589 INFO  [org.apache.activemq.artemis.core.server] **** end #test testMatchingDocs()
***
[main] 19:12:45,589 INFO  [org.apache.activemq.artemis.core.server] **** start #test testWithoutWildcard()
***
[main] 19:12:45,591 INFO  [org.apache.activemq.artemis.core.server] **** end #test testWithoutWildcard()
***
[main] 19:12:45,591 INFO  [org.apache.activemq.artemis.core.server] **** start #test testSingletwo()
***
[main] 19:12:45,593 INFO  [org.apache.activemq.artemis.core.server] **** end #test testSingletwo()
***
[main] 19:12:45,594 INFO  [org.apache.activemq.artemis.core.server] **** start #test testIllegalMatches()
***
[main] 19:12:45,597 INFO  [org.apache.activemq.artemis.core.server] **** end #test testIllegalMatches()
***
[main] 19:12:45,597 INFO  [org.apache.activemq.artemis.core.server] **** start #test testAddListener()
***
[main] 19:12:45,600 INFO  [org.apache.activemq.artemis.core.server] **** end #test testAddListener()
***
[main] 19:12:45,600 INFO  [org.apache.activemq.artemis.core.server] **** start #test testDefault()
***
[main] 19:12:45,602 INFO  [org.apache.activemq.artemis.core.server] **** end #test testDefault()
***
[main] 19:12:45,602 INFO  [org.apache.activemq.artemis.core.server] **** start #test testMatchingDocsCustomUnderscorDelimiter()
***
[main] 19:12:45,604 INFO  [org.apache.activemq.artemis.core.server] **** end #test testMatchingDocsCustomUnderscorDelimiter()
***
[main] 19:12:45,605 INFO  [org.apache.activemq.artemis.core.server] **** start #test testSingleMatch()
***
[main] 19:12:45,606 INFO  [org.apache.activemq.artemis.core.server] **** end #test testSingleMatch()
***
[main] 19:12:45,606 INFO  [org.apache.activemq.artemis.core.server] **** start #test testRepositoryMerge()
***
[main] 19:12:45,609 INFO  [org.apache.activemq.artemis.core.server] **** end #test testRepositoryMerge()
***
[main] 19:12:45,610 INFO  [org.apache.activemq.artemis.core.server] **** start #test testMatchingDocsCustomForwardSlashDelimiter()
***
[main] 19:12:45,613 INFO  [org.apache.activemq.artemis.core.server] **** end #test testMatchingDocsCustomForwardSlashDelimiter()
***
Tests run: 11, Failures: 0, Errors: 0, Skipped: 0, Time elapsed: 0.034 sec - in org.apache.activemq.artemis.core.settings.RepositoryTest
Running org.apache.activemq.artemis.core.transaction.impl.TransactionImplTest
[main] 19:12:45,614 INFO  [org.apache.activemq.artemis.core.server] **** start #test testTimeoutThenRollbackWithRollback()
***
rollback...
[main] 19:12:45,623 INFO  [org.apache.activemq.artemis.core.server] **** end #test testTimeoutThenRollbackWithRollback()
***
[main] 19:12:45,623 INFO  [org.apache.activemq.artemis.core.server] **** start #test testTimeoutAndThenCommitWithARollback()
***
rollback...
[main] 19:12:45,625 INFO  [org.apache.activemq.artemis.core.server] **** end #test testTimeoutAndThenCommitWithARollback()
***
Tests run: 2, Failures: 0, Errors: 0, Skipped: 0, Time elapsed: 0.011 sec - in org.apache.activemq.artemis.core.transaction.impl.TransactionImplTest
Running org.apache.activemq.artemis.core.version.impl.VersionImplTest
Tests run: 3, Failures: 0, Errors: 0, Skipped: 0, Time elapsed: 0.002 sec - in org.apache.activemq.artemis.core.version.impl.VersionImplTest
Running org.apache.activemq.artemis.spi.core.security.jaas.Krb5LoginModuleTest
Tests run: 2, Failures: 0, Errors: 0, Skipped: 0, Time elapsed: 0.003 sec - in org.apache.activemq.artemis.spi.core.security.jaas.Krb5LoginModuleTest
Running org.apache.activemq.artemis.tests.util.SimpleStringTest
Tests run: 20, Failures: 0, Errors: 1, Skipped: 0, Time elapsed: 0.533 sec <<< FAILURE!
- in org.apache.activemq.artemis.tests.util.SimpleStringTest
testByteBufSimpleStringPool(org.apache.activemq.artemis.tests.util.SimpleStringTest)  Time
elapsed: 0.009 sec  <<< ERROR!
java.lang.IndexOutOfBoundsException: writerIndex: 0 (expected: readerIndex(6) <= writerIndex
<= capacity(6))
	at io.netty.buffer.AbstractByteBuf.writerIndex(AbstractByteBuf.java:118)
	at io.netty.buffer.AbstractByteBuf.resetWriterIndex(AbstractByteBuf.java:198)
	at org.apache.activemq.artemis.tests.util.SimpleStringTest.testByteBufSimpleStringPool(SimpleStringTest.java:416)

Running org.apache.activemq.artemis.uri.AcceptorParserTest
config:TransportConfiguration(name=test, factory=org-apache-activemq-artemis-core-remoting-impl-netty-NettyAcceptorFactory)
?tcpReceiveBufferSize=1048576&port=8080&host=localhost&protocols=openwire&tcpSendBufferSize=1048576&banana=x
config:TransportConfiguration(name=test, factory=org-apache-activemq-artemis-core-remoting-impl-netty-NettyAcceptorFactory)
?tcpReceiveBufferSize=1048576&port=5672&host=0-0-0-0&tcpSendBufferSize=1048576&virtualTopicConsumerWildcards=Consumer-*->;2
Consumer.*.>;2
Tests run: 2, Failures: 0, Errors: 0, Skipped: 0, Time elapsed: 0 sec - in org.apache.activemq.artemis.uri.AcceptorParserTest
Running org.apache.activemq.artemis.uri.ClusterConnectionConfigurationTest
Tests run: 5, Failures: 0, Errors: 0, Skipped: 0, Time elapsed: 0.005 sec - in org.apache.activemq.artemis.uri.ClusterConnectionConfigurationTest

Results :

Tests in error: 
  SimpleStringTest.testByteBufSimpleStringPool:416 ยป IndexOutOfBounds writerInde...

Tests run: 266, Failures: 0, Errors: 1, Skipped: 0

[INFO] ------------------------------------------------------------------------
[INFO] Reactor Summary:
[INFO] 
[INFO] ActiveMQ Artemis Parent ............................ SUCCESS [  3.675 s]
[INFO] ActiveMQ Artemis Commons ........................... SUCCESS [ 20.304 s]
[INFO] ActiveMQ Artemis Core Client ....................... SUCCESS [  9.427 s]
[INFO] ActiveMQ Artemis Selector Implementation ........... SUCCESS [  2.604 s]
[INFO] ActiveMQ Artemis JMS Client ........................ SUCCESS [  3.620 s]
[INFO] ActiveMQ Artemis Native POM ........................ SUCCESS [  7.974 s]
[INFO] ActiveMQ Artemis Journal ........................... SUCCESS [  2.676 s]
[INFO] ActiveMQ Artemis JDBC Store ........................ SUCCESS [ 29.644 s]
[INFO] ActiveMQ Artemis Server ............................ FAILURE [05:18 min]
[INFO] ActiveMQ Artemis Protocols ......................... SKIPPED
[INFO] ActiveMQ Artemis AMQP Protocol ..................... SKIPPED
[INFO] ActiveMQ Artemis STOMP Protocol .................... SKIPPED
[INFO] ActiveMQ Artemis OpenWire Protocol ................. SKIPPED
[INFO] ActiveMQ Artemis HQClient Protocol ................. SKIPPED
[INFO] ActiveMQ Artemis HornetQ Protocol .................. SKIPPED
[INFO] ActiveMQ Artemis MQTT Protocol ..................... SKIPPED
[INFO] ActiveMQ Artemis DTO ............................... SKIPPED
[INFO] ActiveMQ Artemis Service Extensions ................ SKIPPED
[INFO] ActiveMQ Artemis JMS Server ........................ SKIPPED
[INFO] ActiveMQ Artemis CDI Integration ................... SKIPPED
[INFO] ActiveMQ Artemis Boot .............................. SKIPPED
[INFO] ActiveMQ Artemis Tools ............................. SKIPPED
[INFO] ActiveMQ Artemis CLI ............................... SKIPPED
[INFO] ActiveMQ Artemis Web ............................... SKIPPED
[INFO] ActiveMQ Artemis Web ............................... SKIPPED
[INFO] ActiveMQ Artemis Core Client All ................... SKIPPED
[INFO] ActiveMQ Artemis Client OSGi ....................... SKIPPED
[INFO] ActiveMQ Artemis JUnit Rules ....................... SKIPPED
[INFO] ActiveMQ Artemis JMS Client All .................... SKIPPED
[INFO] ActiveMQ Artemis JMS Client OSGi ................... SKIPPED
[INFO] ActiveMQ Artemis RAR POM ........................... SKIPPED
[INFO] ActiveMQ Artemis REST Interface Implementation ..... SKIPPED
[INFO] ActiveMQ Artemis Maven Plugin ...................... SKIPPED
[INFO] ActiveMQ Artemis Server OSGi ....................... SKIPPED
[INFO] ActiveMQ Artemis Cons .............................. SKIPPED
[INFO] ActiveMQ Artemis HawtIO Branding ................... SKIPPED
[INFO] ActiveMQ Artemis HawtIO Plugin ..................... SKIPPED
[INFO] ActiveMQ Artemis Console ........................... SKIPPED
[INFO] ActiveMQ Artemis Spring Integration ................ SKIPPED
[INFO] Apache ActiveMQ Artemis Distribution ............... SKIPPED
[INFO] ActiveMQ Artemis Tests POM ......................... SKIPPED
[INFO] ActiveMQ Artemis Test Support ...................... SKIPPED
[INFO] ActiveMQ Artemis Unit Tests ........................ SKIPPED
[INFO] ActiveMQ Artemis Joram Tests ....................... SKIPPED
[INFO] ActiveMQ Artemis timing Tests ...................... SKIPPED
[INFO] ActiveMQ Artemis JMS Tests ......................... SKIPPED
[INFO] ActiveMQ Artemis Features .......................... SKIPPED
[INFO] ActiveMQ Artemis Integration Tests ................. SKIPPED
[INFO] ActiveMQ Artemis Client Integration Tests .......... SKIPPED
[INFO] ActiveMQ Artemis Compatibility Tests ............... SKIPPED
[INFO] ActiveMQ Artemis soak Tests ........................ SKIPPED
[INFO] ActiveMQ Artemis stress Tests ...................... SKIPPED
[INFO] ActiveMQ Artemis performance Tests ................. SKIPPED
[INFO] Smoke Tests ........................................ SKIPPED
[INFO] ActiveMQ Artemis Extra Tests ....................... SKIPPED
[INFO] ------------------------------------------------------------------------
[INFO] BUILD FAILURE
[INFO] ------------------------------------------------------------------------
[INFO] Total time: 06:40 min
[INFO] Finished at: 2018-05-03T19:12:46+00:00
[INFO] Final Memory: 204M/3482M
[INFO] ------------------------------------------------------------------------
[ERROR] Failed to execute goal org.apache.maven.plugins:maven-surefire-plugin:2.18.1:test
(default-test) on project artemis-server: There are test failures.
[ERROR] 
[ERROR] Please refer to <https://builds.apache.org/job/ActiveMQ-Artemis-Master/ws/artemis-server/target/surefire-reports>
for the individual test results.
[ERROR] -> [Help 1]
[ERROR] 
[ERROR] To see the full stack trace of the errors, re-run Maven with the -e switch.
[ERROR] Re-run Maven using the -X switch to enable full debug logging.
[ERROR] 
[ERROR] For more information about the errors and possible solutions, please read the following
articles:
[ERROR] [Help 1] http://cwiki.apache.org/confluence/display/MAVEN/MojoFailureException
[ERROR] 
[ERROR] After correcting the problems, you can resume the build with the command
[ERROR]   mvn <goals> -rf :artemis-server
Build step 'Invoke top-level Maven targets' marked build as failure
Performing Post build task...
Could not match :Too many files with unapproved license  : False
Logical operation result is FALSE
Skipping script  : cat ratReport.txt
END OF POST BUILD TASK 	: 0
Recording test results
Not sending mail to unregistered user tabish121@gmail.com

Mime
View raw message