activemq-commits mailing list archives

Site index · List index
Message view « Date » · « Thread »
Top « Date » · « Thread »
From Apache Jenkins Server <jenk...@builds.apache.org>
Subject Build failed in Jenkins: ActiveMQ-Artemis-Master #1789
Date Thu, 03 May 2018 02:39:44 GMT
See <https://builds.apache.org/job/ActiveMQ-Artemis-Master/1789/display/redirect?page=changes>

Changes:

[clebertsuconic] NO-JIRA Partially Revert "NO-JIRA Removing Wrong assertion"

------------------------------------------
[...truncated 2.99 MB...]

org.objectweb.jtests.jms.conform.selector.SelectorTest.testStringLiterals(org.objectweb.jtests.jms.conform.selector.SelectorTest)
  Run 1: SelectorTest>PTPTestCase.setUp:107->JMSTestCase.setUp:96 » ActiveMQNotConnected
  Run 2: SelectorTest>PTPTestCase.tearDown:164->JMSTestCase.tearDown:102 » NullPointer
  Run 3: PASS

org.objectweb.jtests.jms.conform.session.QueueSessionTest.testCreateBrowser_1(org.objectweb.jtests.jms.conform.session.QueueSessionTest)
  Run 1: QueueSessionTest>PTPTestCase.setUp:107->JMSTestCase.setUp:96 » ActiveMQNotConnected
  Run 2: QueueSessionTest>PTPTestCase.tearDown:164->JMSTestCase.tearDown:102 » NullPointer
  Run 3: PASS

org.objectweb.jtests.jms.conform.session.QueueSessionTest.testCreateBrowser_2(org.objectweb.jtests.jms.conform.session.QueueSessionTest)
  Run 1: QueueSessionTest>PTPTestCase.setUp:107->JMSTestCase.setUp:96 » ActiveMQNotConnected
  Run 2: QueueSessionTest>PTPTestCase.tearDown:164->JMSTestCase.tearDown:102 » NullPointer
  Run 3: PASS

org.objectweb.jtests.jms.conform.session.QueueSessionTest.testCreateReceiver_1(org.objectweb.jtests.jms.conform.session.QueueSessionTest)
  Run 1: QueueSessionTest>PTPTestCase.setUp:107->JMSTestCase.setUp:96 » ActiveMQNotConnected
  Run 2: QueueSessionTest>PTPTestCase.tearDown:164->JMSTestCase.tearDown:102 » NullPointer
  Run 3: PASS

org.objectweb.jtests.jms.conform.session.QueueSessionTest.testCreateReceiver_2(org.objectweb.jtests.jms.conform.session.QueueSessionTest)
  Run 1: QueueSessionTest>PTPTestCase.setUp:107->JMSTestCase.setUp:96 » ActiveMQNotConnected
  Run 2: QueueSessionTest>PTPTestCase.tearDown:164->JMSTestCase.tearDown:102 » NullPointer
  Run 3: PASS

org.objectweb.jtests.jms.conform.session.QueueSessionTest.testRollbackRececeivedMessage(org.objectweb.jtests.jms.conform.session.QueueSessionTest)
  Run 1: QueueSessionTest>PTPTestCase.setUp:107->JMSTestCase.setUp:96 » ActiveMQNotConnected
  Run 2: QueueSessionTest>PTPTestCase.tearDown:164->JMSTestCase.tearDown:102 » NullPointer
  Run 3: PASS

org.objectweb.jtests.jms.conform.session.SessionTest.testAcknowledge(org.objectweb.jtests.jms.conform.session.SessionTest)
  Run 1: SessionTest>PTPTestCase.setUp:107->JMSTestCase.setUp:96 » ActiveMQNotConnected
  Run 2: SessionTest>PTPTestCase.tearDown:164->JMSTestCase.tearDown:102 » NullPointer
  Run 3: PASS

org.objectweb.jtests.jms.conform.session.SessionTest.testCloseClosedSession(org.objectweb.jtests.jms.conform.session.SessionTest)
  Run 1: SessionTest>PTPTestCase.setUp:107->JMSTestCase.setUp:96 » ActiveMQNotConnected
  Run 2: SessionTest>PTPTestCase.tearDown:164->JMSTestCase.tearDown:102 » NullPointer
  Run 3: PASS

org.objectweb.jtests.jms.conform.session.SessionTest.testCommitNonTransactedSession(org.objectweb.jtests.jms.conform.session.SessionTest)
  Run 1: SessionTest>PTPTestCase.setUp:107->JMSTestCase.setUp:96 » ActiveMQNotConnected
  Run 2: SessionTest>PTPTestCase.tearDown:164->JMSTestCase.tearDown:102 » NullPointer
  Run 3: PASS

org.objectweb.jtests.jms.conform.session.SessionTest.testCommitTransactedSession(org.objectweb.jtests.jms.conform.session.SessionTest)
  Run 1: SessionTest>PTPTestCase.setUp:107->JMSTestCase.setUp:96 » ActiveMQNotConnected
  Run 2: SessionTest>PTPTestCase.tearDown:164->JMSTestCase.tearDown:102 » NullPointer
  Run 3: PASS

org.objectweb.jtests.jms.conform.session.SessionTest.testGetTransacted(org.objectweb.jtests.jms.conform.session.SessionTest)
  Run 1: SessionTest>PTPTestCase.setUp:107->JMSTestCase.setUp:96 » ActiveMQNotConnected
  Run 2: SessionTest>PTPTestCase.tearDown:164->JMSTestCase.tearDown:102 » NullPointer
  Run 3: PASS

org.objectweb.jtests.jms.conform.session.SessionTest.testRecoverTransactedSession(org.objectweb.jtests.jms.conform.session.SessionTest)
  Run 1: SessionTest>PTPTestCase.setUp:107->JMSTestCase.setUp:96 » ActiveMQNotConnected
  Run 2: SessionTest>PTPTestCase.tearDown:164->JMSTestCase.tearDown:102 » NullPointer
  Run 3: PASS

org.objectweb.jtests.jms.conform.session.SessionTest.testRollbackNonTransactedSession(org.objectweb.jtests.jms.conform.session.SessionTest)
  Run 1: SessionTest>PTPTestCase.setUp:107->JMSTestCase.setUp:96 » ActiveMQNotConnected
  Run 2: SessionTest>PTPTestCase.tearDown:164->JMSTestCase.tearDown:102 » NullPointer
  Run 3: PASS

org.objectweb.jtests.jms.conform.session.SessionTest.testRollbackTransactedSession(org.objectweb.jtests.jms.conform.session.SessionTest)
  Run 1: SessionTest>PTPTestCase.setUp:107->JMSTestCase.setUp:96 » ActiveMQNotConnected
  Run 2: SessionTest>PTPTestCase.tearDown:164->JMSTestCase.tearDown:102 » NullPointer
  Run 3: PASS

org.objectweb.jtests.jms.conform.session.SessionTest.testUseMessage(org.objectweb.jtests.jms.conform.session.SessionTest)
  Run 1: SessionTest>PTPTestCase.setUp:107->JMSTestCase.setUp:96 » ActiveMQNotConnected
  Run 2: SessionTest>PTPTestCase.tearDown:164->JMSTestCase.tearDown:102 » NullPointer
  Run 3: PASS

org.objectweb.jtests.jms.conform.session.SessionTest.testUsedClosedSession(org.objectweb.jtests.jms.conform.session.SessionTest)
  Run 1: SessionTest>PTPTestCase.setUp:107->JMSTestCase.setUp:96 » ActiveMQNotConnected
  Run 2: SessionTest>PTPTestCase.tearDown:164->JMSTestCase.tearDown:102 » NullPointer
  Run 3: PASS

org.objectweb.jtests.jms.conform.session.TopicSessionTest.testCreateDurableSubscriber_1(org.objectweb.jtests.jms.conform.session.TopicSessionTest)
  Run 1: TopicSessionTest>PubSubTestCase.setUp:107->JMSTestCase.setUp:96 » ActiveMQNotConnected
  Run 2: TopicSessionTest>PubSubTestCase.tearDown:165->JMSTestCase.tearDown:102 » NullPointer
  Run 3: PASS

org.objectweb.jtests.jms.conform.session.TopicSessionTest.testCreateDurableSubscriber_2(org.objectweb.jtests.jms.conform.session.TopicSessionTest)
  Run 1: TopicSessionTest>PubSubTestCase.setUp:107->JMSTestCase.setUp:96 » ActiveMQNotConnected
  Run 2: TopicSessionTest>PubSubTestCase.tearDown:165->JMSTestCase.tearDown:102 » NullPointer
  Run 3: PASS

org.objectweb.jtests.jms.conform.session.TopicSessionTest.testCreateSubscriber_1(org.objectweb.jtests.jms.conform.session.TopicSessionTest)
  Run 1: TopicSessionTest>PubSubTestCase.setUp:107->JMSTestCase.setUp:96 » ActiveMQNotConnected
  Run 2: TopicSessionTest>PubSubTestCase.tearDown:165->JMSTestCase.tearDown:102 » NullPointer
  Run 3: PASS

org.objectweb.jtests.jms.conform.session.TopicSessionTest.testCreateSubscriber_2(org.objectweb.jtests.jms.conform.session.TopicSessionTest)
  Run 1: TopicSessionTest>PubSubTestCase.setUp:107->JMSTestCase.setUp:96 » ActiveMQNotConnected
  Run 2: TopicSessionTest>PubSubTestCase.tearDown:165->JMSTestCase.tearDown:102 » NullPointer
  Run 3: PASS

org.objectweb.jtests.jms.conform.session.TopicSessionTest.testDurableSubscriber(org.objectweb.jtests.jms.conform.session.TopicSessionTest)
  Run 1: TopicSessionTest>PubSubTestCase.setUp:107->JMSTestCase.setUp:96 » ActiveMQNotConnected
  Run 2: TopicSessionTest>PubSubTestCase.tearDown:165->JMSTestCase.tearDown:102 » NullPointer
  Run 3: PASS

org.objectweb.jtests.jms.conform.session.TopicSessionTest.testRollbackReceivedMessage(org.objectweb.jtests.jms.conform.session.TopicSessionTest)
  Run 1: TopicSessionTest>PubSubTestCase.setUp:107->JMSTestCase.setUp:96 » ActiveMQNotConnected
  Run 2: TopicSessionTest>PubSubTestCase.tearDown:165->JMSTestCase.tearDown:102 » NullPointer
  Run 3: PASS

org.objectweb.jtests.jms.conform.session.TopicSessionTest.testUnsubscribe(org.objectweb.jtests.jms.conform.session.TopicSessionTest)
  Run 1: TopicSessionTest>PubSubTestCase.setUp:107->JMSTestCase.setUp:96 » ActiveMQNotConnected
  Run 2: TopicSessionTest>PubSubTestCase.tearDown:165->JMSTestCase.tearDown:102 » NullPointer
  Run 3: PASS

org.objectweb.jtests.jms.conform.session.UnifiedSessionTest.testCreateBrowserOnTopicSession(org.objectweb.jtests.jms.conform.session.UnifiedSessionTest)
  Run 1: UnifiedSessionTest.setUp:217->UnifiedTestCase.setUp:152->JMSTestCase.setUp:96
» ActiveMQNotConnected
  Run 2: UnifiedSessionTest.tearDown:243->UnifiedTestCase.tearDown:233->JMSTestCase.tearDown:102
» NullPointer
  Run 3: PASS

org.objectweb.jtests.jms.conform.session.UnifiedSessionTest.testCreateDurableConnectionConsumerOnQueueConnection(org.objectweb.jtests.jms.conform.session.UnifiedSessionTest)
  Run 1: UnifiedSessionTest.setUp:217->UnifiedTestCase.setUp:152->JMSTestCase.setUp:96
» ActiveMQNotConnected
  Run 2: UnifiedSessionTest.tearDown:243->UnifiedTestCase.tearDown:233->JMSTestCase.tearDown:102
» NullPointer
  Run 3: PASS

org.objectweb.jtests.jms.conform.session.UnifiedSessionTest.testCreateDurableSubscriberOnQueueSession(org.objectweb.jtests.jms.conform.session.UnifiedSessionTest)
  Run 1: UnifiedSessionTest.setUp:217->UnifiedTestCase.setUp:152->JMSTestCase.setUp:96
» ActiveMQNotConnected
  Run 2: UnifiedSessionTest.tearDown:243->UnifiedTestCase.tearDown:233->JMSTestCase.tearDown:102
» NullPointer
  Run 3: PASS

org.objectweb.jtests.jms.conform.session.UnifiedSessionTest.testCreateQueueOnTopicSession(org.objectweb.jtests.jms.conform.session.UnifiedSessionTest)
  Run 1: UnifiedSessionTest.setUp:217->UnifiedTestCase.setUp:152->JMSTestCase.setUp:96
» ActiveMQNotConnected
  Run 2: UnifiedSessionTest.tearDown:243->UnifiedTestCase.tearDown:233->JMSTestCase.tearDown:102
» NullPointer
  Run 3: PASS

org.objectweb.jtests.jms.conform.session.UnifiedSessionTest.testCreateTemporaryQueueOnTopicSession(org.objectweb.jtests.jms.conform.session.UnifiedSessionTest)
  Run 1: UnifiedSessionTest.setUp:217->UnifiedTestCase.setUp:152->JMSTestCase.setUp:96
» ActiveMQNotConnected
  Run 2: UnifiedSessionTest.tearDown:243->UnifiedTestCase.tearDown:233->JMSTestCase.tearDown:102
» NullPointer
  Run 3: PASS

org.objectweb.jtests.jms.conform.session.UnifiedSessionTest.testCreateTemporaryTopicOnQueueSession(org.objectweb.jtests.jms.conform.session.UnifiedSessionTest)
  Run 1: UnifiedSessionTest.setUp:217->UnifiedTestCase.setUp:152->JMSTestCase.setUp:96
» ActiveMQNotConnected
  Run 2: UnifiedSessionTest.tearDown:243->UnifiedTestCase.tearDown:233->JMSTestCase.tearDown:102
» NullPointer
  Run 3: PASS

org.objectweb.jtests.jms.conform.session.UnifiedSessionTest.testCreateTopicOnQueueSession(org.objectweb.jtests.jms.conform.session.UnifiedSessionTest)
  Run 1: UnifiedSessionTest.setUp:217->UnifiedTestCase.setUp:152->JMSTestCase.setUp:96
» ActiveMQNotConnected
  Run 2: UnifiedSessionTest.tearDown:243->UnifiedTestCase.tearDown:233->JMSTestCase.tearDown:102
» NullPointer
  Run 3: PASS

org.objectweb.jtests.jms.conform.session.UnifiedSessionTest.testUnsubscribeOnQueueSession(org.objectweb.jtests.jms.conform.session.UnifiedSessionTest)
  Run 1: UnifiedSessionTest.setUp:217->UnifiedTestCase.setUp:152->JMSTestCase.setUp:96
» ActiveMQNotConnected
  Run 2: UnifiedSessionTest.tearDown:243->UnifiedTestCase.tearDown:233->JMSTestCase.tearDown:102
» NullPointer
  Run 3: PASS

org.objectweb.jtests.jms.conform.topic.TemporaryTopicTest.testTemporaryTopic(org.objectweb.jtests.jms.conform.topic.TemporaryTopicTest)
  Run 1: TemporaryTopicTest>PubSubTestCase.setUp:107->JMSTestCase.setUp:96 » ActiveMQNotConnected
  Run 2: TemporaryTopicTest>PubSubTestCase.tearDown:165->JMSTestCase.tearDown:102 »
NullPointer
  Run 3: PASS


Tests run: 196, Failures: 0, Errors: 196, Skipped: 0

[INFO] ------------------------------------------------------------------------
[INFO] Reactor Summary:
[INFO] 
[INFO] ActiveMQ Artemis Parent ............................ SUCCESS [  4.646 s]
[INFO] ActiveMQ Artemis Commons ........................... SUCCESS [ 20.236 s]
[INFO] ActiveMQ Artemis Core Client ....................... SUCCESS [ 12.653 s]
[INFO] ActiveMQ Artemis Selector Implementation ........... SUCCESS [  4.257 s]
[INFO] ActiveMQ Artemis JMS Client ........................ SUCCESS [  4.916 s]
[INFO] ActiveMQ Artemis Native POM ........................ SUCCESS [ 11.655 s]
[INFO] ActiveMQ Artemis Journal ........................... SUCCESS [  4.043 s]
[INFO] ActiveMQ Artemis JDBC Store ........................ SUCCESS [ 43.938 s]
[INFO] ActiveMQ Artemis Server ............................ SUCCESS [06:28 min]
[INFO] ActiveMQ Artemis Protocols ......................... SUCCESS [  0.141 s]
[INFO] ActiveMQ Artemis AMQP Protocol ..................... SUCCESS [  5.515 s]
[INFO] ActiveMQ Artemis STOMP Protocol .................... SUCCESS [  2.523 s]
[INFO] ActiveMQ Artemis OpenWire Protocol ................. SUCCESS [  2.697 s]
[INFO] ActiveMQ Artemis HQClient Protocol ................. SUCCESS [  0.878 s]
[INFO] ActiveMQ Artemis HornetQ Protocol .................. SUCCESS [  1.346 s]
[INFO] ActiveMQ Artemis MQTT Protocol ..................... SUCCESS [  2.113 s]
[INFO] ActiveMQ Artemis DTO ............................... SUCCESS [  2.942 s]
[INFO] ActiveMQ Artemis Service Extensions ................ SUCCESS [  2.103 s]
[INFO] ActiveMQ Artemis JMS Server ........................ SUCCESS [  2.455 s]
[INFO] ActiveMQ Artemis CDI Integration ................... SUCCESS [  5.577 s]
[INFO] ActiveMQ Artemis Boot .............................. SUCCESS [  0.305 s]
[INFO] ActiveMQ Artemis Tools ............................. SUCCESS [  0.898 s]
[INFO] ActiveMQ Artemis CLI ............................... SUCCESS [01:02 min]
[INFO] ActiveMQ Artemis Web ............................... SUCCESS [  5.798 s]
[INFO] ActiveMQ Artemis Web ............................... SUCCESS [01:19 min]
[INFO] ActiveMQ Artemis Core Client All ................... SUCCESS [ 17.794 s]
[INFO] ActiveMQ Artemis Client OSGi ....................... SUCCESS [  1.526 s]
[INFO] ActiveMQ Artemis JUnit Rules ....................... SUCCESS [  8.102 s]
[INFO] ActiveMQ Artemis JMS Client All .................... SUCCESS [ 13.593 s]
[INFO] ActiveMQ Artemis JMS Client OSGi ................... SUCCESS [  1.533 s]
[INFO] ActiveMQ Artemis RAR POM ........................... SUCCESS [  2.486 s]
[INFO] ActiveMQ Artemis REST Interface Implementation ..... SUCCESS [  3.737 s]
[INFO] ActiveMQ Artemis Maven Plugin ...................... SUCCESS [  2.854 s]
[INFO] ActiveMQ Artemis Server OSGi ....................... SUCCESS [ 11.387 s]
[INFO] ActiveMQ Artemis Cons .............................. SUCCESS [  0.150 s]
[INFO] ActiveMQ Artemis HawtIO Branding ................... SUCCESS [  5.070 s]
[INFO] ActiveMQ Artemis HawtIO Plugin ..................... SUCCESS [  0.775 s]
[INFO] ActiveMQ Artemis Console ........................... SUCCESS [  4.491 s]
[INFO] ActiveMQ Artemis Spring Integration ................ SUCCESS [  0.893 s]
[INFO] Apache ActiveMQ Artemis Distribution ............... SUCCESS [ 38.207 s]
[INFO] ActiveMQ Artemis Tests POM ......................... SUCCESS [  0.513 s]
[INFO] ActiveMQ Artemis Test Support ...................... SUCCESS [  1.784 s]
[INFO] ActiveMQ Artemis Unit Tests ........................ SUCCESS [04:19 min]
[INFO] ActiveMQ Artemis Joram Tests ....................... FAILURE [ 59.066 s]
[INFO] ActiveMQ Artemis timing Tests ...................... SKIPPED
[INFO] ActiveMQ Artemis JMS Tests ......................... SKIPPED
[INFO] ActiveMQ Artemis Features .......................... SKIPPED
[INFO] ActiveMQ Artemis Integration Tests ................. SKIPPED
[INFO] ActiveMQ Artemis Client Integration Tests .......... SKIPPED
[INFO] ActiveMQ Artemis Compatibility Tests ............... SKIPPED
[INFO] ActiveMQ Artemis soak Tests ........................ SKIPPED
[INFO] ActiveMQ Artemis stress Tests ...................... SKIPPED
[INFO] ActiveMQ Artemis performance Tests ................. SKIPPED
[INFO] Smoke Tests ........................................ SKIPPED
[INFO] ActiveMQ Artemis Extra Tests ....................... SKIPPED
[INFO] ------------------------------------------------------------------------
[INFO] BUILD FAILURE
[INFO] ------------------------------------------------------------------------
[INFO] Total time: 18:28 min
[INFO] Finished at: 2018-05-03T02:38:57+00:00
[INFO] Final Memory: 343M/5238M
[INFO] ------------------------------------------------------------------------
[ERROR] Failed to execute goal org.apache.maven.plugins:maven-surefire-plugin:2.18.1:test
(default-test) on project joram-tests: There are test failures.
[ERROR] 
[ERROR] Please refer to <https://builds.apache.org/job/ActiveMQ-Artemis-Master/ws/tests/joram-tests/target/surefire-reports>
for the individual test results.
[ERROR] -> [Help 1]
[ERROR] 
[ERROR] To see the full stack trace of the errors, re-run Maven with the -e switch.
[ERROR] Re-run Maven using the -X switch to enable full debug logging.
[ERROR] 
[ERROR] For more information about the errors and possible solutions, please read the following
articles:
[ERROR] [Help 1] http://cwiki.apache.org/confluence/display/MAVEN/MojoFailureException
[ERROR] 
[ERROR] After correcting the problems, you can resume the build with the command
[ERROR]   mvn <goals> -rf :joram-tests
Build step 'Invoke top-level Maven targets' marked build as failure
Performing Post build task...
Could not match :Too many files with unapproved license  : False
Logical operation result is FALSE
Skipping script  : cat ratReport.txt
END OF POST BUILD TASK 	: 0
Recording test results

Mime
View raw message