activemq-commits mailing list archives

Site index · List index
Message view « Date » · « Thread »
Top « Date » · « Thread »
From Apache Jenkins Server <jenk...@builds.apache.org>
Subject Build failed in Jenkins: ActiveMQ-Artemis-Master #1794
Date Thu, 03 May 2018 17:07:34 GMT
See <https://builds.apache.org/job/ActiveMQ-Artemis-Master/1794/display/redirect?page=changes>

Changes:

[clebertsuconic] ARTEMIS-1659 add test for reload on inactive slave

[clebertsuconic] ARTEMIS-1768: Fix handling of internalSession for OpenWireConnection

[clebertsuconic] ARTEMIS-1836 Bug with broker when running on Windows, cannot find

[clebertsuconic] [ARTEMIS-1819] Missing fields on listAllConsumersAsJSON,

[clebertsuconic] ARTEMIS-1801 removing null-unchecked dereferences

------------------------------------------
[...truncated 2.78 KB...]
[INFO] ActiveMQ Artemis MQTT Protocol
[INFO] ActiveMQ Artemis DTO
[INFO] ActiveMQ Artemis Service Extensions
[INFO] ActiveMQ Artemis JMS Server
[INFO] ActiveMQ Artemis CDI Integration
[INFO] ActiveMQ Artemis Boot
[INFO] ActiveMQ Artemis Tools
[INFO] ActiveMQ Artemis CLI
[INFO] ActiveMQ Artemis Web
[INFO] ActiveMQ Artemis Web
[INFO] ActiveMQ Artemis Core Client All
[INFO] ActiveMQ Artemis Client OSGi
[INFO] ActiveMQ Artemis JUnit Rules
[INFO] ActiveMQ Artemis JMS Client All
[INFO] ActiveMQ Artemis JMS Client OSGi
[INFO] ActiveMQ Artemis RAR POM
[INFO] ActiveMQ Artemis REST Interface Implementation
[INFO] ActiveMQ Artemis Maven Plugin
[INFO] ActiveMQ Artemis Server OSGi
[INFO] ActiveMQ Artemis Cons
[INFO] ActiveMQ Artemis HawtIO Branding
[INFO] ActiveMQ Artemis HawtIO Plugin
[INFO] ActiveMQ Artemis Console
[INFO] ActiveMQ Artemis Spring Integration
[INFO] Apache ActiveMQ Artemis Distribution
[INFO] ActiveMQ Artemis Tests POM
[INFO] ActiveMQ Artemis Test Support
[INFO] ActiveMQ Artemis Unit Tests
[INFO] ActiveMQ Artemis Joram Tests
[INFO] ActiveMQ Artemis timing Tests
[INFO] ActiveMQ Artemis JMS Tests
[INFO] ActiveMQ Artemis Features
[INFO] ActiveMQ Artemis Integration Tests
[INFO] ActiveMQ Artemis Client Integration Tests
[INFO] ActiveMQ Artemis Compatibility Tests
[INFO] ActiveMQ Artemis soak Tests
[INFO] ActiveMQ Artemis stress Tests
[INFO] ActiveMQ Artemis performance Tests
[INFO] Smoke Tests
[INFO] ActiveMQ Artemis Extra Tests
[INFO]                                                                         
[INFO] ------------------------------------------------------------------------
[INFO] Building ActiveMQ Artemis Parent 2.6.0-SNAPSHOT
[INFO] ------------------------------------------------------------------------
[INFO] 
[INFO] --- maven-enforcer-plugin:1.4:enforce (enforce-maven) @ artemis-pom ---
[INFO] 
[INFO] --- maven-enforcer-plugin:1.4:enforce (enforce-java) @ artemis-pom ---
[INFO] 
[INFO] --- maven-remote-resources-plugin:1.5:process (process-resource-bundles) @ artemis-pom
---
[INFO] 
[INFO] --- maven-checkstyle-plugin:2.17:check (default) @ artemis-pom ---
[INFO] Starting audit...
Audit done.
[INFO] 
[INFO] --- apache-rat-plugin:0.12:check (default) @ artemis-pom ---
[INFO] Enabled default license matchers.
[INFO] Will parse SCM ignores for exclusions...
[INFO] Parsing exclusions from <https://builds.apache.org/job/ActiveMQ-Artemis-Master/ws/.gitignore>
[INFO] Finished adding exclusions from SCM ignore files.
[INFO] 118 implicit excludes (use -debug for more details).
[INFO] Exclude: .travis.yml
[INFO] Exclude: **/footer.html
[INFO] Exclude: **/*.txt
[INFO] Exclude: **/*.md
[INFO] Exclude: etc/ide-settings/**
[INFO] Exclude: docs/**/*.json
[INFO] Exclude: docs/**/_book/
[INFO] Exclude: **/target/
[INFO] Exclude: **/META-INF/services/*
[INFO] Exclude: **/META-INF/MANIFEST.MF
[INFO] Exclude: **/*.iml
[INFO] Exclude: **/*.jceks
[INFO] Exclude: **/*.jks
[INFO] Exclude: **/xml.xsd
[INFO] Exclude: **/org/apache/activemq/artemis/utils/json/**
[INFO] Exclude: **/org/apache/activemq/artemis/utils/Base64.java
[INFO] Exclude: **/.settings/**
[INFO] Exclude: **/.project
[INFO] Exclude: **/.classpath
[INFO] Exclude: **/.editorconfig
[INFO] Exclude: **/.checkstyle
[INFO] Exclude: **/.factorypath
[INFO] Exclude: **/org.apache.activemq.artemis.cfg
[INFO] Exclude: **/nb-configuration.xml
[INFO] Exclude: **/*.data
[INFO] Exclude: **/*.bin
[INFO] Exclude: **/src/test/resources/keystore
[INFO] Exclude: **/*.log
[INFO] Exclude: **/*.redo
[INFO] Exclude: **/node/**
[INFO] Exclude: **/node_modules/**
[INFO] Exclude: **/package.json
[INFO] Exclude: **/npm-shrinkwrap.json
[INFO] Exclude: **/overlays/**
[INFO] Exclude: **/CMakeFiles/
[INFO] Exclude: **/Makefile
[INFO] Exclude: **/cmake_install.cmake
[INFO] Exclude: artemis-native/src/main/c/org_apache_activemq_artemis_jlibaio_LibaioContext.h
[INFO] Exclude: **/dependency-reduced-pom.xml
[INFO] 587 resources included (use -debug for more details)
[INFO] Rat check: Summary over all files. Unapproved: 0, unknown: 0, generated: 0, approved:
556 licenses.
[INFO] 
[INFO] --- maven-site-plugin:3.3:attach-descriptor (attach-descriptor) @ artemis-pom ---
[INFO] 
[INFO] >>> maven-source-plugin:2.2.1:jar (attach-sources) > generate-sources @
artemis-pom >>>
[INFO] 
[INFO] --- maven-enforcer-plugin:1.4:enforce (enforce-maven) @ artemis-pom ---
[INFO] 
[INFO] --- maven-enforcer-plugin:1.4:enforce (enforce-java) @ artemis-pom ---
[INFO] 
[INFO] <<< maven-source-plugin:2.2.1:jar (attach-sources) < generate-sources @
artemis-pom <<<
[INFO] 
[INFO] --- maven-source-plugin:2.2.1:jar (attach-sources) @ artemis-pom ---
[INFO] 
[INFO] >>> maven-source-plugin:2.2.1:jar (default) > generate-sources @ artemis-pom
>>>
[INFO] 
[INFO] --- maven-enforcer-plugin:1.4:enforce (enforce-maven) @ artemis-pom ---
[INFO] 
[INFO] --- maven-enforcer-plugin:1.4:enforce (enforce-java) @ artemis-pom ---
[INFO] 
[INFO] <<< maven-source-plugin:2.2.1:jar (default) < generate-sources @ artemis-pom
<<<
[INFO] 
[INFO] --- maven-source-plugin:2.2.1:jar (default) @ artemis-pom ---
[INFO] 
[INFO] --- dependency-check-maven:1.4.3:check (default) @ artemis-pom ---
[INFO] Skipping dependency-check
[INFO] 
[INFO] --- maven-install-plugin:2.4:install (default-install) @ artemis-pom ---
[INFO] Installing <https://builds.apache.org/job/ActiveMQ-Artemis-Master/ws/pom.xml>
to /home/jenkins/.m2/repository/org/apache/activemq/artemis-pom/2.6.0-SNAPSHOT/artemis-pom-2.6.0-SNAPSHOT.pom
[INFO]                                                                         
[INFO] ------------------------------------------------------------------------
[INFO] Building ActiveMQ Artemis Commons 2.6.0-SNAPSHOT
[INFO] ------------------------------------------------------------------------
[INFO] 
[INFO] --- maven-enforcer-plugin:1.4:enforce (enforce-maven) @ artemis-commons ---
[INFO] 
[INFO] --- maven-enforcer-plugin:1.4:enforce (enforce-java) @ artemis-commons ---
[INFO] 
[INFO] --- maven-remote-resources-plugin:1.5:process (process-resource-bundles) @ artemis-commons
---
[INFO] 
[INFO] --- maven-resources-plugin:2.6:resources (default-resources) @ artemis-commons ---
[INFO] Using 'UTF-8' encoding to copy filtered resources.
[INFO] skip non existing resourceDirectory <https://builds.apache.org/job/ActiveMQ-Artemis-Master/ws/artemis-commons/src/main/resources>
[INFO] Copying 3 resources
[INFO] 
[INFO] --- maven-compiler-plugin:3.1:compile (default-compile) @ artemis-commons ---
[INFO] Changes detected - recompiling the module!
[INFO] Compiling 129 source files to <https://builds.apache.org/job/ActiveMQ-Artemis-Master/ws/artemis-commons/target/classes>
<https://builds.apache.org/job/ActiveMQ-Artemis-Master/ws/artemis-commons/src/main/java/org/apache/activemq/artemis/utils/actors/ProcessorBase.java>:73:
warning: [Finally] If you return or throw from a finally, then values returned or thrown from
the try-catch block will be ignored. Consider using try-with-resources instead.
                  return;
                  ^
    (see http://errorprone.info/bugpattern/Finally)
Note: Some input files use unchecked or unsafe operations.
Note: Recompile with -Xlint:unchecked for details.
1 warning
[INFO] 
[INFO] --- maven-checkstyle-plugin:2.17:check (default) @ artemis-commons ---
[INFO] Starting audit...
[ERROR] <https://builds.apache.org/job/ActiveMQ-Artemis-Master/ws/artemis-commons/src/main/java/org/apache/activemq/artemis/api/core/ActiveMQExceptionType.java>:249:60:
'{' at column 60 should have line break after. [LeftCurly]
[ERROR] <https://builds.apache.org/job/ActiveMQ-Artemis-Master/ws/artemis-commons/src/main/java/org/apache/activemq/artemis/api/core/ActiveMQExceptionType.java>:249:104:
'}' at column 104 should be alone on a line. [RightCurly]
Audit done.
[INFO] There are 2 errors reported by Checkstyle 7.7 with <https://builds.apache.org/job/ActiveMQ-Artemis-Master/ws/artemis-commons/../etc/checkstyle.xml>
ruleset.
[ERROR] src/main/java/org/apache/activemq/artemis/api/core/ActiveMQExceptionType.java:[249,60]
(blocks) LeftCurly: '{' at column 60 should have line break after.
[ERROR] src/main/java/org/apache/activemq/artemis/api/core/ActiveMQExceptionType.java:[249,104]
(blocks) RightCurly: '}' at column 104 should be alone on a line.
[INFO] ------------------------------------------------------------------------
[INFO] Reactor Summary:
[INFO] 
[INFO] ActiveMQ Artemis Parent ............................ SUCCESS [  5.081 s]
[INFO] ActiveMQ Artemis Commons ........................... FAILURE [  8.074 s]
[INFO] ActiveMQ Artemis Core Client ....................... SKIPPED
[INFO] ActiveMQ Artemis Selector Implementation ........... SKIPPED
[INFO] ActiveMQ Artemis JMS Client ........................ SKIPPED
[INFO] ActiveMQ Artemis Native POM ........................ SKIPPED
[INFO] ActiveMQ Artemis Journal ........................... SKIPPED
[INFO] ActiveMQ Artemis JDBC Store ........................ SKIPPED
[INFO] ActiveMQ Artemis Server ............................ SKIPPED
[INFO] ActiveMQ Artemis Protocols ......................... SKIPPED
[INFO] ActiveMQ Artemis AMQP Protocol ..................... SKIPPED
[INFO] ActiveMQ Artemis STOMP Protocol .................... SKIPPED
[INFO] ActiveMQ Artemis OpenWire Protocol ................. SKIPPED
[INFO] ActiveMQ Artemis HQClient Protocol ................. SKIPPED
[INFO] ActiveMQ Artemis HornetQ Protocol .................. SKIPPED
[INFO] ActiveMQ Artemis MQTT Protocol ..................... SKIPPED
[INFO] ActiveMQ Artemis DTO ............................... SKIPPED
[INFO] ActiveMQ Artemis Service Extensions ................ SKIPPED
[INFO] ActiveMQ Artemis JMS Server ........................ SKIPPED
[INFO] ActiveMQ Artemis CDI Integration ................... SKIPPED
[INFO] ActiveMQ Artemis Boot .............................. SKIPPED
[INFO] ActiveMQ Artemis Tools ............................. SKIPPED
[INFO] ActiveMQ Artemis CLI ............................... SKIPPED
[INFO] ActiveMQ Artemis Web ............................... SKIPPED
[INFO] ActiveMQ Artemis Web ............................... SKIPPED
[INFO] ActiveMQ Artemis Core Client All ................... SKIPPED
[INFO] ActiveMQ Artemis Client OSGi ....................... SKIPPED
[INFO] ActiveMQ Artemis JUnit Rules ....................... SKIPPED
[INFO] ActiveMQ Artemis JMS Client All .................... SKIPPED
[INFO] ActiveMQ Artemis JMS Client OSGi ................... SKIPPED
[INFO] ActiveMQ Artemis RAR POM ........................... SKIPPED
[INFO] ActiveMQ Artemis REST Interface Implementation ..... SKIPPED
[INFO] ActiveMQ Artemis Maven Plugin ...................... SKIPPED
[INFO] ActiveMQ Artemis Server OSGi ....................... SKIPPED
[INFO] ActiveMQ Artemis Cons .............................. SKIPPED
[INFO] ActiveMQ Artemis HawtIO Branding ................... SKIPPED
[INFO] ActiveMQ Artemis HawtIO Plugin ..................... SKIPPED
[INFO] ActiveMQ Artemis Console ........................... SKIPPED
[INFO] ActiveMQ Artemis Spring Integration ................ SKIPPED
[INFO] Apache ActiveMQ Artemis Distribution ............... SKIPPED
[INFO] ActiveMQ Artemis Tests POM ......................... SKIPPED
[INFO] ActiveMQ Artemis Test Support ...................... SKIPPED
[INFO] ActiveMQ Artemis Unit Tests ........................ SKIPPED
[INFO] ActiveMQ Artemis Joram Tests ....................... SKIPPED
[INFO] ActiveMQ Artemis timing Tests ...................... SKIPPED
[INFO] ActiveMQ Artemis JMS Tests ......................... SKIPPED
[INFO] ActiveMQ Artemis Features .......................... SKIPPED
[INFO] ActiveMQ Artemis Integration Tests ................. SKIPPED
[INFO] ActiveMQ Artemis Client Integration Tests .......... SKIPPED
[INFO] ActiveMQ Artemis Compatibility Tests ............... SKIPPED
[INFO] ActiveMQ Artemis soak Tests ........................ SKIPPED
[INFO] ActiveMQ Artemis stress Tests ...................... SKIPPED
[INFO] ActiveMQ Artemis performance Tests ................. SKIPPED
[INFO] Smoke Tests ........................................ SKIPPED
[INFO] ActiveMQ Artemis Extra Tests ....................... SKIPPED
[INFO] ------------------------------------------------------------------------
[INFO] BUILD FAILURE
[INFO] ------------------------------------------------------------------------
[INFO] Total time: 15.715 s
[INFO] Finished at: 2018-05-03T17:07:32+00:00
[INFO] Final Memory: 73M/1339M
[INFO] ------------------------------------------------------------------------
[ERROR] Failed to execute goal org.apache.maven.plugins:maven-checkstyle-plugin:2.17:check
(default) on project artemis-commons: You have 2 Checkstyle violations. -> [Help 1]
[ERROR] 
[ERROR] To see the full stack trace of the errors, re-run Maven with the -e switch.
[ERROR] Re-run Maven using the -X switch to enable full debug logging.
[ERROR] 
[ERROR] For more information about the errors and possible solutions, please read the following
articles:
[ERROR] [Help 1] http://cwiki.apache.org/confluence/display/MAVEN/MojoFailureException
[ERROR] 
[ERROR] After correcting the problems, you can resume the build with the command
[ERROR]   mvn <goals> -rf :artemis-commons
Build step 'Invoke top-level Maven targets' marked build as failure
Performing Post build task...
Could not match :Too many files with unapproved license  : False
Logical operation result is FALSE
Skipping script  : cat ratReport.txt
END OF POST BUILD TASK 	: 0
Recording test results
ERROR: Step ?Publish JUnit test result report? failed: No test report files were found. Configuration
error?


Mime
View raw message