activemq-commits mailing list archives

Site index · List index
Message view « Date » · « Thread »
Top « Date » · « Thread »
From Apache Jenkins Server <jenk...@builds.apache.org>
Subject Build failed in Jenkins: ActiveMQ-Artemis-Master #1856
Date Wed, 06 Jun 2018 20:51:52 GMT
See <https://builds.apache.org/job/ActiveMQ-Artemis-Master/1856/display/redirect?page=changes>

Changes:

[clebertsuconic] ARTEMIS-1915 Expiry Scanner is holding a lock on the queue

[clebertsuconic] ARTEMIS-1913 Dependency to netty tcpnative should be optional

------------------------------------------
[...truncated 292.72 KB...]
[main] 20:46:58,703 INFO  [org.apache.activemq.artemis.core.server] AMQ221000: live Message
Broker is starting with configuration Broker Configuration (clustered=false,journalDirectory=target/data/journal,bindingsDirectory=data/bindings,largeMessagesDirectory=data/largemessages,pagingDirectory=data/paging)
[main] 20:46:58,704 INFO  [org.apache.activemq.artemis.core.server] AMQ221043: Protocol module
found: [artemis-server]. Adding protocol support for: CORE
[main] 20:46:58,712 INFO  [org.apache.activemq.artemis.core.server] AMQ221007: Server is now
live
[main] 20:46:58,712 INFO  [org.apache.activemq.artemis.core.server] AMQ221001: Apache ActiveMQ
Artemis Message Broker version 2.7.0-SNAPSHOT [localhost, nodeID=c1975279-69ca-11e8-88ca-008cfa5b3bc4]

[main] 20:46:58,714 INFO  [org.apache.activemq.artemis.core.server] AMQ221002: Apache ActiveMQ
Artemis Message Broker version 2.7.0-SNAPSHOT [c1975279-69ca-11e8-88ca-008cfa5b3bc4] stopped,
uptime 0.011 seconds
[main] 20:46:58,714 INFO  [org.apache.activemq.artemis.core.server] AMQ221000: live Message
Broker is starting with configuration Broker Configuration (clustered=false,journalDirectory=target/data/journal,bindingsDirectory=data/bindings,largeMessagesDirectory=data/largemessages,pagingDirectory=data/paging)
[main] 20:46:58,714 INFO  [org.apache.activemq.artemis.core.server] AMQ221043: Protocol module
found: [artemis-server]. Adding protocol support for: CORE
[main] 20:46:58,724 INFO  [org.apache.activemq.artemis.core.server] AMQ221007: Server is now
live
[main] 20:46:58,724 INFO  [org.apache.activemq.artemis.core.server] AMQ221001: Apache ActiveMQ
Artemis Message Broker version 2.7.0-SNAPSHOT [localhost, nodeID=c199002a-69ca-11e8-88ca-008cfa5b3bc4]

[main] 20:46:58,725 INFO  [org.apache.activemq.artemis.core.server] AMQ221002: Apache ActiveMQ
Artemis Message Broker version 2.7.0-SNAPSHOT [c199002a-69ca-11e8-88ca-008cfa5b3bc4] stopped,
uptime 0.011 seconds
Tests run: 2, Failures: 0, Errors: 0, Skipped: 0, Time elapsed: 0.044 sec - in org.apache.activemq.artemis.core.server.impl.EmbeddedServerTest
Running org.apache.activemq.artemis.core.server.impl.ScheduledDeliveryHandlerTest
Tests run: 6, Failures: 0, Errors: 0, Skipped: 0, Time elapsed: 1.84 sec - in org.apache.activemq.artemis.core.server.impl.ScheduledDeliveryHandlerTest
Running org.apache.activemq.artemis.core.server.impl.jdbc.JdbcLeaseLockTest
[main] 20:47:00,569 INFO  [org.apache.activemq.artemis.core.server] **** start #test shouldRenewExpiredLockNotAcquiredByOthers[create_tables_prior_test=true]()
***
[main] 20:47:15,126 INFO  [org.apache.activemq.artemis.core.server] **** end #test shouldRenewExpiredLockNotAcquiredByOthers[create_tables_prior_test=true]()
***
[main] 20:47:15,127 INFO  [org.apache.activemq.artemis.core.server] **** start #test shouldNotCorruptGuardedState[create_tables_prior_test=true]()
***
[main] 20:47:28,374 INFO  [org.apache.activemq.artemis.core.server] **** end #test shouldNotCorruptGuardedState[create_tables_prior_test=true]()
***
[main] 20:47:28,375 INFO  [org.apache.activemq.artemis.core.server] **** start #test shouldNotRenewLockAcquiredByOthers[create_tables_prior_test=true]()
***
[main] 20:47:41,408 INFO  [org.apache.activemq.artemis.core.server] **** end #test shouldNotRenewLockAcquiredByOthers[create_tables_prior_test=true]()
***
[main] 20:47:41,409 INFO  [org.apache.activemq.artemis.core.server] **** start #test shouldNotAcquireLockWhenAlreadyHeldByOthers[create_tables_prior_test=true]()
***
[main] 20:47:53,575 INFO  [org.apache.activemq.artemis.core.server] **** end #test shouldNotAcquireLockWhenAlreadyHeldByOthers[create_tables_prior_test=true]()
***
[main] 20:47:53,576 INFO  [org.apache.activemq.artemis.core.server] **** start #test shouldNotRenewReleasedLock[create_tables_prior_test=true]()
***
[main] 20:48:05,249 INFO  [org.apache.activemq.artemis.core.server] **** end #test shouldNotRenewReleasedLock[create_tables_prior_test=true]()
***
[main] 20:48:05,250 INFO  [org.apache.activemq.artemis.core.server] **** start #test shouldOtherAcquireExpiredLock[create_tables_prior_test=true]()
***
[main] 20:48:19,286 INFO  [org.apache.activemq.artemis.core.server] **** end #test shouldOtherAcquireExpiredLock[create_tables_prior_test=true]()
***
[main] 20:48:19,287 INFO  [org.apache.activemq.artemis.core.server] **** start #test shouldRenewAcquiredLock[create_tables_prior_test=true]()
***
[main] 20:48:30,523 INFO  [org.apache.activemq.artemis.core.server] **** end #test shouldRenewAcquiredLock[create_tables_prior_test=true]()
***
[main] 20:48:30,524 INFO  [org.apache.activemq.artemis.core.server] **** start #test shouldAcquireLock[create_tables_prior_test=true]()
***
[main] 20:48:41,114 INFO  [org.apache.activemq.artemis.core.server] **** end #test shouldAcquireLock[create_tables_prior_test=true]()
***
[main] 20:48:41,115 INFO  [org.apache.activemq.artemis.core.server] **** start #test shouldNotAcquireLockTwice[create_tables_prior_test=true]()
***
[main] 20:48:52,339 INFO  [org.apache.activemq.artemis.core.server] **** end #test shouldNotAcquireLockTwice[create_tables_prior_test=true]()
***
[main] 20:48:52,340 INFO  [org.apache.activemq.artemis.core.server] **** start #test shouldAcquireExpiredLock[create_tables_prior_test=true]()
***
[main] 20:49:05,981 INFO  [org.apache.activemq.artemis.core.server] **** end #test shouldAcquireExpiredLock[create_tables_prior_test=true]()
***
[main] 20:49:05,982 INFO  [org.apache.activemq.artemis.core.server] **** start #test shouldRenewExpiredLockNotAcquiredByOthers[create_tables_prior_test=false]()
***
[main] 20:49:20,949 INFO  [org.apache.activemq.artemis.core.server] **** end #test shouldRenewExpiredLockNotAcquiredByOthers[create_tables_prior_test=false]()
***
[main] 20:49:20,951 INFO  [org.apache.activemq.artemis.core.server] **** start #test shouldNotCorruptGuardedState[create_tables_prior_test=false]()
***
[main] 20:49:32,433 INFO  [org.apache.activemq.artemis.core.server] **** end #test shouldNotCorruptGuardedState[create_tables_prior_test=false]()
***
[main] 20:49:32,434 INFO  [org.apache.activemq.artemis.core.server] **** start #test shouldNotRenewLockAcquiredByOthers[create_tables_prior_test=false]()
***
[main] 20:49:46,431 INFO  [org.apache.activemq.artemis.core.server] **** end #test shouldNotRenewLockAcquiredByOthers[create_tables_prior_test=false]()
***
[main] 20:49:46,432 INFO  [org.apache.activemq.artemis.core.server] **** start #test shouldNotAcquireLockWhenAlreadyHeldByOthers[create_tables_prior_test=false]()
***
[main] 20:49:56,690 INFO  [org.apache.activemq.artemis.core.server] **** end #test shouldNotAcquireLockWhenAlreadyHeldByOthers[create_tables_prior_test=false]()
***
[main] 20:49:56,692 INFO  [org.apache.activemq.artemis.core.server] **** start #test shouldNotRenewReleasedLock[create_tables_prior_test=false]()
***
[main] 20:50:08,022 INFO  [org.apache.activemq.artemis.core.server] **** end #test shouldNotRenewReleasedLock[create_tables_prior_test=false]()
***
[main] 20:50:08,023 INFO  [org.apache.activemq.artemis.core.server] **** start #test shouldOtherAcquireExpiredLock[create_tables_prior_test=false]()
***
[main] 20:50:20,748 INFO  [org.apache.activemq.artemis.core.server] **** end #test shouldOtherAcquireExpiredLock[create_tables_prior_test=false]()
***
[main] 20:50:20,749 INFO  [org.apache.activemq.artemis.core.server] **** start #test shouldRenewAcquiredLock[create_tables_prior_test=false]()
***
[main] 20:50:31,303 INFO  [org.apache.activemq.artemis.core.server] **** end #test shouldRenewAcquiredLock[create_tables_prior_test=false]()
***
[main] 20:50:31,304 INFO  [org.apache.activemq.artemis.core.server] **** start #test shouldAcquireLock[create_tables_prior_test=false]()
***
[main] 20:50:41,951 INFO  [org.apache.activemq.artemis.core.server] **** end #test shouldAcquireLock[create_tables_prior_test=false]()
***
[main] 20:50:41,952 INFO  [org.apache.activemq.artemis.core.server] **** start #test shouldNotAcquireLockTwice[create_tables_prior_test=false]()
***
[main] 20:50:52,797 INFO  [org.apache.activemq.artemis.core.server] **** end #test shouldNotAcquireLockTwice[create_tables_prior_test=false]()
***
[main] 20:50:52,798 INFO  [org.apache.activemq.artemis.core.server] **** start #test shouldAcquireExpiredLock[create_tables_prior_test=false]()
***
[main] 20:51:05,441 INFO  [org.apache.activemq.artemis.core.server] **** end #test shouldAcquireExpiredLock[create_tables_prior_test=false]()
***
Tests run: 20, Failures: 0, Errors: 0, Skipped: 0, Time elapsed: 244.874 sec - in org.apache.activemq.artemis.core.server.impl.jdbc.JdbcLeaseLockTest
Running org.apache.activemq.artemis.core.server.impl.jdbc.JdbcSharedStateManagerTest
[main] 20:51:05,445 INFO  [org.apache.activemq.artemis.core.server] **** start #test shouldStartTwoIfTableNotExist()
***
[main] 20:51:16,014 INFO  [org.apache.activemq.artemis.core.server] **** end #test shouldStartTwoIfTableNotExist()
***
[main] 20:51:16,014 INFO  [org.apache.activemq.artemis.core.server] **** start #test shouldStartIfTableNotExist()
***
[main] 20:51:25,489 INFO  [org.apache.activemq.artemis.core.server] **** end #test shouldStartIfTableNotExist()
***
[main] 20:51:25,490 INFO  [org.apache.activemq.artemis.core.server] **** start #test shouldStartIfTableExistInitialized()
***
[main] 20:51:36,254 INFO  [org.apache.activemq.artemis.core.server] **** end #test shouldStartIfTableExistInitialized()
***
[main] 20:51:36,255 INFO  [org.apache.activemq.artemis.core.server] **** start #test shouldStartIfTableExistEmpty()
***
[main] 20:51:47,483 INFO  [org.apache.activemq.artemis.core.server] **** end #test shouldStartIfTableExistEmpty()
***
Tests run: 4, Failures: 0, Errors: 1, Skipped: 0, Time elapsed: 42.055 sec <<< FAILURE!
- in org.apache.activemq.artemis.core.server.impl.jdbc.JdbcSharedStateManagerTest
shouldStartIfTableExistEmpty(org.apache.activemq.artemis.core.server.impl.jdbc.JdbcSharedStateManagerTest)
 Time elapsed: 11.242 sec  <<< ERROR!
java.lang.Exception: test timed out after 10000 milliseconds
	at java.io.RandomAccessFile.writeBytes(Native Method)
	at java.io.RandomAccessFile.write(RandomAccessFile.java:525)
	at org.apache.derby.impl.store.raw.log.LogAccessFile.writeToLog(Unknown Source)
	at org.apache.derby.impl.store.raw.log.LogAccessFile.flushDirtyBuffers(Unknown Source)
	at org.apache.derby.impl.store.raw.log.LogToFile.flush(Unknown Source)
	at org.apache.derby.impl.store.raw.log.LogToFile.flush(Unknown Source)
	at org.apache.derby.impl.store.raw.data.BaseDataFileFactory.flush(Unknown Source)
	at org.apache.derby.impl.store.raw.data.RAFContainer.run(Unknown Source)
	at java.security.AccessController.doPrivileged(Native Method)
	at org.apache.derby.impl.store.raw.data.RAFContainer.stubbify(Unknown Source)
	at org.apache.derby.impl.store.raw.data.RAFContainer.removeContainer(Unknown Source)
	at org.apache.derby.impl.store.raw.data.BaseContainerHandle.removeContainer(Unknown Source)
	at org.apache.derby.impl.store.raw.data.ContainerOperation.doMe(Unknown Source)
	at org.apache.derby.impl.store.raw.log.FileLogger.logAndDo(Unknown Source)
	at org.apache.derby.impl.store.raw.xact.Xact.logAndDo(Unknown Source)
	at org.apache.derby.impl.store.raw.data.ReclaimSpaceHelper.reclaimContainer(Unknown Source)
	at org.apache.derby.impl.store.raw.data.ReclaimSpaceHelper.reclaimSpace(Unknown Source)
	at org.apache.derby.impl.store.raw.data.BaseDataFileFactory.reclaimSpace(Unknown Source)
	at org.apache.derby.impl.store.raw.data.ReclaimSpace.performWork(Unknown Source)
	at org.apache.derby.impl.store.raw.xact.Xact.postTermination(Unknown Source)
	at org.apache.derby.impl.store.raw.xact.Xact.completeCommit(Unknown Source)
	at org.apache.derby.impl.store.raw.xact.Xact.commit(Unknown Source)
	at org.apache.derby.impl.store.raw.xact.Xact.commit(Unknown Source)
	at org.apache.derby.impl.store.access.RAMTransaction.commit(Unknown Source)
	at org.apache.derby.impl.sql.conn.GenericLanguageConnectionContext.doCommit(Unknown Source)
	at org.apache.derby.impl.sql.conn.GenericLanguageConnectionContext.userCommit(Unknown Source)
	at org.apache.derby.impl.jdbc.TransactionResourceImpl.commit(Unknown Source)
	at org.apache.derby.impl.jdbc.EmbedConnection.commit(Unknown Source)
	at org.apache.activemq.artemis.jdbc.store.drivers.AbstractJDBCDriver.destroy(AbstractJDBCDriver.java:168)
	at org.apache.activemq.artemis.core.server.impl.jdbc.JdbcSharedStateManagerTest.shouldStartIfTableExistEmpty(JdbcSharedStateManagerTest.java:77)

Running org.apache.activemq.artemis.core.server.management.JMXAccessControlListTest
Tests run: 14, Failures: 0, Errors: 0, Skipped: 0, Time elapsed: 0.001 sec - in org.apache.activemq.artemis.core.server.management.JMXAccessControlListTest
Running org.apache.activemq.artemis.core.settings.AddressSettingsTest
[main] 20:51:47,506 INFO  [org.apache.activemq.artemis.core.server] **** start #test testMultipleMergeAll()
***
[main] 20:51:47,509 INFO  [org.apache.activemq.artemis.core.server] **** end #test testMultipleMergeAll()
***
[main] 20:51:47,510 INFO  [org.apache.activemq.artemis.core.server] **** start #test testMultipleMerge()
***
[main] 20:51:47,512 INFO  [org.apache.activemq.artemis.core.server] **** end #test testMultipleMerge()
***
[main] 20:51:47,512 INFO  [org.apache.activemq.artemis.core.server] **** start #test testDefaults()
***
[main] 20:51:47,514 INFO  [org.apache.activemq.artemis.core.server] **** end #test testDefaults()
***
[main] 20:51:47,514 INFO  [org.apache.activemq.artemis.core.server] **** start #test testSingleMerge()
***
[main] 20:51:47,516 INFO  [org.apache.activemq.artemis.core.server] **** end #test testSingleMerge()
***
Tests run: 4, Failures: 0, Errors: 0, Skipped: 0, Time elapsed: 0.011 sec - in org.apache.activemq.artemis.core.settings.AddressSettingsTest
Running org.apache.activemq.artemis.core.settings.RepositoryTest
[main] 20:51:47,517 INFO  [org.apache.activemq.artemis.core.server] **** start #test testMultipleWildcards()
***
[main] 20:51:47,521 INFO  [org.apache.activemq.artemis.core.server] **** end #test testMultipleWildcards()
***
[main] 20:51:47,522 INFO  [org.apache.activemq.artemis.core.server] **** start #test testMatchingDocs()
***
[main] 20:51:47,524 INFO  [org.apache.activemq.artemis.core.server] **** end #test testMatchingDocs()
***
[main] 20:51:47,524 INFO  [org.apache.activemq.artemis.core.server] **** start #test testWithoutWildcard()
***
[main] 20:51:47,526 INFO  [org.apache.activemq.artemis.core.server] **** end #test testWithoutWildcard()
***
[main] 20:51:47,527 INFO  [org.apache.activemq.artemis.core.server] **** start #test testSingletwo()
***
[main] 20:51:47,528 INFO  [org.apache.activemq.artemis.core.server] **** end #test testSingletwo()
***
[main] 20:51:47,529 INFO  [org.apache.activemq.artemis.core.server] **** start #test testIllegalMatches()
***
[main] 20:51:47,531 INFO  [org.apache.activemq.artemis.core.server] **** end #test testIllegalMatches()
***
[main] 20:51:47,531 INFO  [org.apache.activemq.artemis.core.server] **** start #test testAddListener()
***
[main] 20:51:47,534 INFO  [org.apache.activemq.artemis.core.server] **** end #test testAddListener()
***
[main] 20:51:47,534 INFO  [org.apache.activemq.artemis.core.server] **** start #test testDefault()
***
[main] 20:51:47,536 INFO  [org.apache.activemq.artemis.core.server] **** end #test testDefault()
***
[main] 20:51:47,536 INFO  [org.apache.activemq.artemis.core.server] **** start #test testMatchingDocsCustomUnderscorDelimiter()
***
[main] 20:51:47,539 INFO  [org.apache.activemq.artemis.core.server] **** end #test testMatchingDocsCustomUnderscorDelimiter()
***
[main] 20:51:47,540 INFO  [org.apache.activemq.artemis.core.server] **** start #test testSingleMatch()
***
[main] 20:51:47,543 INFO  [org.apache.activemq.artemis.core.server] **** end #test testSingleMatch()
***
[main] 20:51:47,543 INFO  [org.apache.activemq.artemis.core.server] **** start #test testRepositoryMerge()
***
[main] 20:51:47,547 INFO  [org.apache.activemq.artemis.core.server] **** end #test testRepositoryMerge()
***
[main] 20:51:47,548 INFO  [org.apache.activemq.artemis.core.server] **** start #test testMatchingDocsCustomForwardSlashDelimiter()
***
[main] 20:51:47,551 INFO  [org.apache.activemq.artemis.core.server] **** end #test testMatchingDocsCustomForwardSlashDelimiter()
***
Tests run: 11, Failures: 0, Errors: 0, Skipped: 0, Time elapsed: 0.034 sec - in org.apache.activemq.artemis.core.settings.RepositoryTest
Running org.apache.activemq.artemis.core.transaction.impl.TransactionImplTest
[main] 20:51:47,553 INFO  [org.apache.activemq.artemis.core.server] **** start #test testTimeoutThenRollbackWithRollback()
***
rollback...
[main] 20:51:47,566 INFO  [org.apache.activemq.artemis.core.server] **** end #test testTimeoutThenRollbackWithRollback()
***
[main] 20:51:47,566 INFO  [org.apache.activemq.artemis.core.server] **** start #test testTimeoutAndThenCommitWithARollback()
***
rollback...
[main] 20:51:47,573 INFO  [org.apache.activemq.artemis.core.server] **** end #test testTimeoutAndThenCommitWithARollback()
***
Tests run: 2, Failures: 0, Errors: 0, Skipped: 0, Time elapsed: 0.021 sec - in org.apache.activemq.artemis.core.transaction.impl.TransactionImplTest
Running org.apache.activemq.artemis.core.version.impl.VersionImplTest
Tests run: 3, Failures: 0, Errors: 0, Skipped: 0, Time elapsed: 0.003 sec - in org.apache.activemq.artemis.core.version.impl.VersionImplTest
Running org.apache.activemq.artemis.spi.core.security.jaas.Krb5LoginModuleTest
Tests run: 2, Failures: 0, Errors: 0, Skipped: 0, Time elapsed: 0.002 sec - in org.apache.activemq.artemis.spi.core.security.jaas.Krb5LoginModuleTest
Running org.apache.activemq.artemis.tests.util.SimpleStringTest
Tests run: 20, Failures: 0, Errors: 0, Skipped: 0, Time elapsed: 1.189 sec - in org.apache.activemq.artemis.tests.util.SimpleStringTest
Running org.apache.activemq.artemis.uri.AcceptorParserTest
config:TransportConfiguration(name=test, factory=org-apache-activemq-artemis-core-remoting-impl-netty-NettyAcceptorFactory)
?tcpReceiveBufferSize=1048576&port=8080&host=localhost&protocols=openwire&tcpSendBufferSize=1048576&banana=x
config:TransportConfiguration(name=test, factory=org-apache-activemq-artemis-core-remoting-impl-netty-NettyAcceptorFactory)
?tcpReceiveBufferSize=1048576&port=5672&host=0-0-0-0&tcpSendBufferSize=1048576&virtualTopicConsumerWildcards=Consumer-*->;2
Consumer.*.>;2
Tests run: 2, Failures: 0, Errors: 0, Skipped: 0, Time elapsed: 0.001 sec - in org.apache.activemq.artemis.uri.AcceptorParserTest
Running org.apache.activemq.artemis.uri.ClusterConnectionConfigurationTest
Tests run: 5, Failures: 0, Errors: 0, Skipped: 0, Time elapsed: 0.007 sec - in org.apache.activemq.artemis.uri.ClusterConnectionConfigurationTest

Results :

Tests in error: 
  JdbcSharedStateManagerTest.shouldStartIfTableExistEmpty:77 ยป  test timed out a...

Tests run: 270, Failures: 0, Errors: 1, Skipped: 0

[INFO] ------------------------------------------------------------------------
[INFO] Reactor Summary:
[INFO] 
[INFO] ActiveMQ Artemis Parent ............................ SUCCESS [  6.531 s]
[INFO] ActiveMQ Artemis Commons ........................... SUCCESS [ 25.811 s]
[INFO] ActiveMQ Artemis Core Client ....................... SUCCESS [ 16.916 s]
[INFO] ActiveMQ Artemis Selector Implementation ........... SUCCESS [  4.785 s]
[INFO] ActiveMQ Artemis JMS Client ........................ SUCCESS [  5.834 s]
[INFO] ActiveMQ Artemis Native POM ........................ SUCCESS [ 10.389 s]
[INFO] ActiveMQ Artemis Journal ........................... SUCCESS [  4.744 s]
[INFO] ActiveMQ Artemis JDBC Store ........................ SUCCESS [ 44.164 s]
[INFO] ActiveMQ Artemis Server ............................ FAILURE [07:21 min]
[INFO] ActiveMQ Artemis Protocols ......................... SKIPPED
[INFO] ActiveMQ Artemis AMQP Protocol ..................... SKIPPED
[INFO] ActiveMQ Artemis STOMP Protocol .................... SKIPPED
[INFO] ActiveMQ Artemis OpenWire Protocol ................. SKIPPED
[INFO] ActiveMQ Artemis HQClient Protocol ................. SKIPPED
[INFO] ActiveMQ Artemis HornetQ Protocol .................. SKIPPED
[INFO] ActiveMQ Artemis MQTT Protocol ..................... SKIPPED
[INFO] ActiveMQ Artemis DTO ............................... SKIPPED
[INFO] ActiveMQ Artemis Service Extensions ................ SKIPPED
[INFO] ActiveMQ Artemis JMS Server ........................ SKIPPED
[INFO] ActiveMQ Artemis CDI Integration ................... SKIPPED
[INFO] ActiveMQ Artemis Boot .............................. SKIPPED
[INFO] ActiveMQ Artemis Tools ............................. SKIPPED
[INFO] ActiveMQ Artemis CLI ............................... SKIPPED
[INFO] ActiveMQ Artemis Web ............................... SKIPPED
[INFO] ActiveMQ Artemis Web ............................... SKIPPED
[INFO] ActiveMQ Artemis Core Client All ................... SKIPPED
[INFO] ActiveMQ Artemis Client OSGi ....................... SKIPPED
[INFO] ActiveMQ Artemis JUnit Rules ....................... SKIPPED
[INFO] ActiveMQ Artemis JMS Client All .................... SKIPPED
[INFO] ActiveMQ Artemis JMS Client OSGi ................... SKIPPED
[INFO] ActiveMQ Artemis RAR POM ........................... SKIPPED
[INFO] ActiveMQ Artemis REST Interface Implementation ..... SKIPPED
[INFO] ActiveMQ Artemis Maven Plugin ...................... SKIPPED
[INFO] ActiveMQ Artemis Server OSGi ....................... SKIPPED
[INFO] ActiveMQ Artemis Cons .............................. SKIPPED
[INFO] ActiveMQ Artemis HawtIO Branding ................... SKIPPED
[INFO] ActiveMQ Artemis HawtIO Plugin ..................... SKIPPED
[INFO] ActiveMQ Artemis Console ........................... SKIPPED
[INFO] ActiveMQ Artemis Spring Integration ................ SKIPPED
[INFO] Apache ActiveMQ Artemis Distribution ............... SKIPPED
[INFO] ActiveMQ Artemis Tests POM ......................... SKIPPED
[INFO] ActiveMQ Artemis Test Support ...................... SKIPPED
[INFO] ActiveMQ Artemis Unit Tests ........................ SKIPPED
[INFO] ActiveMQ Artemis Joram Tests ....................... SKIPPED
[INFO] ActiveMQ Artemis timing Tests ...................... SKIPPED
[INFO] ActiveMQ Artemis JMS Tests ......................... SKIPPED
[INFO] ActiveMQ Artemis Features .......................... SKIPPED
[INFO] ActiveMQ Artemis Integration Tests ................. SKIPPED
[INFO] ActiveMQ Artemis Client Integration Tests .......... SKIPPED
[INFO] ActiveMQ Artemis Compatibility Tests ............... SKIPPED
[INFO] ActiveMQ Artemis soak Tests ........................ SKIPPED
[INFO] ActiveMQ Artemis stress Tests ...................... SKIPPED
[INFO] ActiveMQ Artemis performance Tests ................. SKIPPED
[INFO] Smoke Tests ........................................ SKIPPED
[INFO] ActiveMQ Artemis Extra Tests ....................... SKIPPED
[INFO] ------------------------------------------------------------------------
[INFO] BUILD FAILURE
[INFO] ------------------------------------------------------------------------
[INFO] Total time: 09:24 min
[INFO] Finished at: 2018-06-06T20:51:49+00:00
[INFO] Final Memory: 204M/3950M
[INFO] ------------------------------------------------------------------------
[ERROR] Failed to execute goal org.apache.maven.plugins:maven-surefire-plugin:2.18.1:test
(default-test) on project artemis-server: There are test failures.
[ERROR] 
[ERROR] Please refer to <https://builds.apache.org/job/ActiveMQ-Artemis-Master/ws/artemis-server/target/surefire-reports>
for the individual test results.
[ERROR] -> [Help 1]
[ERROR] 
[ERROR] To see the full stack trace of the errors, re-run Maven with the -e switch.
[ERROR] Re-run Maven using the -X switch to enable full debug logging.
[ERROR] 
[ERROR] For more information about the errors and possible solutions, please read the following
articles:
[ERROR] [Help 1] http://cwiki.apache.org/confluence/display/MAVEN/MojoFailureException
[ERROR] 
[ERROR] After correcting the problems, you can resume the build with the command
[ERROR]   mvn <goals> -rf :artemis-server
Build step 'Invoke top-level Maven targets' marked build as failure
Performing Post build task...
Could not match :Too many files with unapproved license  : False
Logical operation result is FALSE
Skipping script  : cat ratReport.txt
END OF POST BUILD TASK 	: 0
Recording test results
Not sending mail to unregistered user wy96fyw@gmail.com

Mime
View raw message