activemq-commits mailing list archives

Site index · List index
Message view « Date » · « Thread »
Top « Date » · « Thread »
From Apache Jenkins Server <jenk...@builds.apache.org>
Subject Build failed in Jenkins: ActiveMQ-Artemis-Master #2067
Date Tue, 18 Sep 2018 11:41:40 GMT
See <https://builds.apache.org/job/ActiveMQ-Artemis-Master/2067/display/redirect?page=changes>

Changes:

[michael.andre.pearce] ARTEMIS-1991 document advanced destination options

------------------------------------------
[...truncated 343.59 KB...]
Running org.apache.activemq.artemis.core.server.impl.jdbc.JdbcLeaseLockTest
[main] 11:37:40,547 INFO  [org.apache.activemq.artemis.core.server] **** start #test shouldRenewExpiredLockNotAcquiredByOthers[create_tables_prior_test=true]()
***
[main] 11:37:51,260 INFO  [org.apache.activemq.artemis.core.server] **** end #test shouldRenewExpiredLockNotAcquiredByOthers[create_tables_prior_test=true]()
***
[main] 11:37:51,261 INFO  [org.apache.activemq.artemis.core.server] **** start #test shouldNotCorruptGuardedState[create_tables_prior_test=true]()
***
[main] 11:38:00,827 INFO  [org.apache.activemq.artemis.core.server] **** end #test shouldNotCorruptGuardedState[create_tables_prior_test=true]()
***
[main] 11:38:00,828 INFO  [org.apache.activemq.artemis.core.server] **** start #test shouldNotRenewLockAcquiredByOthers[create_tables_prior_test=true]()
***
[main] 11:38:11,402 INFO  [org.apache.activemq.artemis.core.server] **** end #test shouldNotRenewLockAcquiredByOthers[create_tables_prior_test=true]()
***
[main] 11:38:11,402 INFO  [org.apache.activemq.artemis.core.server] **** start #test shouldNotAcquireLockWhenAlreadyHeldByOthers[create_tables_prior_test=true]()
***
[main] 11:38:19,710 INFO  [org.apache.activemq.artemis.core.server] **** end #test shouldNotAcquireLockWhenAlreadyHeldByOthers[create_tables_prior_test=true]()
***
[main] 11:38:19,710 INFO  [org.apache.activemq.artemis.core.server] **** start #test shouldNotRenewReleasedLock[create_tables_prior_test=true]()
***
[main] 11:38:27,476 INFO  [org.apache.activemq.artemis.core.server] **** end #test shouldNotRenewReleasedLock[create_tables_prior_test=true]()
***
[main] 11:38:27,477 INFO  [org.apache.activemq.artemis.core.server] **** start #test shouldOtherAcquireExpiredLock[create_tables_prior_test=true]()
***
[main] 11:38:38,208 INFO  [org.apache.activemq.artemis.core.server] **** end #test shouldOtherAcquireExpiredLock[create_tables_prior_test=true]()
***
[main] 11:38:38,209 INFO  [org.apache.activemq.artemis.core.server] **** start #test shouldRenewAcquiredLock[create_tables_prior_test=true]()
***
[main] 11:38:46,733 INFO  [org.apache.activemq.artemis.core.server] **** end #test shouldRenewAcquiredLock[create_tables_prior_test=true]()
***
[main] 11:38:46,734 INFO  [org.apache.activemq.artemis.core.server] **** start #test shouldAcquireLock[create_tables_prior_test=true]()
***
[main] 11:38:54,842 INFO  [org.apache.activemq.artemis.core.server] **** end #test shouldAcquireLock[create_tables_prior_test=true]()
***
[main] 11:38:54,843 INFO  [org.apache.activemq.artemis.core.server] **** start #test shouldNotAcquireLockTwice[create_tables_prior_test=true]()
***
[main] 11:39:03,474 INFO  [org.apache.activemq.artemis.core.server] **** end #test shouldNotAcquireLockTwice[create_tables_prior_test=true]()
***
[main] 11:39:03,475 INFO  [org.apache.activemq.artemis.core.server] **** start #test shouldAcquireExpiredLock[create_tables_prior_test=true]()
***
[main] 11:39:14,157 INFO  [org.apache.activemq.artemis.core.server] **** end #test shouldAcquireExpiredLock[create_tables_prior_test=true]()
***
[main] 11:39:14,158 INFO  [org.apache.activemq.artemis.core.server] **** start #test shouldRenewExpiredLockNotAcquiredByOthers[create_tables_prior_test=false]()
***
[main] 11:39:24,199 INFO  [org.apache.activemq.artemis.core.server] **** end #test shouldRenewExpiredLockNotAcquiredByOthers[create_tables_prior_test=false]()
***
[main] 11:39:24,199 INFO  [org.apache.activemq.artemis.core.server] **** start #test shouldNotCorruptGuardedState[create_tables_prior_test=false]()
***
[main] 11:39:33,349 INFO  [org.apache.activemq.artemis.core.server] **** end #test shouldNotCorruptGuardedState[create_tables_prior_test=false]()
***
[main] 11:39:33,350 INFO  [org.apache.activemq.artemis.core.server] **** start #test shouldNotRenewLockAcquiredByOthers[create_tables_prior_test=false]()
***
[main] 11:39:42,665 INFO  [org.apache.activemq.artemis.core.server] **** end #test shouldNotRenewLockAcquiredByOthers[create_tables_prior_test=false]()
***
[main] 11:39:42,666 INFO  [org.apache.activemq.artemis.core.server] **** start #test shouldNotAcquireLockWhenAlreadyHeldByOthers[create_tables_prior_test=false]()
***
[main] 11:39:50,498 INFO  [org.apache.activemq.artemis.core.server] **** end #test shouldNotAcquireLockWhenAlreadyHeldByOthers[create_tables_prior_test=false]()
***
[main] 11:39:50,498 INFO  [org.apache.activemq.artemis.core.server] **** start #test shouldNotRenewReleasedLock[create_tables_prior_test=false]()
***
[main] 11:39:58,698 INFO  [org.apache.activemq.artemis.core.server] **** end #test shouldNotRenewReleasedLock[create_tables_prior_test=false]()
***
[main] 11:39:58,699 INFO  [org.apache.activemq.artemis.core.server] **** start #test shouldOtherAcquireExpiredLock[create_tables_prior_test=false]()
***
[main] 11:40:10,264 INFO  [org.apache.activemq.artemis.core.server] **** end #test shouldOtherAcquireExpiredLock[create_tables_prior_test=false]()
***
[main] 11:40:10,265 INFO  [org.apache.activemq.artemis.core.server] **** start #test shouldRenewAcquiredLock[create_tables_prior_test=false]()
***
[main] 11:40:19,655 INFO  [org.apache.activemq.artemis.core.server] **** end #test shouldRenewAcquiredLock[create_tables_prior_test=false]()
***
[main] 11:40:19,656 INFO  [org.apache.activemq.artemis.core.server] **** start #test shouldAcquireLock[create_tables_prior_test=false]()
***
[main] 11:40:28,092 INFO  [org.apache.activemq.artemis.core.server] **** end #test shouldAcquireLock[create_tables_prior_test=false]()
***
[main] 11:40:28,092 INFO  [org.apache.activemq.artemis.core.server] **** start #test shouldNotAcquireLockTwice[create_tables_prior_test=false]()
***
[main] 11:40:38,259 INFO  [org.apache.activemq.artemis.core.server] **** end #test shouldNotAcquireLockTwice[create_tables_prior_test=false]()
***
[main] 11:40:38,259 INFO  [org.apache.activemq.artemis.core.server] **** start #test shouldAcquireExpiredLock[create_tables_prior_test=false]()
***
[main] 11:40:55,408 INFO  [org.apache.activemq.artemis.core.server] **** end #test shouldAcquireExpiredLock[create_tables_prior_test=false]()
***
Tests run: 20, Failures: 0, Errors: 0, Skipped: 0, Time elapsed: 194.866 sec - in org.apache.activemq.artemis.core.server.impl.jdbc.JdbcLeaseLockTest
Running org.apache.activemq.artemis.core.server.impl.jdbc.JdbcSharedStateManagerTest
[main] 11:40:55,431 INFO  [org.apache.activemq.artemis.core.server] **** start #test shouldStartTwoIfTableNotExist()
***
[main] 11:41:03,759 INFO  [org.apache.activemq.artemis.core.server] **** end #test shouldStartTwoIfTableNotExist()
***
[main] 11:41:03,759 INFO  [org.apache.activemq.artemis.core.server] **** start #test shouldStartIfTableNotExist()
***
[Thread-104] 11:41:16,029 ERROR [org.apache.activemq.artemis.jdbc.store.drivers.AbstractJDBCDriver]

SQL STATEMENTS: 
DROP TABLE NODE_MANAGER_STORE
SQL EXCEPTIONS: 
SQLState: XJ001 ErrorCode: 0 Message: Java exception: ': org.apache.derby.iapi.error.ShutdownException'.
[Thread-104] 11:41:16,030 ERROR [org.apache.activemq.artemis.jdbc.store.drivers.AbstractJDBCDriver]

SQL STATEMENTS: 
DROP TABLE NODE_MANAGER_STORE
SQL EXCEPTIONS: 
SQLState: 08003 ErrorCode: 40000 Message: No current connection.
[main] 11:41:17,725 INFO  [org.apache.activemq.artemis.core.server] **** end #test shouldStartIfTableNotExist()
***
[main] 11:41:17,761 INFO  [org.apache.activemq.artemis.core.server] **** start #test shouldStartIfTableExistInitialized()
***
[main] 11:41:27,333 INFO  [org.apache.activemq.artemis.core.server] **** end #test shouldStartIfTableExistInitialized()
***
[main] 11:41:27,333 INFO  [org.apache.activemq.artemis.core.server] **** start #test shouldStartIfTableExistEmpty()
***
[main] 11:41:35,466 INFO  [org.apache.activemq.artemis.core.server] **** end #test shouldStartIfTableExistEmpty()
***
Tests run: 4, Failures: 0, Errors: 1, Skipped: 0, Time elapsed: 40.057 sec <<< FAILURE!
- in org.apache.activemq.artemis.core.server.impl.jdbc.JdbcSharedStateManagerTest
shouldStartIfTableNotExist(org.apache.activemq.artemis.core.server.impl.jdbc.JdbcSharedStateManagerTest)
 Time elapsed: 14.003 sec  <<< ERROR!
java.lang.Exception: test timed out after 10000 milliseconds
	at java.io.FileDescriptor.sync(Native Method)
	at org.apache.derby.impl.io.DirRandomAccessFile.sync(Unknown Source)
	at org.apache.derby.impl.store.raw.data.RAFContainer.writeRAFHeader(Unknown Source)
	at org.apache.derby.impl.store.raw.data.RAFContainer.run(Unknown Source)
	at java.security.AccessController.doPrivileged(Native Method)
	at org.apache.derby.impl.store.raw.data.RAFContainer.stubbify(Unknown Source)
	at org.apache.derby.impl.store.raw.data.RAFContainer.removeContainer(Unknown Source)
	at org.apache.derby.impl.store.raw.data.BaseContainerHandle.removeContainer(Unknown Source)
	at org.apache.derby.impl.store.raw.data.ContainerOperation.doMe(Unknown Source)
	at org.apache.derby.impl.store.raw.log.FileLogger.logAndDo(Unknown Source)
	at org.apache.derby.impl.store.raw.xact.Xact.logAndDo(Unknown Source)
	at org.apache.derby.impl.store.raw.data.ReclaimSpaceHelper.reclaimContainer(Unknown Source)
	at org.apache.derby.impl.store.raw.data.ReclaimSpaceHelper.reclaimSpace(Unknown Source)
	at org.apache.derby.impl.store.raw.data.BaseDataFileFactory.reclaimSpace(Unknown Source)
	at org.apache.derby.impl.store.raw.data.ReclaimSpace.performWork(Unknown Source)
	at org.apache.derby.impl.store.raw.xact.Xact.postTermination(Unknown Source)
	at org.apache.derby.impl.store.raw.xact.Xact.completeCommit(Unknown Source)
	at org.apache.derby.impl.store.raw.xact.Xact.commit(Unknown Source)
	at org.apache.derby.impl.store.raw.xact.Xact.commit(Unknown Source)
	at org.apache.derby.impl.store.access.RAMTransaction.commit(Unknown Source)
	at org.apache.derby.impl.sql.conn.GenericLanguageConnectionContext.doCommit(Unknown Source)
	at org.apache.derby.impl.sql.conn.GenericLanguageConnectionContext.userCommit(Unknown Source)
	at org.apache.derby.impl.jdbc.TransactionResourceImpl.commit(Unknown Source)
	at org.apache.derby.impl.jdbc.EmbedConnection.commit(Unknown Source)
	at org.apache.activemq.artemis.jdbc.store.drivers.AbstractJDBCDriver.destroy(AbstractJDBCDriver.java:183)
	at org.apache.activemq.artemis.core.server.impl.jdbc.JdbcSharedStateManagerTest.shouldStartIfTableNotExist(JdbcSharedStateManagerTest.java:64)

Running org.apache.activemq.artemis.core.server.journal.JournalStorageManagerConstantTest
Tests run: 1, Failures: 0, Errors: 0, Skipped: 0, Time elapsed: 0 sec - in org.apache.activemq.artemis.core.server.journal.JournalStorageManagerConstantTest
Running org.apache.activemq.artemis.core.server.management.JMXAccessControlListTest
Tests run: 14, Failures: 0, Errors: 0, Skipped: 0, Time elapsed: 0.001 sec - in org.apache.activemq.artemis.core.server.management.JMXAccessControlListTest
Running org.apache.activemq.artemis.core.settings.AddressSettingsTest
[main] 11:41:35,477 INFO  [org.apache.activemq.artemis.core.server] **** start #test testMultipleMergeAll()
***
[main] 11:41:35,479 INFO  [org.apache.activemq.artemis.core.server] **** end #test testMultipleMergeAll()
***
[main] 11:41:35,480 INFO  [org.apache.activemq.artemis.core.server] **** start #test testMultipleMerge()
***
[main] 11:41:35,481 INFO  [org.apache.activemq.artemis.core.server] **** end #test testMultipleMerge()
***
[main] 11:41:35,482 INFO  [org.apache.activemq.artemis.core.server] **** start #test testDefaults()
***
[main] 11:41:35,483 INFO  [org.apache.activemq.artemis.core.server] **** end #test testDefaults()
***
[main] 11:41:35,483 INFO  [org.apache.activemq.artemis.core.server] **** start #test testSingleMerge()
***
[main] 11:41:35,485 INFO  [org.apache.activemq.artemis.core.server] **** end #test testSingleMerge()
***
Tests run: 4, Failures: 0, Errors: 0, Skipped: 0, Time elapsed: 0.006 sec - in org.apache.activemq.artemis.core.settings.AddressSettingsTest
Running org.apache.activemq.artemis.core.settings.RepositoryTest
[main] 11:41:35,486 INFO  [org.apache.activemq.artemis.core.server] **** start #test testMultipleWildcards()
***
[main] 11:41:35,489 INFO  [org.apache.activemq.artemis.core.server] **** end #test testMultipleWildcards()
***
[main] 11:41:35,490 INFO  [org.apache.activemq.artemis.core.server] **** start #test testMatchingDocs()
***
[main] 11:41:35,492 INFO  [org.apache.activemq.artemis.core.server] **** end #test testMatchingDocs()
***
[main] 11:41:35,492 INFO  [org.apache.activemq.artemis.core.server] **** start #test testWithoutWildcard()
***
[main] 11:41:35,494 INFO  [org.apache.activemq.artemis.core.server] **** end #test testWithoutWildcard()
***
[main] 11:41:35,494 INFO  [org.apache.activemq.artemis.core.server] **** start #test testSingletwo()
***
[main] 11:41:35,496 INFO  [org.apache.activemq.artemis.core.server] **** end #test testSingletwo()
***
[main] 11:41:35,496 INFO  [org.apache.activemq.artemis.core.server] **** start #test testIllegalMatches()
***
[main] 11:41:35,498 INFO  [org.apache.activemq.artemis.core.server] **** end #test testIllegalMatches()
***
[main] 11:41:35,498 INFO  [org.apache.activemq.artemis.core.server] **** start #test testAddListener()
***
[main] 11:41:35,501 INFO  [org.apache.activemq.artemis.core.server] **** end #test testAddListener()
***
[main] 11:41:35,501 INFO  [org.apache.activemq.artemis.core.server] **** start #test testDefault()
***
[main] 11:41:35,503 INFO  [org.apache.activemq.artemis.core.server] **** end #test testDefault()
***
[main] 11:41:35,503 INFO  [org.apache.activemq.artemis.core.server] **** start #test testMatchingDocsCustomUnderscorDelimiter()
***
[main] 11:41:35,505 INFO  [org.apache.activemq.artemis.core.server] **** end #test testMatchingDocsCustomUnderscorDelimiter()
***
[main] 11:41:35,506 INFO  [org.apache.activemq.artemis.core.server] **** start #test testSingleMatch()
***
[main] 11:41:35,508 INFO  [org.apache.activemq.artemis.core.server] **** end #test testSingleMatch()
***
[main] 11:41:35,508 INFO  [org.apache.activemq.artemis.core.server] **** start #test testRepositoryMerge()
***
[main] 11:41:35,512 INFO  [org.apache.activemq.artemis.core.server] **** end #test testRepositoryMerge()
***
[main] 11:41:35,512 INFO  [org.apache.activemq.artemis.core.server] **** start #test testMatchingDocsCustomForwardSlashDelimiter()
***
[main] 11:41:35,514 INFO  [org.apache.activemq.artemis.core.server] **** end #test testMatchingDocsCustomForwardSlashDelimiter()
***
Tests run: 11, Failures: 0, Errors: 0, Skipped: 0, Time elapsed: 0.029 sec - in org.apache.activemq.artemis.core.settings.RepositoryTest
Running org.apache.activemq.artemis.core.transaction.impl.TransactionImplTest
[main] 11:41:35,516 INFO  [org.apache.activemq.artemis.core.server] **** start #test testTimeoutThenRollbackWithRollback()
***
rollback...
[main] 11:41:35,526 INFO  [org.apache.activemq.artemis.core.server] **** end #test testTimeoutThenRollbackWithRollback()
***
[main] 11:41:35,527 INFO  [org.apache.activemq.artemis.core.server] **** start #test testTimeoutAndThenCommitWithARollback()
***
rollback...
[main] 11:41:35,529 INFO  [org.apache.activemq.artemis.core.server] **** end #test testTimeoutAndThenCommitWithARollback()
***
Tests run: 2, Failures: 0, Errors: 0, Skipped: 0, Time elapsed: 0.015 sec - in org.apache.activemq.artemis.core.transaction.impl.TransactionImplTest
Running org.apache.activemq.artemis.core.version.impl.VersionImplTest
Tests run: 3, Failures: 0, Errors: 0, Skipped: 0, Time elapsed: 0.002 sec - in org.apache.activemq.artemis.core.version.impl.VersionImplTest
Running org.apache.activemq.artemis.spi.core.security.jaas.Krb5LoginModuleTest
Tests run: 2, Failures: 0, Errors: 0, Skipped: 0, Time elapsed: 0.002 sec - in org.apache.activemq.artemis.spi.core.security.jaas.Krb5LoginModuleTest
Running org.apache.activemq.artemis.tests.util.SimpleStringTest
Tests run: 20, Failures: 0, Errors: 0, Skipped: 0, Time elapsed: 0.264 sec - in org.apache.activemq.artemis.tests.util.SimpleStringTest
Running org.apache.activemq.artemis.uri.AcceptorParserTest
config:TransportConfiguration(name=test, factory=org-apache-activemq-artemis-core-remoting-impl-netty-NettyAcceptorFactory)
?tcpReceiveBufferSize=1048576&port=8080&host=localhost&protocols=openwire&tcpSendBufferSize=1048576&banana=x
config:TransportConfiguration(name=test, factory=org-apache-activemq-artemis-core-remoting-impl-netty-NettyAcceptorFactory)
?tcpReceiveBufferSize=1048576&port=5672&host=0-0-0-0&tcpSendBufferSize=1048576&virtualTopicConsumerWildcards=Consumer-*->;2
Consumer.*.>;2
Tests run: 2, Failures: 0, Errors: 0, Skipped: 0, Time elapsed: 0.001 sec - in org.apache.activemq.artemis.uri.AcceptorParserTest
Running org.apache.activemq.artemis.uri.ClusterConnectionConfigurationTest
Tests run: 5, Failures: 0, Errors: 0, Skipped: 0, Time elapsed: 0.009 sec - in org.apache.activemq.artemis.uri.ClusterConnectionConfigurationTest

Results :

Tests in error: 
  JdbcSharedStateManagerTest.shouldStartIfTableNotExist:64 ยป  test timed out aft...

Tests run: 275, Failures: 0, Errors: 1, Skipped: 0

[INFO] ------------------------------------------------------------------------
[INFO] Reactor Summary:
[INFO] 
[INFO] ActiveMQ Artemis Parent ............................ SUCCESS [  4.074 s]
[INFO] ActiveMQ Artemis Commons ........................... SUCCESS [ 21.364 s]
[INFO] ActiveMQ Artemis Core Client ....................... SUCCESS [ 10.491 s]
[INFO] ActiveMQ Artemis Selector Implementation ........... SUCCESS [  3.366 s]
[INFO] ActiveMQ Artemis JMS Client ........................ SUCCESS [  4.406 s]
[INFO] ActiveMQ Artemis Native POM ........................ SUCCESS [  6.256 s]
[INFO] ActiveMQ Artemis Journal ........................... SUCCESS [  3.284 s]
[INFO] ActiveMQ Artemis JDBC Store ........................ SUCCESS [ 26.450 s]
[INFO] ActiveMQ Artemis Server ............................ FAILURE [05:42 min]
[INFO] ActiveMQ Artemis Protocols ......................... SKIPPED
[INFO] ActiveMQ Artemis AMQP Protocol ..................... SKIPPED
[INFO] ActiveMQ Artemis STOMP Protocol .................... SKIPPED
[INFO] ActiveMQ Artemis OpenWire Protocol ................. SKIPPED
[INFO] ActiveMQ Artemis HQClient Protocol ................. SKIPPED
[INFO] ActiveMQ Artemis HornetQ Protocol .................. SKIPPED
[INFO] ActiveMQ Artemis MQTT Protocol ..................... SKIPPED
[INFO] ActiveMQ Artemis DTO ............................... SKIPPED
[INFO] ActiveMQ Artemis Service Extensions ................ SKIPPED
[INFO] ActiveMQ Artemis JMS Server ........................ SKIPPED
[INFO] ActiveMQ Artemis CDI Integration ................... SKIPPED
[INFO] ActiveMQ Artemis Boot .............................. SKIPPED
[INFO] ActiveMQ Artemis Tools ............................. SKIPPED
[INFO] ActiveMQ Artemis CLI ............................... SKIPPED
[INFO] ActiveMQ Artemis Web ............................... SKIPPED
[INFO] ActiveMQ Artemis Web ............................... SKIPPED
[INFO] ActiveMQ Artemis Core Client All ................... SKIPPED
[INFO] ActiveMQ Artemis Client OSGi ....................... SKIPPED
[INFO] ActiveMQ Artemis JUnit Rules ....................... SKIPPED
[INFO] ActiveMQ Artemis JMS Client All .................... SKIPPED
[INFO] ActiveMQ Artemis JMS Client OSGi ................... SKIPPED
[INFO] ActiveMQ Artemis RAR POM ........................... SKIPPED
[INFO] ActiveMQ Artemis REST Interface Implementation ..... SKIPPED
[INFO] ActiveMQ Artemis Maven Plugin ...................... SKIPPED
[INFO] ActiveMQ Artemis Server OSGi ....................... SKIPPED
[INFO] ActiveMQ Artemis Cons .............................. SKIPPED
[INFO] ActiveMQ Artemis HawtIO Branding ................... SKIPPED
[INFO] ActiveMQ Artemis HawtIO Plugin ..................... SKIPPED
[INFO] ActiveMQ Artemis Console ........................... SKIPPED
[INFO] ActiveMQ Artemis Spring Integration ................ SKIPPED
[INFO] Apache ActiveMQ Artemis Distribution ............... SKIPPED
[INFO] ActiveMQ Artemis Tests POM ......................... SKIPPED
[INFO] ActiveMQ Artemis Test Support ...................... SKIPPED
[INFO] ActiveMQ Artemis Unit Tests ........................ SKIPPED
[INFO] ActiveMQ Artemis Joram Tests ....................... SKIPPED
[INFO] ActiveMQ Artemis timing Tests ...................... SKIPPED
[INFO] ActiveMQ Artemis JMS Tests ......................... SKIPPED
[INFO] ActiveMQ Artemis Features .......................... SKIPPED
[INFO] ActiveMQ Artemis Integration Tests ................. SKIPPED
[INFO] ActiveMQ Artemis Client Integration Tests .......... SKIPPED
[INFO] ActiveMQ Artemis Compatibility Tests ............... SKIPPED
[INFO] ActiveMQ Artemis soak Tests ........................ SKIPPED
[INFO] ActiveMQ Artemis stress Tests ...................... SKIPPED
[INFO] ActiveMQ Artemis performance Tests ................. SKIPPED
[INFO] Smoke Tests ........................................ SKIPPED
[INFO] ActiveMQ Artemis Extra Tests ....................... SKIPPED
[INFO] ------------------------------------------------------------------------
[INFO] BUILD FAILURE
[INFO] ------------------------------------------------------------------------
[INFO] Total time: 07:04 min
[INFO] Finished at: 2018-09-18T11:41:36+00:00
[INFO] Final Memory: 204M/3625M
[INFO] ------------------------------------------------------------------------
[ERROR] Failed to execute goal org.apache.maven.plugins:maven-surefire-plugin:2.18.1:test
(default-test) on project artemis-server: There are test failures.
[ERROR] 
[ERROR] Please refer to <https://builds.apache.org/job/ActiveMQ-Artemis-Master/ws/artemis-server/target/surefire-reports>
for the individual test results.
[ERROR] -> [Help 1]
[ERROR] 
[ERROR] To see the full stack trace of the errors, re-run Maven with the -e switch.
[ERROR] Re-run Maven using the -X switch to enable full debug logging.
[ERROR] 
[ERROR] For more information about the errors and possible solutions, please read the following
articles:
[ERROR] [Help 1] http://cwiki.apache.org/confluence/display/MAVEN/MojoFailureException
[ERROR] 
[ERROR] After correcting the problems, you can resume the build with the command
[ERROR]   mvn <goals> -rf :artemis-server
Build step 'Invoke top-level Maven targets' marked build as failure
Performing Post build task...
Could not match :Too many files with unapproved license  : False
Logical operation result is FALSE
Skipping script  : cat ratReport.txt
END OF POST BUILD TASK 	: 0
Recording test results
Not sending mail to unregistered user jmesnil@gmail.com
Not sending mail to unregistered user mtaylor@redhat.com
Not sending mail to unregistered user rkieley@unifiedsoftworx.com
Not sending mail to unregistered user tabish121@gmail.com
Not sending mail to unregistered user michael.andre.pearce@me.com
Not sending mail to unregistered user noreply@github.com

Mime
View raw message