activemq-commits mailing list archives

Site index · List index
Message view « Date » · « Thread »
Top « Date » · « Thread »
From Apache Jenkins Server <jenk...@builds.apache.org>
Subject Build failed in Jenkins: ActiveMQ-Artemis-Master #2237
Date Fri, 18 Jan 2019 03:04:15 GMT
See <https://builds.apache.org/job/ActiveMQ-Artemis-Master/2237/display/redirect?page=changes>

Changes:

[clebertsuconic] ARTEMIS-2200 NPE fix

------------------------------------------
[...truncated 679.30 KB...]
	at org.apache.activemq.artemis.cli.commands.tools.LockAbstract.lockCLI(LockAbstract.java:78)
	at org.apache.activemq.artemis.cli.commands.tools.LockAbstract.execute(LockAbstract.java:58)
	at org.apache.activemq.artemis.cli.commands.Run.execute(Run.java:68)
	at org.apache.activemq.artemis.cli.Artemis.internalExecute(Artemis.java:150)
	at org.apache.activemq.artemis.cli.Artemis.internalExecute(Artemis.java:133)
	at org.apache.activemq.artemis.cli.Artemis.internalExecute(Artemis.java:85)
	at org.apache.activemq.cli.test.CliTestBase.startServer(CliTestBase.java:92)
	at org.apache.activemq.cli.test.MessageSerializerTest.setup(MessageSerializerTest.java:64)

testMulticastTopicToAnycastQueueBothAddress(org.apache.activemq.cli.test.MessageSerializerTest)
 Time elapsed: 0.015 sec  <<< ERROR!
org.apache.activemq.artemis.cli.ConfigurationException: Invalid configuration URI, can't find
file: bootstrap.xml
	at org.apache.activemq.artemis.cli.factory.xml.XmlBrokerFactoryHandler.createBroker(XmlBrokerFactoryHandler.java:33)
	at org.apache.activemq.artemis.cli.factory.BrokerFactory.createBrokerConfiguration(BrokerFactory.java:46)
	at org.apache.activemq.artemis.cli.factory.BrokerFactory.createBrokerConfiguration(BrokerFactory.java:53)
	at org.apache.activemq.artemis.cli.commands.Configurable.getBrokerDTO(Configurable.java:118)
	at org.apache.activemq.artemis.cli.commands.Stop.execute(Stop.java:30)
	at org.apache.activemq.artemis.cli.Artemis.internalExecute(Artemis.java:150)
	at org.apache.activemq.artemis.cli.Artemis.internalExecute(Artemis.java:133)
	at org.apache.activemq.artemis.cli.Artemis.internalExecute(Artemis.java:85)
	at org.apache.activemq.cli.test.CliTestBase.stopServer(CliTestBase.java:104)
	at org.apache.activemq.cli.test.CliTestBase.closeConnection(CliTestBase.java:130)
	at org.apache.activemq.cli.test.MessageSerializerTest.tearDown(MessageSerializerTest.java:72)

testSendDirectToQueue(org.apache.activemq.cli.test.MessageSerializerTest)  Time elapsed: 0.019
sec  <<< ERROR!
org.apache.activemq.artemis.cli.CLIException: Error: There is another process using the server
at <https://builds.apache.org/job/ActiveMQ-Artemis-Master/ws/artemis-cli/./target/tmp/junit6992924233150562710/broker/lock.>
Cannot start the process!
	at org.apache.activemq.artemis.cli.commands.tools.LockAbstract.lockCLI(LockAbstract.java:78)
	at org.apache.activemq.artemis.cli.commands.tools.LockAbstract.execute(LockAbstract.java:58)
	at org.apache.activemq.artemis.cli.commands.Run.execute(Run.java:68)
	at org.apache.activemq.artemis.cli.Artemis.internalExecute(Artemis.java:150)
	at org.apache.activemq.artemis.cli.Artemis.internalExecute(Artemis.java:133)
	at org.apache.activemq.artemis.cli.Artemis.internalExecute(Artemis.java:85)
	at org.apache.activemq.cli.test.CliTestBase.startServer(CliTestBase.java:92)
	at org.apache.activemq.cli.test.MessageSerializerTest.setup(MessageSerializerTest.java:64)

testSendDirectToQueue(org.apache.activemq.cli.test.MessageSerializerTest)  Time elapsed: 0.019
sec  <<< ERROR!
org.apache.activemq.artemis.cli.ConfigurationException: Invalid configuration URI, can't find
file: bootstrap.xml
	at org.apache.activemq.artemis.cli.factory.xml.XmlBrokerFactoryHandler.createBroker(XmlBrokerFactoryHandler.java:33)
	at org.apache.activemq.artemis.cli.factory.BrokerFactory.createBrokerConfiguration(BrokerFactory.java:46)
	at org.apache.activemq.artemis.cli.factory.BrokerFactory.createBrokerConfiguration(BrokerFactory.java:53)
	at org.apache.activemq.artemis.cli.commands.Configurable.getBrokerDTO(Configurable.java:118)
	at org.apache.activemq.artemis.cli.commands.Stop.execute(Stop.java:30)
	at org.apache.activemq.artemis.cli.Artemis.internalExecute(Artemis.java:150)
	at org.apache.activemq.artemis.cli.Artemis.internalExecute(Artemis.java:133)
	at org.apache.activemq.artemis.cli.Artemis.internalExecute(Artemis.java:85)
	at org.apache.activemq.cli.test.CliTestBase.stopServer(CliTestBase.java:104)
	at org.apache.activemq.cli.test.CliTestBase.closeConnection(CliTestBase.java:130)
	at org.apache.activemq.cli.test.MessageSerializerTest.tearDown(MessageSerializerTest.java:72)

testAnycastToMulticastTopic(org.apache.activemq.cli.test.MessageSerializerTest)  Time elapsed:
0.016 sec  <<< ERROR!
org.apache.activemq.artemis.cli.CLIException: Error: There is another process using the server
at <https://builds.apache.org/job/ActiveMQ-Artemis-Master/ws/artemis-cli/./target/tmp/junit3400277093588439558/broker/lock.>
Cannot start the process!
	at org.apache.activemq.artemis.cli.commands.tools.LockAbstract.lockCLI(LockAbstract.java:78)
	at org.apache.activemq.artemis.cli.commands.tools.LockAbstract.execute(LockAbstract.java:58)
	at org.apache.activemq.artemis.cli.commands.Run.execute(Run.java:68)
	at org.apache.activemq.artemis.cli.Artemis.internalExecute(Artemis.java:150)
	at org.apache.activemq.artemis.cli.Artemis.internalExecute(Artemis.java:133)
	at org.apache.activemq.artemis.cli.Artemis.internalExecute(Artemis.java:85)
	at org.apache.activemq.cli.test.CliTestBase.startServer(CliTestBase.java:92)
	at org.apache.activemq.cli.test.MessageSerializerTest.setup(MessageSerializerTest.java:64)

testAnycastToMulticastTopic(org.apache.activemq.cli.test.MessageSerializerTest)  Time elapsed:
0.016 sec  <<< ERROR!
org.apache.activemq.artemis.cli.ConfigurationException: Invalid configuration URI, can't find
file: bootstrap.xml
	at org.apache.activemq.artemis.cli.factory.xml.XmlBrokerFactoryHandler.createBroker(XmlBrokerFactoryHandler.java:33)
	at org.apache.activemq.artemis.cli.factory.BrokerFactory.createBrokerConfiguration(BrokerFactory.java:46)
	at org.apache.activemq.artemis.cli.factory.BrokerFactory.createBrokerConfiguration(BrokerFactory.java:53)
	at org.apache.activemq.artemis.cli.commands.Configurable.getBrokerDTO(Configurable.java:118)
	at org.apache.activemq.artemis.cli.commands.Stop.execute(Stop.java:30)
	at org.apache.activemq.artemis.cli.Artemis.internalExecute(Artemis.java:150)
	at org.apache.activemq.artemis.cli.Artemis.internalExecute(Artemis.java:133)
	at org.apache.activemq.artemis.cli.Artemis.internalExecute(Artemis.java:85)
	at org.apache.activemq.cli.test.CliTestBase.stopServer(CliTestBase.java:104)
	at org.apache.activemq.cli.test.CliTestBase.closeConnection(CliTestBase.java:130)
	at org.apache.activemq.cli.test.MessageSerializerTest.tearDown(MessageSerializerTest.java:72)

testAnycastToMulticastFQQN(org.apache.activemq.cli.test.MessageSerializerTest)  Time elapsed:
0.016 sec  <<< ERROR!
org.apache.activemq.artemis.cli.CLIException: Error: There is another process using the server
at <https://builds.apache.org/job/ActiveMQ-Artemis-Master/ws/artemis-cli/./target/tmp/junit8383462999310230096/broker/lock.>
Cannot start the process!
	at org.apache.activemq.artemis.cli.commands.tools.LockAbstract.lockCLI(LockAbstract.java:78)
	at org.apache.activemq.artemis.cli.commands.tools.LockAbstract.execute(LockAbstract.java:58)
	at org.apache.activemq.artemis.cli.commands.Run.execute(Run.java:68)
	at org.apache.activemq.artemis.cli.Artemis.internalExecute(Artemis.java:150)
	at org.apache.activemq.artemis.cli.Artemis.internalExecute(Artemis.java:133)
	at org.apache.activemq.artemis.cli.Artemis.internalExecute(Artemis.java:85)
	at org.apache.activemq.cli.test.CliTestBase.startServer(CliTestBase.java:92)
	at org.apache.activemq.cli.test.MessageSerializerTest.setup(MessageSerializerTest.java:64)

testAnycastToMulticastFQQN(org.apache.activemq.cli.test.MessageSerializerTest)  Time elapsed:
0.016 sec  <<< ERROR!
org.apache.activemq.artemis.cli.ConfigurationException: Invalid configuration URI, can't find
file: bootstrap.xml
	at org.apache.activemq.artemis.cli.factory.xml.XmlBrokerFactoryHandler.createBroker(XmlBrokerFactoryHandler.java:33)
	at org.apache.activemq.artemis.cli.factory.BrokerFactory.createBrokerConfiguration(BrokerFactory.java:46)
	at org.apache.activemq.artemis.cli.factory.BrokerFactory.createBrokerConfiguration(BrokerFactory.java:53)
	at org.apache.activemq.artemis.cli.commands.Configurable.getBrokerDTO(Configurable.java:118)
	at org.apache.activemq.artemis.cli.commands.Stop.execute(Stop.java:30)
	at org.apache.activemq.artemis.cli.Artemis.internalExecute(Artemis.java:150)
	at org.apache.activemq.artemis.cli.Artemis.internalExecute(Artemis.java:133)
	at org.apache.activemq.artemis.cli.Artemis.internalExecute(Artemis.java:85)
	at org.apache.activemq.cli.test.CliTestBase.stopServer(CliTestBase.java:104)
	at org.apache.activemq.cli.test.CliTestBase.closeConnection(CliTestBase.java:130)
	at org.apache.activemq.cli.test.MessageSerializerTest.tearDown(MessageSerializerTest.java:72)

Running org.apache.activemq.cli.test.OptionsValidationTest
Tests run: 28, Failures: 0, Errors: 0, Skipped: 0, Time elapsed: 0.256 sec - in org.apache.activemq.cli.test.OptionsValidationTest
Running org.apache.activemq.cli.test.StreamClassPathTest
Tests run: 1, Failures: 0, Errors: 0, Skipped: 0, Time elapsed: 0.001 sec - in org.apache.activemq.cli.test.StreamClassPathTest

Results :

Failed tests: 
  CliProducerTest.tearDown:51->CliTestBase.closeConnection:130->CliTestBase.stopServer:105
null
Tests in error: 
org.apache.activemq.cli.test.CliProducerTest.testSendMessageCustomBodyFQQN(org.apache.activemq.cli.test.CliProducerTest)
  Run 1: CliProducerTest.setup:43->CliTestBase.startServer:92 » CLI Error: There is ano...
  Run 2: CliProducerTest.tearDown:51->CliTestBase.closeConnection:130->CliTestBase.stopServer:104
» Configuration

org.apache.activemq.cli.test.CliProducerTest.testSendMessageWithCustomBody(org.apache.activemq.cli.test.CliProducerTest)
  Run 1: CliProducerTest.setup:43->CliTestBase.startServer:92 » CLI Error: There is ano...
  Run 2: CliProducerTest.tearDown:51->CliTestBase.closeConnection:130->CliTestBase.stopServer:104
» Configuration

org.apache.activemq.cli.test.MessageSerializerTest.exportFromFQQN(org.apache.activemq.cli.test.MessageSerializerTest)
  Run 1: MessageSerializerTest.setup:64->CliTestBase.startServer:92 » CLI Error: There
...
  Run 2: MessageSerializerTest.tearDown:72->CliTestBase.closeConnection:130->CliTestBase.stopServer:104
» Configuration

org.apache.activemq.cli.test.MessageSerializerTest.testAnycastQueueToMulticastTopicBothAddress(org.apache.activemq.cli.test.MessageSerializerTest)
  Run 1: MessageSerializerTest.setup:64->CliTestBase.startServer:92 » CLI Error: There
...
  Run 2: MessageSerializerTest.tearDown:72->CliTestBase.closeConnection:130->CliTestBase.stopServer:104
» Configuration

org.apache.activemq.cli.test.MessageSerializerTest.testAnycastToMulticastFQQN(org.apache.activemq.cli.test.MessageSerializerTest)
  Run 1: MessageSerializerTest.setup:64->CliTestBase.startServer:92 » CLI Error: There
...
  Run 2: MessageSerializerTest.tearDown:72->CliTestBase.closeConnection:130->CliTestBase.stopServer:104
» Configuration

org.apache.activemq.cli.test.MessageSerializerTest.testAnycastToMulticastTopic(org.apache.activemq.cli.test.MessageSerializerTest)
  Run 1: MessageSerializerTest.setup:64->CliTestBase.startServer:92 » CLI Error: There
...
  Run 2: MessageSerializerTest.tearDown:72->CliTestBase.closeConnection:130->CliTestBase.stopServer:104
» Configuration

org.apache.activemq.cli.test.MessageSerializerTest.testMapMessageImportExport(org.apache.activemq.cli.test.MessageSerializerTest)
  Run 1: MessageSerializerTest.setup:64->CliTestBase.startServer:92 » CLI Error: There
...
  Run 2: MessageSerializerTest.tearDown:72->CliTestBase.closeConnection:130->CliTestBase.stopServer:104
» Configuration

org.apache.activemq.cli.test.MessageSerializerTest.testMulticastTopicToAnycastQueueBothAddress(org.apache.activemq.cli.test.MessageSerializerTest)
  Run 1: MessageSerializerTest.setup:64->CliTestBase.startServer:92 » CLI Error: There
...
  Run 2: MessageSerializerTest.tearDown:72->CliTestBase.closeConnection:130->CliTestBase.stopServer:104
» Configuration

org.apache.activemq.cli.test.MessageSerializerTest.testObjectMessageImportExport(org.apache.activemq.cli.test.MessageSerializerTest)
  Run 1: MessageSerializerTest.setup:64->CliTestBase.startServer:92 » CLI Error: There
...
  Run 2: MessageSerializerTest.tearDown:72->CliTestBase.closeConnection:130->CliTestBase.stopServer:104
» Configuration

org.apache.activemq.cli.test.MessageSerializerTest.testSendDirectToQueue(org.apache.activemq.cli.test.MessageSerializerTest)
  Run 1: MessageSerializerTest.setup:64->CliTestBase.startServer:92 » CLI Error: There
...
  Run 2: MessageSerializerTest.tearDown:72->CliTestBase.closeConnection:130->CliTestBase.stopServer:104
» Configuration

org.apache.activemq.cli.test.MessageSerializerTest.testTextMessageImportExport(org.apache.activemq.cli.test.MessageSerializerTest)
  Run 1: MessageSerializerTest.setup:64->CliTestBase.startServer:92 » CLI Error: There
...
  Run 2: MessageSerializerTest.tearDown:72->CliTestBase.closeConnection:130->CliTestBase.stopServer:104
» Configuration


Tests run: 66, Failures: 1, Errors: 11, Skipped: 0

[INFO] ------------------------------------------------------------------------
[INFO] Reactor Summary:
[INFO] 
[INFO] ActiveMQ Artemis Parent ............................ SUCCESS [  3.365 s]
[INFO] ActiveMQ Artemis Commons ........................... SUCCESS [ 22.901 s]
[INFO] ActiveMQ Artemis Core Client ....................... SUCCESS [ 11.268 s]
[INFO] ActiveMQ Artemis Selector Implementation ........... SUCCESS [  3.527 s]
[INFO] ActiveMQ Artemis JMS Client ........................ SUCCESS [  4.013 s]
[INFO] ActiveMQ Artemis Native POM ........................ SUCCESS [  6.573 s]
[INFO] ActiveMQ Artemis Journal ........................... SUCCESS [  2.903 s]
[INFO] ActiveMQ Artemis JDBC Store ........................ SUCCESS [  5.339 s]
[INFO] ActiveMQ Artemis Server ............................ SUCCESS [02:06 min]
[INFO] ActiveMQ Artemis Protocols ......................... SUCCESS [  0.124 s]
[INFO] ActiveMQ Artemis AMQP Protocol ..................... SUCCESS [  9.760 s]
[INFO] ActiveMQ Artemis STOMP Protocol .................... SUCCESS [  2.258 s]
[INFO] ActiveMQ Artemis OpenWire Protocol ................. SUCCESS [  2.494 s]
[INFO] ActiveMQ Artemis HQClient Protocol ................. SUCCESS [  0.736 s]
[INFO] ActiveMQ Artemis HornetQ Protocol .................. SUCCESS [  1.487 s]
[INFO] ActiveMQ Artemis MQTT Protocol ..................... SUCCESS [  1.932 s]
[INFO] ActiveMQ Artemis DTO ............................... SUCCESS [  2.021 s]
[INFO] ActiveMQ Artemis Service Extensions ................ SUCCESS [  2.535 s]
[INFO] ActiveMQ Artemis JMS Server ........................ SUCCESS [  1.811 s]
[INFO] ActiveMQ Artemis CDI Integration ................... SUCCESS [  6.147 s]
[INFO] ActiveMQ Artemis Boot .............................. SUCCESS [  0.206 s]
[INFO] ActiveMQ Artemis Tools ............................. SUCCESS [  1.237 s]
[INFO] ActiveMQ Artemis JUnit Rules ....................... SUCCESS [  7.461 s]
[INFO] ActiveMQ Artemis CLI ............................... FAILURE [ 51.984 s]
[INFO] ActiveMQ Artemis Web ............................... SKIPPED
[INFO] ActiveMQ Artemis Web ............................... SKIPPED
[INFO] ActiveMQ Artemis Core Client All ................... SKIPPED
[INFO] ActiveMQ Artemis Client OSGi ....................... SKIPPED
[INFO] ActiveMQ Artemis JMS Client All .................... SKIPPED
[INFO] ActiveMQ Artemis JMS Client OSGi ................... SKIPPED
[INFO] ActiveMQ Artemis RAR POM ........................... SKIPPED
[INFO] ActiveMQ Artemis REST Interface Implementation ..... SKIPPED
[INFO] ActiveMQ Artemis Maven Plugin ...................... SKIPPED
[INFO] ActiveMQ Artemis Server OSGi ....................... SKIPPED
[INFO] ActiveMQ Artemis Cons .............................. SKIPPED
[INFO] ActiveMQ Artemis HawtIO Branding ................... SKIPPED
[INFO] ActiveMQ Artemis HawtIO Plugin ..................... SKIPPED
[INFO] ActiveMQ Artemis Console ........................... SKIPPED
[INFO] ActiveMQ Artemis Spring Integration ................ SKIPPED
[INFO] Apache ActiveMQ Artemis Distribution ............... SKIPPED
[INFO] ActiveMQ Artemis Tests POM ......................... SKIPPED
[INFO] ActiveMQ Artemis Test Support ...................... SKIPPED
[INFO] ActiveMQ Artemis Unit Tests ........................ SKIPPED
[INFO] ActiveMQ Artemis Joram Tests ....................... SKIPPED
[INFO] ActiveMQ Artemis timing Tests ...................... SKIPPED
[INFO] ActiveMQ Artemis JMS Tests ......................... SKIPPED
[INFO] ActiveMQ Artemis Features .......................... SKIPPED
[INFO] ActiveMQ Artemis Integration Tests ................. SKIPPED
[INFO] ActiveMQ Artemis Client Integration Tests .......... SKIPPED
[INFO] ActiveMQ Artemis Compatibility Tests ............... SKIPPED
[INFO] ActiveMQ Artemis soak Tests ........................ SKIPPED
[INFO] ActiveMQ Artemis stress Tests ...................... SKIPPED
[INFO] ActiveMQ Artemis performance Tests ................. SKIPPED
[INFO] Smoke Tests ........................................ SKIPPED
[INFO] ActiveMQ Artemis Extra Tests ....................... SKIPPED
[INFO] ------------------------------------------------------------------------
[INFO] BUILD FAILURE
[INFO] ------------------------------------------------------------------------
[INFO] Total time: 04:40 min
[INFO] Finished at: 2019-01-18T03:04:09+00:00
[INFO] Final Memory: 247M/4592M
[INFO] ------------------------------------------------------------------------
[ERROR] Failed to execute goal org.apache.maven.plugins:maven-surefire-plugin:2.18.1:test
(default-test) on project artemis-cli: There are test failures.
[ERROR] 
[ERROR] Please refer to <https://builds.apache.org/job/ActiveMQ-Artemis-Master/ws/artemis-cli/target/surefire-reports>
for the individual test results.
[ERROR] -> [Help 1]
[ERROR] 
[ERROR] To see the full stack trace of the errors, re-run Maven with the -e switch.
[ERROR] Re-run Maven using the -X switch to enable full debug logging.
[ERROR] 
[ERROR] For more information about the errors and possible solutions, please read the following
articles:
[ERROR] [Help 1] http://cwiki.apache.org/confluence/display/MAVEN/MojoFailureException
[ERROR] 
[ERROR] After correcting the problems, you can resume the build with the command
[ERROR]   mvn <goals> -rf :artemis-cli
Build step 'Invoke top-level Maven targets' marked build as failure
Performing Post build task...
Could not match :Too many files with unapproved license  : False
Logical operation result is FALSE
Skipping script  : cat ratReport.txt
END OF POST BUILD TASK 	: 0
Recording test results
Not sending mail to unregistered user tabish121@gmail.com
Not sending mail to unregistered user sebthom@users.noreply.github.com
Not sending mail to unregistered user wy96fyw@gmail.com
Not sending mail to unregistered user sato.tadayoshi@gmail.com
Not sending mail to unregistered user mtaylor@redhat.com
Not sending mail to unregistered user emmanuel.hugonnet+gitkraken@gmail.com
Not sending mail to unregistered user howard.gao@gmail.com
Not sending mail to unregistered user michael.andre.pearce@me.com
Not sending mail to unregistered user nigro.fra@gmail.com

Mime
View raw message