activemq-commits mailing list archives

Site index · List index
Message view « Date » · « Thread »
Top « Date » · « Thread »
From Apache Jenkins Server <jenk...@builds.apache.org>
Subject Build failed in Jenkins: ActiveMQ-Artemis-Master #2229
Date Thu, 17 Jan 2019 15:51:14 GMT
See <https://builds.apache.org/job/ActiveMQ-Artemis-Master/2229/display/redirect?page=changes>

Changes:

[clebertsuconic] ARTEMIS-2212 Avoid using CLQ on ServerConsumerImpl

[clebertsuconic] ARTEMIS-2210 PagingStore creation is not properly synchronized

[clebertsuconic] [ARTEMIS-1536]: Incorrect Journal filesize calculation where specified

------------------------------------------
[...truncated 911.90 KB...]
[WARNING] <https://builds.apache.org/job/ActiveMQ-Artemis-Master/ws/artemis-core-client/src/main/java/org/apache/activemq/artemis/api/core/ICoreMessage.java>:81:
warning - @return tag has no arguments.
[WARNING] <https://builds.apache.org/job/ActiveMQ-Artemis-Master/ws/artemis-core-client/src/main/java/org/apache/activemq/artemis/api/core/Message.java>:381:
warning - @return tag has no arguments.
[WARNING] <https://builds.apache.org/job/ActiveMQ-Artemis-Master/ws/artemis-core-client/src/main/java/org/apache/activemq/artemis/api/core/Message.java>:398:
warning - @return tag has no arguments.
[WARNING] <https://builds.apache.org/job/ActiveMQ-Artemis-Master/ws/artemis-core-client/src/main/java/org/apache/activemq/artemis/api/core/Message.java>:475:
warning - @return tag has no arguments.
[WARNING] <https://builds.apache.org/job/ActiveMQ-Artemis-Master/ws/artemis-core-client/src/main/java/org/apache/activemq/artemis/api/core/Message.java>:711:
warning - @return tag has no arguments.
[WARNING] <https://builds.apache.org/job/ActiveMQ-Artemis-Master/ws/artemis-core-client/src/main/java/org/apache/activemq/artemis/api/core/client/ClientConsumer.java>:42:
warning - @return tag has no arguments.
[WARNING] <https://builds.apache.org/job/ActiveMQ-Artemis-Master/ws/artemis-core-client/src/main/java/org/apache/activemq/artemis/api/core/client/ClientMessage.java>:131:
warning - @return tag has no arguments.
[WARNING] <https://builds.apache.org/job/ActiveMQ-Artemis-Master/ws/artemis-core-client/src/main/java/org/apache/activemq/artemis/api/core/client/ClientMessage.java>:138:
warning - @return tag has no arguments.
[WARNING] <https://builds.apache.org/job/ActiveMQ-Artemis-Master/ws/artemis-core-client/src/main/java/org/apache/activemq/artemis/api/core/client/ClientSession.java>:1115:
warning - @return tag has no arguments.
[WARNING] <https://builds.apache.org/job/ActiveMQ-Artemis-Master/ws/artemis-core-client/src/main/java/org/apache/activemq/artemis/api/core/client/ClientSession.java>:138:
warning - @return tag has no arguments.
[WARNING] <https://builds.apache.org/job/ActiveMQ-Artemis-Master/ws/artemis-core-client/src/main/java/org/apache/activemq/artemis/api/core/client/ClientSessionFactory.java>:187:
warning - @return tag has no arguments.
[WARNING] <https://builds.apache.org/job/ActiveMQ-Artemis-Master/ws/artemis-core-client/src/main/java/org/apache/activemq/artemis/api/core/client/ServerLocator.java>:738:
warning - @return tag has no arguments.
[WARNING] <https://builds.apache.org/job/ActiveMQ-Artemis-Master/ws/artemis-core-client/src/main/java/org/apache/activemq/artemis/api/core/client/ServerLocator.java>:769:
warning - @return tag has no arguments.
[WARNING] <https://builds.apache.org/job/ActiveMQ-Artemis-Master/ws/artemis-core-client/src/main/java/org/apache/activemq/artemis/api/core/client/TopologyMember.java>:85:
warning - @return tag has no arguments.
[WARNING] <https://builds.apache.org/job/ActiveMQ-Artemis-Master/ws/artemis-core-client/src/main/java/org/apache/activemq/artemis/api/core/client/TopologyMember.java>:93:
warning - @return tag has no arguments.
[WARNING] <https://builds.apache.org/job/ActiveMQ-Artemis-Master/ws/artemis-core-client/src/main/java/org/apache/activemq/artemis/api/core/management/ActiveMQServerControl.java>:686:
warning - @return tag has no arguments.
[WARNING] <https://builds.apache.org/job/ActiveMQ-Artemis-Master/ws/artemis-core-client/src/main/java/org/apache/activemq/artemis/api/core/management/ActiveMQServerControl.java>:709:
warning - @return tag has no arguments.
[WARNING] <https://builds.apache.org/job/ActiveMQ-Artemis-Master/ws/artemis-core-client/src/main/java/org/apache/activemq/artemis/api/core/management/ClusterConnectionControl.java>:134:
warning - @return tag has no arguments.
[WARNING] <https://builds.apache.org/job/ActiveMQ-Artemis-Master/ws/artemis-core-client/src/main/java/org/apache/activemq/artemis/api/core/management/QueueControl.java>:274:
warning - @return tag has no arguments.
[WARNING] <https://builds.apache.org/job/ActiveMQ-Artemis-Master/ws/artemis-core-client/src/main/java/org/apache/activemq/artemis/api/config/ActiveMQDefaultConfiguration.java>:842:
warning - @return tag has no arguments.
[WARNING] <https://builds.apache.org/job/ActiveMQ-Artemis-Master/ws/artemis-jms-client/src/main/java/org/apache/activemq/artemis/jndi/ReadOnlyContext.java>:150:
warning - @return tag has no arguments.
[WARNING] <https://builds.apache.org/job/ActiveMQ-Artemis-Master/ws/artemis-jms-client/src/main/java/org/apache/activemq/artemis/jms/client/ActiveMQConnection.java>:672:
warning - @return tag has no arguments.
[WARNING] <https://builds.apache.org/job/ActiveMQ-Artemis-Master/ws/artemis-jms-client/src/main/java/org/apache/activemq/artemis/jms/client/ActiveMQConnection.java>:88:
warning - Tag @link: reference not found: ClientSession.AddressQuery#JMS_SESSION_IDENTIFIER_PROPERTY
[WARNING] <https://builds.apache.org/job/ActiveMQ-Artemis-Master/ws/artemis-jms-client/src/main/java/org/apache/activemq/artemis/jms/client/ActiveMQConnection.java>:88:
warning - Tag @link: reference not found: ClientSession.AddressQuery#JMS_SESSION_IDENTIFIER_PROPERTY
[WARNING] <https://builds.apache.org/job/ActiveMQ-Artemis-Master/ws/artemis-jms-client/src/main/java/org/apache/activemq/artemis/jms/client/ActiveMQJMSContext.java>:569:
warning - @return tag has no arguments.
[WARNING] <https://builds.apache.org/job/ActiveMQ-Artemis-Master/ws/artemis-jms-client/src/main/java/org/apache/activemq/artemis/jms/client/ActiveMQSession.java>:578:
warning - @return tag has no arguments.
[WARNING] <https://builds.apache.org/job/ActiveMQ-Artemis-Master/ws/artemis-jms-client/src/main/java/org/apache/activemq/artemis/jms/client/JmsExceptionUtils.java>:57:
warning - @return tag has no arguments.
[WARNING] <https://builds.apache.org/job/ActiveMQ-Artemis-Master/ws/artemis-jms-server/src/main/java/org/apache/activemq/artemis/jms/server/JMSServerManager.java>:118:
warning - @return tag has no arguments.
[WARNING] <https://builds.apache.org/job/ActiveMQ-Artemis-Master/ws/artemis-jms-server/src/main/java/org/apache/activemq/artemis/jms/server/JMSServerManager.java>:129:
warning - @return tag has no arguments.
[WARNING] <https://builds.apache.org/job/ActiveMQ-Artemis-Master/ws/artemis-jms-server/src/main/java/org/apache/activemq/artemis/jms/server/impl/JMSServerManagerImpl.java>:1151:
warning - @return tag has no arguments.
[WARNING] <https://builds.apache.org/job/ActiveMQ-Artemis-Master/ws/artemis-jms-server/src/main/java/org/apache/activemq/artemis/jms/server/config/impl/FileJMSConfiguration.java>:167:
warning - @return tag has no arguments.
[WARNING] <https://builds.apache.org/job/ActiveMQ-Artemis-Master/ws/artemis-jms-server/src/main/java/org/apache/activemq/artemis/jms/server/config/impl/FileJMSConfiguration.java>:177:
warning - @return tag has no arguments.
[WARNING] <https://builds.apache.org/job/ActiveMQ-Artemis-Master/ws/artemis-selector/src/main/java/org/apache/activemq/artemis/selector/filter/ArithmeticExpression.java>:212:
warning - @return tag has no arguments.
[WARNING] <https://builds.apache.org/job/ActiveMQ-Artemis-Master/ws/artemis-selector/src/main/java/org/apache/activemq/artemis/selector/filter/BinaryExpression.java>:97:
warning - @return tag has no arguments.
[WARNING] <https://builds.apache.org/job/ActiveMQ-Artemis-Master/ws/artemis-selector/src/main/java/org/apache/activemq/artemis/selector/filter/ConstantExpression.java>:155:
warning - @return tag has no arguments.
[WARNING] <https://builds.apache.org/job/ActiveMQ-Artemis-Master/ws/artemis-selector/src/main/java/org/apache/activemq/artemis/selector/filter/Filterable.java>:38:
warning - @return tag has no arguments.
[WARNING] <https://builds.apache.org/job/ActiveMQ-Artemis-Master/ws/artemis-selector/src/main/java/org/apache/activemq/artemis/selector/filter/Filterable.java>:46:
warning - @return tag has no arguments.
[WARNING] <https://builds.apache.org/job/ActiveMQ-Artemis-Master/ws/artemis-selector/src/main/java/org/apache/activemq/artemis/selector/filter/UnaryExpression.java>:271:
warning - @return tag has no arguments.
[WARNING] <https://builds.apache.org/job/ActiveMQ-Artemis-Master/ws/artemis-jms-client/src/main/java/org/apache/activemq/artemis/jms/client/ActiveMQConnection.java>:88:
warning - Tag @link: reference not found: ClientSession.AddressQuery#JMS_SESSION_IDENTIFIER_PROPERTY
[INFO] Building jar: <https://builds.apache.org/job/ActiveMQ-Artemis-Master/ws/artemis-website/target/artemis-website-2.7.0-SNAPSHOT-javadoc.jar>
[INFO] 
[INFO] --- maven-source-plugin:2.2.1:jar-no-fork (attach-sources) @ artemis-website ---
[INFO] Building jar: <https://builds.apache.org/job/ActiveMQ-Artemis-Master/ws/artemis-website/target/artemis-website-2.7.0-SNAPSHOT-sources.jar>
[INFO] 
[INFO] --- dependency-check-maven:1.4.3:check (default) @ artemis-website ---
[INFO] Skipping dependency-check
[INFO] 
[INFO] --- maven-install-plugin:2.4:install (default-install) @ artemis-website ---
[INFO] Installing <https://builds.apache.org/job/ActiveMQ-Artemis-Master/ws/artemis-website/target/artemis-website-2.7.0-SNAPSHOT.jar>
to /home/jenkins/.m2/repository/org/apache/activemq/artemis-website/2.7.0-SNAPSHOT/artemis-website-2.7.0-SNAPSHOT.jar
[INFO] Installing <https://builds.apache.org/job/ActiveMQ-Artemis-Master/ws/artemis-website/pom.xml>
to /home/jenkins/.m2/repository/org/apache/activemq/artemis-website/2.7.0-SNAPSHOT/artemis-website-2.7.0-SNAPSHOT.pom
[INFO] Installing <https://builds.apache.org/job/ActiveMQ-Artemis-Master/ws/artemis-website/target/artemis-website-2.7.0-SNAPSHOT-javadoc.jar>
to /home/jenkins/.m2/repository/org/apache/activemq/artemis-website/2.7.0-SNAPSHOT/artemis-website-2.7.0-SNAPSHOT-javadoc.jar
[INFO] Installing <https://builds.apache.org/job/ActiveMQ-Artemis-Master/ws/artemis-website/target/artemis-website-2.7.0-SNAPSHOT-sources.jar>
to /home/jenkins/.m2/repository/org/apache/activemq/artemis-website/2.7.0-SNAPSHOT/artemis-website-2.7.0-SNAPSHOT-sources.jar
[INFO]                                                                         
[INFO] ------------------------------------------------------------------------
[INFO] Building ActiveMQ Artemis Core Client All 2.7.0-SNAPSHOT
[INFO] ------------------------------------------------------------------------
[INFO] 
[INFO] --- maven-enforcer-plugin:1.4:enforce (enforce-maven) @ artemis-core-client-all ---
[INFO] 
[INFO] --- maven-enforcer-plugin:1.4:enforce (enforce-java) @ artemis-core-client-all ---
[INFO] 
[INFO] --- maven-remote-resources-plugin:1.5:process (process-resource-bundles) @ artemis-core-client-all
---
[INFO] 
[INFO] --- maven-resources-plugin:2.6:resources (default-resources) @ artemis-core-client-all
---
[INFO] Using 'UTF-8' encoding to copy filtered resources.
[INFO] skip non existing resourceDirectory <https://builds.apache.org/job/ActiveMQ-Artemis-Master/ws/artemis-core-client-all/src/main/resources>
[INFO] Copying 3 resources
[INFO] 
[INFO] --- maven-compiler-plugin:3.1:compile (default-compile) @ artemis-core-client-all ---
[INFO] No sources to compile
[INFO] 
[INFO] --- maven-checkstyle-plugin:2.17:check (default) @ artemis-core-client-all ---
[INFO] Starting audit...
Audit done.
[INFO] 
[INFO] --- apache-rat-plugin:0.12:check (default) @ artemis-core-client-all ---
[INFO] Enabled default license matchers.
[INFO] Will parse SCM ignores for exclusions...
[INFO] Finished adding exclusions from SCM ignore files.
[INFO] 61 implicit excludes (use -debug for more details).
[INFO] Exclude: .travis.yml
[INFO] Exclude: **/footer.html
[INFO] Exclude: **/*.txt
[INFO] Exclude: **/*.md
[INFO] Exclude: etc/ide-settings/**
[INFO] Exclude: docs/**/*.json
[INFO] Exclude: docs/**/_book/
[INFO] Exclude: **/target/
[INFO] Exclude: **/META-INF/services/*
[INFO] Exclude: **/META-INF/MANIFEST.MF
[INFO] Exclude: **/*.iml
[INFO] Exclude: **/*.jceks
[INFO] Exclude: **/*.jks
[INFO] Exclude: **/xml.xsd
[INFO] Exclude: **/org/apache/activemq/artemis/utils/json/**
[INFO] Exclude: **/org/apache/activemq/artemis/utils/Base64.java
[INFO] Exclude: **/.settings/**
[INFO] Exclude: **/.project
[INFO] Exclude: **/.classpath
[INFO] Exclude: **/.editorconfig
[INFO] Exclude: **/.checkstyle
[INFO] Exclude: **/.factorypath
[INFO] Exclude: **/org.apache.activemq.artemis.cfg
[INFO] Exclude: **/nb-configuration.xml
[INFO] Exclude: **/*.data
[INFO] Exclude: **/*.bin
[INFO] Exclude: **/src/test/resources/keystore
[INFO] Exclude: **/*.log
[INFO] Exclude: **/*.redo
[INFO] Exclude: **/node/**
[INFO] Exclude: **/node_modules/**
[INFO] Exclude: **/package.json
[INFO] Exclude: **/npm-shrinkwrap.json
[INFO] Exclude: **/overlays/**
[INFO] Exclude: **/CMakeFiles/
[INFO] Exclude: **/Makefile
[INFO] Exclude: **/cmake_install.cmake
[INFO] Exclude: artemis-native/src/main/c/org_apache_activemq_artemis_jlibaio_LibaioContext.h
[INFO] Exclude: **/dependency-reduced-pom.xml
[INFO] 1 resources included (use -debug for more details)
[INFO] Rat check: Summary over all files. Unapproved: 0, unknown: 0, generated: 0, approved:
1 licenses.
[INFO] 
[INFO] --- maven-resources-plugin:2.6:testResources (default-testResources) @ artemis-core-client-all
---
[INFO] Using 'UTF-8' encoding to copy filtered resources.
[INFO] skip non existing resourceDirectory <https://builds.apache.org/job/ActiveMQ-Artemis-Master/ws/artemis-core-client-all/src/test/resources>
[INFO] Copying 3 resources
[INFO] 
[INFO] --- maven-compiler-plugin:3.1:testCompile (default-testCompile) @ artemis-core-client-all
---
[INFO] No sources to compile
[INFO] 
[INFO] --- maven-surefire-plugin:2.18.1:test (default-test) @ artemis-core-client-all ---
[INFO] 
[INFO] --- maven-jar-plugin:2.4:jar (default-jar) @ artemis-core-client-all ---
[INFO] Building jar: <https://builds.apache.org/job/ActiveMQ-Artemis-Master/ws/artemis-core-client-all/target/artemis-core-client-all-2.7.0-SNAPSHOT.jar>
[INFO] 
[INFO] --- maven-site-plugin:3.3:attach-descriptor (attach-descriptor) @ artemis-core-client-all
---
[INFO] 
[INFO] --- maven-shade-plugin:3.0.0:shade (default) @ artemis-core-client-all ---
[INFO] Including org.apache.activemq:artemis-core-client:jar:2.7.0-SNAPSHOT in the shaded
jar.
[INFO] Including org.jgroups:jgroups:jar:3.6.13.Final in the shaded jar.
[INFO] Including org.apache.activemq:artemis-commons:jar:2.7.0-SNAPSHOT in the shaded jar.
[INFO] Including org.jboss.logging:jboss-logging:jar:3.3.1.Final in the shaded jar.
[INFO] Including commons-beanutils:commons-beanutils:jar:1.9.3 in the shaded jar.
[INFO] Including commons-logging:commons-logging:jar:1.2 in the shaded jar.
[INFO] Including commons-collections:commons-collections:jar:3.2.2 in the shaded jar.
[INFO] Including org.apache.geronimo.specs:geronimo-json_1.0_spec:jar:1.0-alpha-1 in the shaded
jar.
[INFO] Including org.apache.johnzon:johnzon-core:jar:0.9.5 in the shaded jar.
[INFO] Including io.netty:netty-transport-native-epoll:jar:linux-x86_64:4.1.28.Final in the
shaded jar.
[INFO] Including io.netty:netty-transport-native-unix-common:jar:4.1.28.Final in the shaded
jar.
[INFO] Including io.netty:netty-transport-native-kqueue:jar:osx-x86_64:4.1.28.Final in the
shaded jar.
[INFO] Including io.netty:netty-codec-http:jar:4.1.28.Final in the shaded jar.
[INFO] Including io.netty:netty-buffer:jar:4.1.28.Final in the shaded jar.
[INFO] Including io.netty:netty-transport:jar:4.1.28.Final in the shaded jar.
[INFO] Including io.netty:netty-resolver:jar:4.1.28.Final in the shaded jar.
[INFO] Including io.netty:netty-handler:jar:4.1.28.Final in the shaded jar.
[INFO] Including io.netty:netty-codec:jar:4.1.28.Final in the shaded jar.
[INFO] Including io.netty:netty-common:jar:4.1.28.Final in the shaded jar.
[WARNING] Could not get sources for org.apache.activemq:artemis-core-client-all:jar:2.7.0-SNAPSHOT
[INFO] ------------------------------------------------------------------------
[INFO] Reactor Summary:
[INFO] 
[INFO] ActiveMQ Artemis Parent ............................ SUCCESS [  5.684 s]
[INFO] ActiveMQ Artemis Commons ........................... SUCCESS [ 27.423 s]
[INFO] ActiveMQ Artemis Core Client ....................... SUCCESS [ 16.101 s]
[INFO] ActiveMQ Artemis Selector Implementation ........... SUCCESS [  5.748 s]
[INFO] ActiveMQ Artemis JMS Client ........................ SUCCESS [  5.926 s]
[INFO] ActiveMQ Artemis Native POM ........................ SUCCESS [  6.692 s]
[INFO] ActiveMQ Artemis Journal ........................... SUCCESS [  4.373 s]
[INFO] ActiveMQ Artemis JDBC Store ........................ SUCCESS [ 26.670 s]
[INFO] ActiveMQ Artemis Server ............................ SUCCESS [06:05 min]
[INFO] ActiveMQ Artemis Protocols ......................... SUCCESS [  0.180 s]
[INFO] ActiveMQ Artemis AMQP Protocol ..................... SUCCESS [ 11.649 s]
[INFO] ActiveMQ Artemis STOMP Protocol .................... SUCCESS [  2.677 s]
[INFO] ActiveMQ Artemis OpenWire Protocol ................. SUCCESS [  2.919 s]
[INFO] ActiveMQ Artemis HQClient Protocol ................. SUCCESS [  1.019 s]
[INFO] ActiveMQ Artemis HornetQ Protocol .................. SUCCESS [  1.341 s]
[INFO] ActiveMQ Artemis MQTT Protocol ..................... SUCCESS [  2.210 s]
[INFO] ActiveMQ Artemis DTO ............................... SUCCESS [  3.004 s]
[INFO] ActiveMQ Artemis Service Extensions ................ SUCCESS [  2.511 s]
[INFO] ActiveMQ Artemis JMS Server ........................ SUCCESS [  2.316 s]
[INFO] ActiveMQ Artemis CDI Integration ................... SUCCESS [  6.355 s]
[INFO] ActiveMQ Artemis Boot .............................. SUCCESS [  0.329 s]
[INFO] ActiveMQ Artemis Tools ............................. SUCCESS [  0.936 s]
[INFO] ActiveMQ Artemis JUnit Rules ....................... SUCCESS [  9.126 s]
[INFO] ActiveMQ Artemis CLI ............................... SUCCESS [01:30 min]
[INFO] ActiveMQ Artemis Web ............................... SUCCESS [ 10.660 s]
[INFO] ActiveMQ Artemis Web ............................... SUCCESS [01:22 min]
[INFO] ActiveMQ Artemis Core Client All ................... FAILURE [  0.767 s]
[INFO] ActiveMQ Artemis Client OSGi ....................... SKIPPED
[INFO] ActiveMQ Artemis JMS Client All .................... SKIPPED
[INFO] ActiveMQ Artemis JMS Client OSGi ................... SKIPPED
[INFO] ActiveMQ Artemis RAR POM ........................... SKIPPED
[INFO] ActiveMQ Artemis REST Interface Implementation ..... SKIPPED
[INFO] ActiveMQ Artemis Maven Plugin ...................... SKIPPED
[INFO] ActiveMQ Artemis Server OSGi ....................... SKIPPED
[INFO] ActiveMQ Artemis Cons .............................. SKIPPED
[INFO] ActiveMQ Artemis HawtIO Branding ................... SKIPPED
[INFO] ActiveMQ Artemis HawtIO Plugin ..................... SKIPPED
[INFO] ActiveMQ Artemis Console ........................... SKIPPED
[INFO] ActiveMQ Artemis Spring Integration ................ SKIPPED
[INFO] Apache ActiveMQ Artemis Distribution ............... SKIPPED
[INFO] ActiveMQ Artemis Tests POM ......................... SKIPPED
[INFO] ActiveMQ Artemis Test Support ...................... SKIPPED
[INFO] ActiveMQ Artemis Unit Tests ........................ SKIPPED
[INFO] ActiveMQ Artemis Joram Tests ....................... SKIPPED
[INFO] ActiveMQ Artemis timing Tests ...................... SKIPPED
[INFO] ActiveMQ Artemis JMS Tests ......................... SKIPPED
[INFO] ActiveMQ Artemis Features .......................... SKIPPED
[INFO] ActiveMQ Artemis Integration Tests ................. SKIPPED
[INFO] ActiveMQ Artemis Client Integration Tests .......... SKIPPED
[INFO] ActiveMQ Artemis Compatibility Tests ............... SKIPPED
[INFO] ActiveMQ Artemis soak Tests ........................ SKIPPED
[INFO] ActiveMQ Artemis stress Tests ...................... SKIPPED
[INFO] ActiveMQ Artemis performance Tests ................. SKIPPED
[INFO] Smoke Tests ........................................ SKIPPED
[INFO] ActiveMQ Artemis Extra Tests ....................... SKIPPED
[INFO] ------------------------------------------------------------------------
[INFO] BUILD FAILURE
[INFO] ------------------------------------------------------------------------
[INFO] Total time: 11:38 min
[INFO] Finished at: 2019-01-17T15:51:07+00:00
[INFO] Final Memory: 249M/4789M
[INFO] ------------------------------------------------------------------------
[ERROR] Failed to execute goal org.apache.maven.plugins:maven-shade-plugin:3.0.0:shade (default)
on project artemis-core-client-all: Error creating shaded jar: null: NullPointerException
-> [Help 1]
[ERROR] 
[ERROR] To see the full stack trace of the errors, re-run Maven with the -e switch.
[ERROR] Re-run Maven using the -X switch to enable full debug logging.
[ERROR] 
[ERROR] For more information about the errors and possible solutions, please read the following
articles:
[ERROR] [Help 1] http://cwiki.apache.org/confluence/display/MAVEN/MojoExecutionException
[ERROR] 
[ERROR] After correcting the problems, you can resume the build with the command
[ERROR]   mvn <goals> -rf :artemis-core-client-all
Build step 'Invoke top-level Maven targets' marked build as failure
Performing Post build task...
Could not match :Too many files with unapproved license  : False
Logical operation result is FALSE
Skipping script  : cat ratReport.txt
END OF POST BUILD TASK 	: 0
Recording test results
Not sending mail to unregistered user tabish121@gmail.com
Not sending mail to unregistered user sebthom@users.noreply.github.com
Not sending mail to unregistered user wy96fyw@gmail.com
Not sending mail to unregistered user sato.tadayoshi@gmail.com
Not sending mail to unregistered user mtaylor@redhat.com
Not sending mail to unregistered user emmanuel.hugonnet+gitkraken@gmail.com
Not sending mail to unregistered user howard.gao@gmail.com
Not sending mail to unregistered user michael.andre.pearce@me.com
Not sending mail to unregistered user nigro.fra@gmail.com

Mime
View raw message