activemq-commits mailing list archives

Site index · List index
Message view « Date » · « Thread »
Top « Date » · « Thread »
From Apache Jenkins Server <jenk...@builds.apache.org>
Subject Build failed in Jenkins: ActiveMQ-Artemis-Master #2484
Date Wed, 21 Aug 2019 16:31:27 GMT
See <https://builds.apache.org/job/ActiveMQ-Artemis-Master/2484/display/redirect?page=changes>

Changes:

[clebertsuconic] ARTEMIS-2458 Fix AMQP Transaction Rollback Ordering by using a sorted

[clebertsuconic] ARTEMIS-2458 Fix AMQP Transaction Session Close Ordering

------------------------------------------
[...truncated 349.29 KB...]
Thread Thread[Timer-22,5,main] is still alive with the following stackTrace:
java.lang.Object.wait(Native Method)
java.lang.Object.wait(Object.java:502)
java.util.TimerThread.mainLoop(Timer.java:526)
java.util.TimerThread.run(Timer.java:505)
*********************************************************************************
Tests run: 5, Failures: 1, Errors: 4, Skipped: 0, Time elapsed: 70.151 sec <<< FAILURE!
- in org.apache.activemq.artemis.core.server.impl.jdbc.JdbcSharedStateManagerTest
shouldStartTwoIfTableNotExist(org.apache.activemq.artemis.core.server.impl.jdbc.JdbcSharedStateManagerTest)
 Time elapsed: 10.075 sec  <<< ERROR!
java.lang.Exception: test timed out after 10000 milliseconds
	at java.io.RandomAccessFile.writeBytes(Native Method)
	at java.io.RandomAccessFile.write(RandomAccessFile.java:525)
	at org.apache.derby.impl.store.raw.log.LogAccessFile.writeToLog(Unknown Source)
	at org.apache.derby.impl.store.raw.log.LogAccessFile.flushDirtyBuffers(Unknown Source)
	at org.apache.derby.impl.store.raw.log.LogToFile.flush(Unknown Source)
	at org.apache.derby.impl.store.raw.log.LogToFile.flush(Unknown Source)
	at org.apache.derby.impl.store.raw.data.BaseDataFileFactory.flush(Unknown Source)
	at org.apache.derby.impl.store.raw.data.BaseDataFileFactory.addContainer(Unknown Source)
	at org.apache.derby.impl.store.raw.xact.Xact.addContainer(Unknown Source)
	at org.apache.derby.impl.store.access.btree.BTree.create(Unknown Source)
	at org.apache.derby.impl.store.access.btree.index.B2I.create(Unknown Source)
	at org.apache.derby.impl.store.access.btree.index.B2IFactory.createConglomerate(Unknown Source)
	at org.apache.derby.impl.store.access.RAMTransaction.createConglomerate(Unknown Source)
	at org.apache.derby.impl.sql.catalog.DataDictionaryImpl.bootstrapOneIndex(Unknown Source)
	at org.apache.derby.impl.sql.catalog.DataDictionaryImpl.bootStrapSystemIndexes(Unknown Source)
	at org.apache.derby.impl.sql.catalog.DataDictionaryImpl.makeCatalog(Unknown Source)
	at org.apache.derby.impl.sql.catalog.DataDictionaryImpl.createDictionaryTables(Unknown Source)
	at org.apache.derby.impl.sql.catalog.DataDictionaryImpl.boot(Unknown Source)
	at org.apache.derby.impl.services.monitor.BaseMonitor.boot(Unknown Source)
	at org.apache.derby.impl.services.monitor.TopService.bootModule(Unknown Source)
	at org.apache.derby.impl.services.monitor.BaseMonitor.startModule(Unknown Source)
	at org.apache.derby.impl.services.monitor.FileMonitor.startModule(Unknown Source)
	at org.apache.derby.iapi.services.monitor.Monitor.bootServiceModule(Unknown Source)
	at org.apache.derby.impl.db.BasicDatabase.boot(Unknown Source)
	at org.apache.derby.impl.services.monitor.BaseMonitor.boot(Unknown Source)
	at org.apache.derby.impl.services.monitor.TopService.bootModule(Unknown Source)
	at org.apache.derby.impl.services.monitor.BaseMonitor.bootService(Unknown Source)
	at org.apache.derby.impl.services.monitor.BaseMonitor.createPersistentService(Unknown Source)
	at org.apache.derby.impl.services.monitor.FileMonitor.createPersistentService(Unknown Source)
	at org.apache.derby.iapi.services.monitor.Monitor.createPersistentService(Unknown Source)
	at org.apache.derby.impl.jdbc.EmbedConnection.createDatabase(Unknown Source)
	at org.apache.derby.impl.jdbc.EmbedConnection.<init>(Unknown Source)
	at org.apache.derby.jdbc.InternalDriver.getNewEmbedConnection(Unknown Source)
	at org.apache.derby.jdbc.InternalDriver.connect(Unknown Source)
	at org.apache.derby.jdbc.InternalDriver.connect(Unknown Source)
	at org.apache.derby.jdbc.EmbeddedDriver.connect(Unknown Source)
	at org.apache.activemq.artemis.jdbc.store.drivers.AbstractJDBCDriver.connect(AbstractJDBCDriver.java:154)
	at org.apache.activemq.artemis.jdbc.store.drivers.AbstractJDBCDriver.start(AbstractJDBCDriver.java:86)
	at org.apache.activemq.artemis.core.server.impl.jdbc.JdbcSharedStateManager.usingConnectionUrl(JdbcSharedStateManager.java:96)
	at org.apache.activemq.artemis.core.server.impl.jdbc.JdbcSharedStateManager.usingConnectionUrl(JdbcSharedStateManager.java:74)
	at org.apache.activemq.artemis.core.server.impl.jdbc.JdbcSharedStateManagerTest.createSharedStateManager(JdbcSharedStateManagerTest.java:52)
	at org.apache.activemq.artemis.core.server.impl.jdbc.JdbcSharedStateManagerTest.shouldStartTwoIfTableNotExist(JdbcSharedStateManagerTest.java:98)

shouldStartIfTableNotExist(org.apache.activemq.artemis.core.server.impl.jdbc.JdbcSharedStateManagerTest)
 Time elapsed: 0.007 sec  <<< ERROR!
java.lang.IllegalStateException: java.sql.SQLException: Failed to create database '<https://builds.apache.org/job/ActiveMQ-Artemis-Master/ws/artemis-server/./target/tmp/junit6776841102469447604/derby',>
see the next exception for details.
	at org.apache.derby.iapi.error.StandardException.newException(Unknown Source)
	at org.apache.derby.iapi.error.StandardException.newException(Unknown Source)
	at org.apache.derby.impl.services.monitor.BaseMonitor.bootService(Unknown Source)
	at org.apache.derby.impl.services.monitor.BaseMonitor.createPersistentService(Unknown Source)
	at org.apache.derby.impl.services.monitor.FileMonitor.createPersistentService(Unknown Source)
	at org.apache.derby.iapi.services.monitor.Monitor.createPersistentService(Unknown Source)
	at org.apache.derby.impl.jdbc.EmbedConnection.createDatabase(Unknown Source)
	at org.apache.derby.impl.jdbc.EmbedConnection.<init>(Unknown Source)
	at org.apache.derby.jdbc.InternalDriver.getNewEmbedConnection(Unknown Source)
	at org.apache.derby.jdbc.InternalDriver.connect(Unknown Source)
	at org.apache.derby.jdbc.InternalDriver.connect(Unknown Source)
	at org.apache.derby.jdbc.EmbeddedDriver.connect(Unknown Source)
	at org.apache.activemq.artemis.jdbc.store.drivers.AbstractJDBCDriver.connect(AbstractJDBCDriver.java:154)
	at org.apache.activemq.artemis.jdbc.store.drivers.AbstractJDBCDriver.start(AbstractJDBCDriver.java:86)
	at org.apache.activemq.artemis.core.server.impl.jdbc.JdbcSharedStateManager.usingConnectionUrl(JdbcSharedStateManager.java:96)
	at org.apache.activemq.artemis.core.server.impl.jdbc.JdbcSharedStateManager.usingConnectionUrl(JdbcSharedStateManager.java:74)
	at org.apache.activemq.artemis.core.server.impl.jdbc.JdbcSharedStateManagerTest.createSharedStateManager(JdbcSharedStateManagerTest.java:52)
	at org.apache.activemq.artemis.core.server.impl.jdbc.JdbcSharedStateManagerTest.shouldStartIfTableNotExist(JdbcSharedStateManagerTest.java:62)

shouldStartIfTableExistInitialized(org.apache.activemq.artemis.core.server.impl.jdbc.JdbcSharedStateManagerTest)
 Time elapsed: 0.006 sec  <<< ERROR!
java.sql.SQLException: Failed to create database '<https://builds.apache.org/job/ActiveMQ-Artemis-Master/ws/artemis-server/./target/tmp/junit8848407270217205955/derby',>
see the next exception for details.
	at org.apache.derby.iapi.error.StandardException.newException(Unknown Source)
	at org.apache.derby.iapi.error.StandardException.newException(Unknown Source)
	at org.apache.derby.impl.services.monitor.BaseMonitor.bootService(Unknown Source)
	at org.apache.derby.impl.services.monitor.BaseMonitor.createPersistentService(Unknown Source)
	at org.apache.derby.impl.services.monitor.FileMonitor.createPersistentService(Unknown Source)
	at org.apache.derby.iapi.services.monitor.Monitor.createPersistentService(Unknown Source)
	at org.apache.derby.impl.jdbc.EmbedConnection.createDatabase(Unknown Source)
	at org.apache.derby.impl.jdbc.EmbedConnection.<init>(Unknown Source)
	at org.apache.derby.jdbc.InternalDriver.getNewEmbedConnection(Unknown Source)
	at org.apache.derby.jdbc.InternalDriver.connect(Unknown Source)
	at org.apache.derby.jdbc.InternalDriver.connect(Unknown Source)
	at org.apache.derby.jdbc.EmbeddedDriver.connect(Unknown Source)
	at org.apache.activemq.artemis.jdbc.store.drivers.AbstractJDBCDriver.connect(AbstractJDBCDriver.java:154)
	at org.apache.activemq.artemis.jdbc.store.drivers.AbstractJDBCDriver.start(AbstractJDBCDriver.java:86)
	at org.apache.activemq.artemis.core.server.impl.jdbc.JdbcSharedStateManagerTest.shouldStartIfTableExistInitialized(JdbcSharedStateManagerTest.java:86)

shouldStartIfTableExistEmpty(org.apache.activemq.artemis.core.server.impl.jdbc.JdbcSharedStateManagerTest)
 Time elapsed: 0.004 sec  <<< ERROR!
java.sql.SQLException: Failed to create database '<https://builds.apache.org/job/ActiveMQ-Artemis-Master/ws/artemis-server/./target/tmp/junit6833730812911150957/derby',>
see the next exception for details.
	at org.apache.derby.iapi.error.StandardException.newException(Unknown Source)
	at org.apache.derby.iapi.error.StandardException.newException(Unknown Source)
	at org.apache.derby.impl.services.monitor.BaseMonitor.bootService(Unknown Source)
	at org.apache.derby.impl.services.monitor.BaseMonitor.createPersistentService(Unknown Source)
	at org.apache.derby.impl.services.monitor.FileMonitor.createPersistentService(Unknown Source)
	at org.apache.derby.iapi.services.monitor.Monitor.createPersistentService(Unknown Source)
	at org.apache.derby.impl.jdbc.EmbedConnection.createDatabase(Unknown Source)
	at org.apache.derby.impl.jdbc.EmbedConnection.<init>(Unknown Source)
	at org.apache.derby.jdbc.InternalDriver.getNewEmbedConnection(Unknown Source)
	at org.apache.derby.jdbc.InternalDriver.connect(Unknown Source)
	at org.apache.derby.jdbc.InternalDriver.connect(Unknown Source)
	at org.apache.derby.jdbc.EmbeddedDriver.connect(Unknown Source)
	at org.apache.activemq.artemis.jdbc.store.drivers.AbstractJDBCDriver.connect(AbstractJDBCDriver.java:154)
	at org.apache.activemq.artemis.jdbc.store.drivers.AbstractJDBCDriver.start(AbstractJDBCDriver.java:86)
	at org.apache.activemq.artemis.core.server.impl.jdbc.JdbcSharedStateManagerTest.shouldStartIfTableExistEmpty(JdbcSharedStateManagerTest.java:73)

org.apache.activemq.artemis.core.server.impl.jdbc.JdbcSharedStateManagerTest  Time elapsed:
60.06 sec  <<< FAILURE!
java.lang.AssertionError: Thread leaked
	at org.junit.Assert.fail(Assert.java:88)
	at org.apache.activemq.artemis.utils.ThreadLeakCheckRule.finished(ThreadLeakCheckRule.java:112)
	at org.junit.rules.TestWatcher.finishedQuietly(TestWatcher.java:111)
	at org.junit.rules.TestWatcher.access$400(TestWatcher.java:46)
	at org.junit.rules.TestWatcher$1.evaluate(TestWatcher.java:64)
	at org.junit.rules.TestWatcher$1.evaluate(TestWatcher.java:55)
	at org.junit.rules.TestWatcher$1.evaluate(TestWatcher.java:55)
	at org.junit.rules.RunRules.evaluate(RunRules.java:20)
	at org.junit.runners.ParentRunner.run(ParentRunner.java:309)
	at org.apache.maven.surefire.junit4.JUnit4Provider.execute(JUnit4Provider.java:283)
	at org.apache.maven.surefire.junit4.JUnit4Provider.executeWithRerun(JUnit4Provider.java:173)
	at org.apache.maven.surefire.junit4.JUnit4Provider.executeTestSet(JUnit4Provider.java:153)
	at org.apache.maven.surefire.junit4.JUnit4Provider.invoke(JUnit4Provider.java:128)
	at org.apache.maven.surefire.booter.ForkedBooter.invokeProviderInSameClassLoader(ForkedBooter.java:203)
	at org.apache.maven.surefire.booter.ForkedBooter.runSuitesInProcess(ForkedBooter.java:155)
	at org.apache.maven.surefire.booter.ForkedBooter.main(ForkedBooter.java:103)

Running org.apache.activemq.artemis.core.server.journal.JournalStorageManagerConstantTest
Tests run: 1, Failures: 0, Errors: 0, Skipped: 0, Time elapsed: 0 sec - in org.apache.activemq.artemis.core.server.journal.JournalStorageManagerConstantTest
Running org.apache.activemq.artemis.core.server.management.JMXAccessControlListTest
Tests run: 14, Failures: 0, Errors: 0, Skipped: 0, Time elapsed: 0 sec - in org.apache.activemq.artemis.core.server.management.JMXAccessControlListTest
Running org.apache.activemq.artemis.core.settings.AddressSettingsTest
Tests run: 4, Failures: 0, Errors: 0, Skipped: 0, Time elapsed: 0 sec - in org.apache.activemq.artemis.core.settings.AddressSettingsTest
Running org.apache.activemq.artemis.core.settings.RepositoryTest
Tests run: 11, Failures: 0, Errors: 0, Skipped: 0, Time elapsed: 0 sec - in org.apache.activemq.artemis.core.settings.RepositoryTest
Running org.apache.activemq.artemis.core.transaction.impl.TransactionImplTest
rollback...
rollback...
Tests run: 2, Failures: 0, Errors: 0, Skipped: 0, Time elapsed: 0 sec - in org.apache.activemq.artemis.core.transaction.impl.TransactionImplTest
Running org.apache.activemq.artemis.core.version.impl.VersionImplTest
Tests run: 3, Failures: 0, Errors: 0, Skipped: 0, Time elapsed: 0 sec - in org.apache.activemq.artemis.core.version.impl.VersionImplTest
Running org.apache.activemq.artemis.spi.core.security.jaas.Krb5LoginModuleTest
Tests run: 2, Failures: 0, Errors: 0, Skipped: 0, Time elapsed: 0 sec - in org.apache.activemq.artemis.spi.core.security.jaas.Krb5LoginModuleTest
Running org.apache.activemq.artemis.tests.util.SimpleStringTest
Tests run: 20, Failures: 0, Errors: 0, Skipped: 0, Time elapsed: 0.246 sec - in org.apache.activemq.artemis.tests.util.SimpleStringTest
Running org.apache.activemq.artemis.uri.AcceptorParserTest
config:TransportConfiguration(name=test, factory=org-apache-activemq-artemis-core-remoting-impl-netty-NettyAcceptorFactory)
?tcpReceiveBufferSize=1048576&port=8080&host=localhost&protocols=openwire&tcpSendBufferSize=1048576&banana=x
config:TransportConfiguration(name=test, factory=org-apache-activemq-artemis-core-remoting-impl-netty-NettyAcceptorFactory)
?tcpReceiveBufferSize=1048576&port=5672&host=0-0-0-0&tcpSendBufferSize=1048576&virtualTopicConsumerWildcards=Consumer-*->;2
Consumer.*.>;2
Tests run: 3, Failures: 0, Errors: 0, Skipped: 0, Time elapsed: 0.129 sec - in org.apache.activemq.artemis.uri.AcceptorParserTest
Running org.apache.activemq.artemis.uri.ClusterConnectionConfigurationTest
Tests run: 5, Failures: 0, Errors: 0, Skipped: 0, Time elapsed: 0.006 sec - in org.apache.activemq.artemis.uri.ClusterConnectionConfigurationTest

Results :

Failed tests: 
  JdbcSharedStateManagerTest>Assert.fail:88 Thread leaked
Tests in error: 
  JdbcSharedStateManagerTest.shouldStartIfTableExistEmpty:73 » SQL Failed to cre...
  JdbcSharedStateManagerTest.shouldStartIfTableExistInitialized:86 » SQL Failed ...
  JdbcSharedStateManagerTest.shouldStartIfTableNotExist:62->createSharedStateManager:52
» IllegalState
  JdbcSharedStateManagerTest.shouldStartTwoIfTableNotExist:98->createSharedStateManager:52
» 

Tests run: 321, Failures: 1, Errors: 4, Skipped: 0

[INFO] ------------------------------------------------------------------------
[INFO] Reactor Summary:
[INFO] 
[INFO] ActiveMQ Artemis Parent 2.10.0-SNAPSHOT ............ SUCCESS [ 34.912 s]
[INFO] ActiveMQ Artemis Commons ........................... SUCCESS [ 43.191 s]
[INFO] ActiveMQ Artemis Core Client ....................... SUCCESS [ 27.827 s]
[INFO] ActiveMQ Artemis Selector Implementation ........... SUCCESS [ 15.302 s]
[INFO] ActiveMQ Artemis JMS Client ........................ SUCCESS [  5.753 s]
[INFO] ActiveMQ Artemis Journal ........................... SUCCESS [  4.806 s]
[INFO] ActiveMQ Artemis JDBC Store ........................ SUCCESS [01:53 min]
[INFO] ActiveMQ Artemis Server ............................ FAILURE [12:17 min]
[INFO] ActiveMQ Artemis Protocols ......................... SKIPPED
[INFO] ActiveMQ Artemis AMQP Protocol ..................... SKIPPED
[INFO] ActiveMQ Artemis STOMP Protocol .................... SKIPPED
[INFO] ActiveMQ Artemis OpenWire Protocol ................. SKIPPED
[INFO] ActiveMQ Artemis HQClient Protocol ................. SKIPPED
[INFO] ActiveMQ Artemis HornetQ Protocol .................. SKIPPED
[INFO] ActiveMQ Artemis MQTT Protocol ..................... SKIPPED
[INFO] ActiveMQ Artemis DTO ............................... SKIPPED
[INFO] ActiveMQ Artemis Service Extensions ................ SKIPPED
[INFO] ActiveMQ Artemis JMS Server ........................ SKIPPED
[INFO] ActiveMQ Artemis CDI Integration ................... SKIPPED
[INFO] ActiveMQ Artemis Boot .............................. SKIPPED
[INFO] ActiveMQ Artemis Tools ............................. SKIPPED
[INFO] ActiveMQ Artemis JUnit Rules ....................... SKIPPED
[INFO] ActiveMQ Artemis CLI ............................... SKIPPED
[INFO] ActiveMQ Artemis Web ............................... SKIPPED
[INFO] ActiveMQ Artemis Web ............................... SKIPPED
[INFO] ActiveMQ Artemis Core Client All ................... SKIPPED
[INFO] ActiveMQ Artemis Client OSGi ....................... SKIPPED
[INFO] ActiveMQ Artemis JMS Client All .................... SKIPPED
[INFO] ActiveMQ Artemis JMS Client OSGi ................... SKIPPED
[INFO] ActiveMQ Artemis RAR POM ........................... SKIPPED
[INFO] ActiveMQ Artemis REST Interface Implementation ..... SKIPPED
[INFO] ActiveMQ Artemis Maven Plugin ...................... SKIPPED
[INFO] ActiveMQ Artemis Server OSGi ....................... SKIPPED
[INFO] ActiveMQ Artemis Cons .............................. SKIPPED
[INFO] ActiveMQ Artemis HawtIO Branding ................... SKIPPED
[INFO] ActiveMQ Artemis HawtIO Plugin ..................... SKIPPED
[INFO] ActiveMQ Artemis Console ........................... SKIPPED
[INFO] ActiveMQ Artemis Spring Integration ................ SKIPPED
[INFO] Apache ActiveMQ Artemis Distribution ............... SKIPPED
[INFO] ActiveMQ Artemis Tests POM ......................... SKIPPED
[INFO] ActiveMQ Artemis Test Support ...................... SKIPPED
[INFO] ActiveMQ Artemis Unit Tests ........................ SKIPPED
[INFO] ActiveMQ Artemis Joram Tests ....................... SKIPPED
[INFO] ActiveMQ Artemis timing Tests ...................... SKIPPED
[INFO] ActiveMQ Artemis JMS Tests ......................... SKIPPED
[INFO] ActiveMQ Artemis Features .......................... SKIPPED
[INFO] ActiveMQ Artemis Integration Tests ................. SKIPPED
[INFO] ActiveMQ Artemis Client Integration Tests .......... SKIPPED
[INFO] ActiveMQ Artemis Compatibility Tests ............... SKIPPED
[INFO] ActiveMQ Artemis soak Tests ........................ SKIPPED
[INFO] ActiveMQ Artemis stress Tests ...................... SKIPPED
[INFO] ActiveMQ Artemis performance Tests ................. SKIPPED
[INFO] Smoke Tests ........................................ SKIPPED
[INFO] ActiveMQ Artemis Extra Tests 2.10.0-SNAPSHOT ....... SKIPPED
[INFO] ------------------------------------------------------------------------
[INFO] BUILD FAILURE
[INFO] ------------------------------------------------------------------------
[INFO] Total time: 16:48 min
[INFO] Finished at: 2019-08-21T16:31:21Z
[INFO] ------------------------------------------------------------------------
[ERROR] Failed to execute goal org.apache.maven.plugins:maven-surefire-plugin:2.18.1:test
(default-test) on project artemis-server: There are test failures.
[ERROR] 
[ERROR] Please refer to <https://builds.apache.org/job/ActiveMQ-Artemis-Master/ws/artemis-server/target/surefire-reports>
for the individual test results.
[ERROR] -> [Help 1]
[ERROR] 
[ERROR] To see the full stack trace of the errors, re-run Maven with the -e switch.
[ERROR] Re-run Maven using the -X switch to enable full debug logging.
[ERROR] 
[ERROR] For more information about the errors and possible solutions, please read the following
articles:
[ERROR] [Help 1] http://cwiki.apache.org/confluence/display/MAVEN/MojoFailureException
[ERROR] 
[ERROR] After correcting the problems, you can resume the build with the command
[ERROR]   mvn <goals> -rf :artemis-server
Build step 'Invoke top-level Maven targets' marked build as failure
Performing Post build task...
Could not match :Too many files with unapproved license  : False
Logical operation result is FALSE
Skipping script  : cat ratReport.txt
END OF POST BUILD TASK 	: 0
Recording test results

Mime
View raw message