activemq-commits mailing list archives

Site index · List index
Message view « Date » · « Thread »
Top « Date » · « Thread »
From Apache Jenkins Server <jenk...@builds.apache.org>
Subject Build failed in Jenkins: ActiveMQ-Artemis-Master #2491
Date Mon, 26 Aug 2019 04:23:06 GMT
See <https://builds.apache.org/job/ActiveMQ-Artemis-Master/2491/display/redirect?page=changes>

Changes:

[clebertsuconic] ARTEMIS-2364 collision avoidance for redelivery

[clebertsuconic] ARTEMIS-2392 Enable remove on cancel policy for scheduled pool

[clebertsuconic] ARTEMIS-2433 add ExternalCertificateLoginModule to surface a SASL

[clebertsuconic] ARTEMIS-2415 JDBCJournal miss pending tasks during shutdown

------------------------------------------
[...truncated 291.86 KB...]
Tests run: 3, Failures: 0, Errors: 0, Skipped: 0, Time elapsed: 0.188 sec - in org.apache.activemq.artemis.core.paging.cursor.impl.PageReaderTest
Running org.apache.activemq.artemis.core.persistence.impl.journal.JournalStorageManagerTest
[main] 04:16:22,795 INFO  [org.apache.activemq.artemis.core.server] **** start #test testAddBytesToLargeMessageNotLeakingByteBuffer[journal
type=NIO]() ***
[main] 04:16:23,395 INFO  [org.apache.activemq.artemis.core.server] **** end #test testAddBytesToLargeMessageNotLeakingByteBuffer[journal
type=NIO]() ***
[main] 04:16:23,397 INFO  [org.apache.activemq.artemis.core.server] **** start #test testDeletingLargeMessagePendingTasksOnShutdown[journal
type=NIO]() ***
[main] 04:16:23,550 INFO  [org.apache.activemq.artemis.core.server] **** end #test testDeletingLargeMessagePendingTasksOnShutdown[journal
type=NIO]() ***
[main] 04:16:23,551 INFO  [org.apache.activemq.artemis.core.server] **** start #test testStopReplicationDoesNotDeadlockWhileStopping[journal
type=NIO]() ***
[main] 04:16:24,595 INFO  [org.apache.activemq.artemis.core.server] **** end #test testStopReplicationDoesNotDeadlockWhileStopping[journal
type=NIO]() ***
[main] 04:16:24,597 INFO  [org.apache.activemq.artemis.core.server] **** start #test testFixJournalFileSize[journal
type=NIO]() ***
[main] 04:16:24,599 INFO  [org.apache.activemq.artemis.core.server] AMQ221058: resetting Journal
File size from 4,098 to 4,096 to fit with alignment of 4,096
[main] 04:16:24,601 INFO  [org.apache.activemq.artemis.core.server] **** end #test testFixJournalFileSize[journal
type=NIO]() ***
[main] 04:16:24,602 INFO  [org.apache.activemq.artemis.core.server] **** start #test testAddBytesToLargeMessageNotLeakingByteBuffer[journal
type=ASYNCIO]() ***
[main] 04:16:24,727 INFO  [org.apache.activemq.artemis.core.server] **** end #test testAddBytesToLargeMessageNotLeakingByteBuffer[journal
type=ASYNCIO]() ***
[main] 04:16:24,728 INFO  [org.apache.activemq.artemis.core.server] **** start #test testDeletingLargeMessagePendingTasksOnShutdown[journal
type=ASYNCIO]() ***
[main] 04:16:25,846 INFO  [org.apache.activemq.artemis.core.server] **** end #test testDeletingLargeMessagePendingTasksOnShutdown[journal
type=ASYNCIO]() ***
[main] 04:16:25,848 INFO  [org.apache.activemq.artemis.core.server] **** start #test testStopReplicationDoesNotDeadlockWhileStopping[journal
type=ASYNCIO]() ***
[main] 04:16:26,530 INFO  [org.apache.activemq.artemis.core.server] **** end #test testStopReplicationDoesNotDeadlockWhileStopping[journal
type=ASYNCIO]() ***
[main] 04:16:26,530 INFO  [org.apache.activemq.artemis.core.server] **** start #test testFixJournalFileSize[journal
type=ASYNCIO]() ***
[main] 04:16:26,532 INFO  [org.apache.activemq.artemis.core.server] AMQ221058: resetting Journal
File size from 4,098 to 4,096 to fit with alignment of 4,096
[main] 04:16:26,533 INFO  [org.apache.activemq.artemis.core.server] **** end #test testFixJournalFileSize[journal
type=ASYNCIO]() ***
[main] 04:16:26,534 INFO  [org.apache.activemq.artemis.core.server] **** start #test testAddBytesToLargeMessageNotLeakingByteBuffer[journal
type=MAPPED]() ***
[main] 04:16:26,603 INFO  [org.apache.activemq.artemis.core.server] **** end #test testAddBytesToLargeMessageNotLeakingByteBuffer[journal
type=MAPPED]() ***
[main] 04:16:26,604 INFO  [org.apache.activemq.artemis.core.server] **** start #test testDeletingLargeMessagePendingTasksOnShutdown[journal
type=MAPPED]() ***
[main] 04:16:27,623 INFO  [org.apache.activemq.artemis.core.server] **** end #test testDeletingLargeMessagePendingTasksOnShutdown[journal
type=MAPPED]() ***
[main] 04:16:27,624 INFO  [org.apache.activemq.artemis.core.server] **** start #test testStopReplicationDoesNotDeadlockWhileStopping[journal
type=MAPPED]() ***
[main] 04:16:28,175 INFO  [org.apache.activemq.artemis.core.server] **** end #test testStopReplicationDoesNotDeadlockWhileStopping[journal
type=MAPPED]() ***
[main] 04:16:28,176 INFO  [org.apache.activemq.artemis.core.server] **** start #test testFixJournalFileSize[journal
type=MAPPED]() ***
[main] 04:16:28,179 INFO  [org.apache.activemq.artemis.core.server] AMQ221058: resetting Journal
File size from 4,098 to 4,096 to fit with alignment of 4,096
[main] 04:16:28,181 INFO  [org.apache.activemq.artemis.core.server] **** end #test testFixJournalFileSize[journal
type=MAPPED]() ***
Tests run: 12, Failures: 0, Errors: 0, Skipped: 0, Time elapsed: 5.421 sec - in org.apache.activemq.artemis.core.persistence.impl.journal.JournalStorageManagerTest
Running org.apache.activemq.artemis.core.persistence.impl.journal.QueueBindingEncodingTest
Tests run: 1, Failures: 0, Errors: 0, Skipped: 0, Time elapsed: 0.003 sec - in org.apache.activemq.artemis.core.persistence.impl.journal.QueueBindingEncodingTest
Running org.apache.activemq.artemis.core.protocol.core.impl.wireformat.ReplicationSyncFileMessageTest
[main] 04:16:28,195 INFO  [org.apache.activemq.artemis.core.server] **** start #test testInVMConnectionEncodeMessage()
***
[main] 04:16:28,230 INFO  [org.apache.activemq.artemis.core.server] **** end #test testInVMConnectionEncodeMessage()
***
[main] 04:16:28,231 INFO  [org.apache.activemq.artemis.core.server] **** start #test testNettyConnectionEncodeMessage()
***
[main] 04:16:28,330 INFO  [org.apache.activemq.artemis.core.server] **** end #test testNettyConnectionEncodeMessage()
***
Tests run: 2, Failures: 0, Errors: 0, Skipped: 0, Time elapsed: 0.139 sec - in org.apache.activemq.artemis.core.protocol.core.impl.wireformat.ReplicationSyncFileMessageTest
Running org.apache.activemq.artemis.core.reload.LoggingConfigurationFileReloaderTest
[main] 04:16:28,337 INFO  [org.apache.activemq.artemis.core.server] AMQ221056: Reloading configuration:
logging
Tests run: 1, Failures: 0, Errors: 0, Skipped: 0, Time elapsed: 0.021 sec - in org.apache.activemq.artemis.core.reload.LoggingConfigurationFileReloaderTest
Running org.apache.activemq.artemis.core.reload.ReloadManagerTest
Tests run: 2, Failures: 0, Errors: 0, Skipped: 0, Time elapsed: 2.025 sec - in org.apache.activemq.artemis.core.reload.ReloadManagerTest
Running org.apache.activemq.artemis.core.security.RoleTest
Tests run: 5, Failures: 0, Errors: 0, Skipped: 0, Time elapsed: 0.002 sec - in org.apache.activemq.artemis.core.security.RoleTest
Running org.apache.activemq.artemis.core.security.jaas.CertificateLoginModuleTest
Tests run: 3, Failures: 0, Errors: 0, Skipped: 0, Time elapsed: 0.005 sec - in org.apache.activemq.artemis.core.security.jaas.CertificateLoginModuleTest
Running org.apache.activemq.artemis.core.security.jaas.GuestLoginModuleTest
Tests run: 2, Failures: 0, Errors: 0, Skipped: 0, Time elapsed: 0.012 sec - in org.apache.activemq.artemis.core.security.jaas.GuestLoginModuleTest
Running org.apache.activemq.artemis.core.security.jaas.JAASSecurityManagerTest
loader: sun.misc.Launcher$AppClassLoader@42a57993
loader: sun.misc.Launcher$AppClassLoader@42a57993
Tests run: 2, Failures: 0, Errors: 0, Skipped: 0, Time elapsed: 0.008 sec - in org.apache.activemq.artemis.core.security.jaas.JAASSecurityManagerTest
Running org.apache.activemq.artemis.core.security.jaas.LDAPLoginModuleMaskPasswordTest
Tests run: 5, Failures: 0, Errors: 0, Skipped: 0, Time elapsed: 19.714 sec - in org.apache.activemq.artemis.core.security.jaas.LDAPLoginModuleMaskPasswordTest
Running org.apache.activemq.artemis.core.security.jaas.LDAPLoginModuleTest
Tests run: 8, Failures: 0, Errors: 0, Skipped: 0, Time elapsed: 16.203 sec - in org.apache.activemq.artemis.core.security.jaas.LDAPLoginModuleTest
Running org.apache.activemq.artemis.core.security.jaas.LDAPModuleRoleExpansionTest
Tests run: 2, Failures: 0, Errors: 0, Skipped: 0, Time elapsed: 13.741 sec - in org.apache.activemq.artemis.core.security.jaas.LDAPModuleRoleExpansionTest
Running org.apache.activemq.artemis.core.security.jaas.PropertiesLoginModuleRaceConditionTest
Tests run: 1, Failures: 0, Errors: 0, Skipped: 0, Time elapsed: 58.697 sec - in org.apache.activemq.artemis.core.security.jaas.PropertiesLoginModuleRaceConditionTest
Running org.apache.activemq.artemis.core.security.jaas.PropertiesLoginModuleTest
Tests run: 5, Failures: 0, Errors: 0, Skipped: 0, Time elapsed: 1.048 sec - in org.apache.activemq.artemis.core.security.jaas.PropertiesLoginModuleTest
Running org.apache.activemq.artemis.core.security.jaas.RolePrincipalTest
Tests run: 3, Failures: 0, Errors: 0, Skipped: 0, Time elapsed: 0 sec - in org.apache.activemq.artemis.core.security.jaas.RolePrincipalTest
Running org.apache.activemq.artemis.core.security.jaas.TextFileCertificateLoginModuleTest
Tests run: 3, Failures: 0, Errors: 0, Skipped: 0, Time elapsed: 0.734 sec - in org.apache.activemq.artemis.core.security.jaas.TextFileCertificateLoginModuleTest
Running org.apache.activemq.artemis.core.security.jaas.UserPrincipalTest
Tests run: 3, Failures: 0, Errors: 0, Skipped: 0, Time elapsed: 0 sec - in org.apache.activemq.artemis.core.security.jaas.UserPrincipalTest
Running org.apache.activemq.artemis.core.server.QueueConfigTest
Tests run: 4, Failures: 0, Errors: 0, Skipped: 0, Time elapsed: 0.001 sec - in org.apache.activemq.artemis.core.server.QueueConfigTest
Running org.apache.activemq.artemis.core.server.cluster.impl.BroadcastGroupImplTest
Tests run: 1, Failures: 0, Errors: 0, Skipped: 0, Time elapsed: 0.008 sec - in org.apache.activemq.artemis.core.server.cluster.impl.BroadcastGroupImplTest
Running org.apache.activemq.artemis.core.server.files.FileMoveManagerTest
Tests run: 9, Failures: 0, Errors: 0, Skipped: 0, Time elapsed: 0.819 sec - in org.apache.activemq.artemis.core.server.files.FileMoveManagerTest
Running org.apache.activemq.artemis.core.server.files.FileStoreMonitorTest
tick:: / (/dev/sda3) usage::0.20035160917751293
under:: / (/dev/sda3) usage::0.20035160917751293
tick:: / (/dev/sda3) usage::1.0
over:: / (/dev/sda3) usage::1.0
TickS::0.20035160813708286
TickS::0.20035160813708286
TickS::0.20035160813708286
TickS::0.20035160813708286
TickS::0.20035160813708286
Tests run: 2, Failures: 0, Errors: 0, Skipped: 0, Time elapsed: 0.21 sec - in org.apache.activemq.artemis.core.server.files.FileStoreMonitorTest
Running org.apache.activemq.artemis.core.server.group.impl.ClusteredResetMockTest
Tests run: 1, Failures: 0, Errors: 0, Skipped: 0, Time elapsed: 0.039 sec - in org.apache.activemq.artemis.core.server.group.impl.ClusteredResetMockTest
Running org.apache.activemq.artemis.core.server.impl.ActiveMQServerImplTest
Tests run: 1, Failures: 0, Errors: 0, Skipped: 0, Time elapsed: 0.398 sec - in org.apache.activemq.artemis.core.server.impl.ActiveMQServerImplTest
Running org.apache.activemq.artemis.core.server.impl.BucketMessageGroupsTest
Tests run: 7, Failures: 0, Errors: 0, Skipped: 0, Time elapsed: 0.028 sec - in org.apache.activemq.artemis.core.server.impl.BucketMessageGroupsTest
Running org.apache.activemq.artemis.core.server.impl.CompositeAddressTest
Tests run: 1, Failures: 0, Errors: 0, Skipped: 0, Time elapsed: 0 sec - in org.apache.activemq.artemis.core.server.impl.CompositeAddressTest
Running org.apache.activemq.artemis.core.server.impl.EmbeddedServerTest
Tests run: 2, Failures: 0, Errors: 0, Skipped: 0, Time elapsed: 0.053 sec - in org.apache.activemq.artemis.core.server.impl.EmbeddedServerTest
Running org.apache.activemq.artemis.core.server.impl.QueueConsumersImplTest
Tests run: 3, Failures: 0, Errors: 0, Skipped: 0, Time elapsed: 0.005 sec - in org.apache.activemq.artemis.core.server.impl.QueueConsumersImplTest
Running org.apache.activemq.artemis.core.server.impl.ScheduledDeliveryHandlerTest
Tests run: 6, Failures: 0, Errors: 0, Skipped: 0, Time elapsed: 1.332 sec - in org.apache.activemq.artemis.core.server.impl.ScheduledDeliveryHandlerTest
Running org.apache.activemq.artemis.core.server.impl.jdbc.JdbcLeaseLockTest
Tests run: 20, Failures: 0, Errors: 0, Skipped: 0, Time elapsed: 235.324 sec - in org.apache.activemq.artemis.core.server.impl.jdbc.JdbcLeaseLockTest
Running org.apache.activemq.artemis.core.server.impl.jdbc.JdbcSharedStateManagerTest
Tests run: 4, Failures: 0, Errors: 1, Skipped: 0, Time elapsed: 44.982 sec <<< FAILURE!
- in org.apache.activemq.artemis.core.server.impl.jdbc.JdbcSharedStateManagerTest
shouldStartIfTableExistInitialized(org.apache.activemq.artemis.core.server.impl.jdbc.JdbcSharedStateManagerTest)
 Time elapsed: 11.399 sec  <<< ERROR!
java.lang.Exception: test timed out after 10000 milliseconds
	at java.io.FileDescriptor.sync(Native Method)
	at org.apache.derby.impl.io.DirRandomAccessFile.sync(Unknown Source)
	at org.apache.derby.impl.store.raw.data.RAFContainer.writeRAFHeader(Unknown Source)
	at org.apache.derby.impl.store.raw.data.RAFContainer.run(Unknown Source)
	at java.security.AccessController.doPrivileged(Native Method)
	at org.apache.derby.impl.store.raw.data.RAFContainer.stubbify(Unknown Source)
	at org.apache.derby.impl.store.raw.data.RAFContainer.removeContainer(Unknown Source)
	at org.apache.derby.impl.store.raw.data.BaseContainerHandle.removeContainer(Unknown Source)
	at org.apache.derby.impl.store.raw.data.ContainerOperation.doMe(Unknown Source)
	at org.apache.derby.impl.store.raw.log.FileLogger.logAndDo(Unknown Source)
	at org.apache.derby.impl.store.raw.xact.Xact.logAndDo(Unknown Source)
	at org.apache.derby.impl.store.raw.data.ReclaimSpaceHelper.reclaimContainer(Unknown Source)
	at org.apache.derby.impl.store.raw.data.ReclaimSpaceHelper.reclaimSpace(Unknown Source)
	at org.apache.derby.impl.store.raw.data.BaseDataFileFactory.reclaimSpace(Unknown Source)
	at org.apache.derby.impl.store.raw.data.ReclaimSpace.performWork(Unknown Source)
	at org.apache.derby.impl.store.raw.xact.Xact.postTermination(Unknown Source)
	at org.apache.derby.impl.store.raw.xact.Xact.completeCommit(Unknown Source)
	at org.apache.derby.impl.store.raw.xact.Xact.commit(Unknown Source)
	at org.apache.derby.impl.store.raw.xact.Xact.commit(Unknown Source)
	at org.apache.derby.impl.store.access.RAMTransaction.commit(Unknown Source)
	at org.apache.derby.impl.sql.conn.GenericLanguageConnectionContext.doCommit(Unknown Source)
	at org.apache.derby.impl.sql.conn.GenericLanguageConnectionContext.userCommit(Unknown Source)
	at org.apache.derby.impl.jdbc.TransactionResourceImpl.commit(Unknown Source)
	at org.apache.derby.impl.jdbc.EmbedConnection.commit(Unknown Source)
	at org.apache.activemq.artemis.jdbc.store.drivers.AbstractJDBCDriver.destroy(AbstractJDBCDriver.java:193)
	at org.apache.activemq.artemis.core.server.impl.jdbc.JdbcSharedStateManagerTest.shouldStartIfTableExistInitialized(JdbcSharedStateManagerTest.java:90)

Running org.apache.activemq.artemis.core.server.journal.JournalStorageManagerConstantTest
Tests run: 1, Failures: 0, Errors: 0, Skipped: 0, Time elapsed: 0.001 sec - in org.apache.activemq.artemis.core.server.journal.JournalStorageManagerConstantTest
Running org.apache.activemq.artemis.core.server.management.JMXAccessControlListTest
Tests run: 14, Failures: 0, Errors: 0, Skipped: 0, Time elapsed: 0.007 sec - in org.apache.activemq.artemis.core.server.management.JMXAccessControlListTest
Running org.apache.activemq.artemis.core.settings.AddressSettingsTest
Tests run: 4, Failures: 0, Errors: 0, Skipped: 0, Time elapsed: 0.008 sec - in org.apache.activemq.artemis.core.settings.AddressSettingsTest
Running org.apache.activemq.artemis.core.settings.RepositoryTest
Tests run: 11, Failures: 0, Errors: 0, Skipped: 0, Time elapsed: 0.034 sec - in org.apache.activemq.artemis.core.settings.RepositoryTest
Running org.apache.activemq.artemis.core.transaction.impl.TransactionImplTest
rollback...
rollback...
Tests run: 2, Failures: 0, Errors: 0, Skipped: 0, Time elapsed: 0.016 sec - in org.apache.activemq.artemis.core.transaction.impl.TransactionImplTest
Running org.apache.activemq.artemis.core.version.impl.VersionImplTest
Tests run: 3, Failures: 0, Errors: 0, Skipped: 0, Time elapsed: 0.002 sec - in org.apache.activemq.artemis.core.version.impl.VersionImplTest
Running org.apache.activemq.artemis.spi.core.security.jaas.Krb5LoginModuleTest
Tests run: 2, Failures: 0, Errors: 0, Skipped: 0, Time elapsed: 0.001 sec - in org.apache.activemq.artemis.spi.core.security.jaas.Krb5LoginModuleTest
Running org.apache.activemq.artemis.tests.util.SimpleStringTest
Tests run: 20, Failures: 0, Errors: 0, Skipped: 0, Time elapsed: 0.312 sec - in org.apache.activemq.artemis.tests.util.SimpleStringTest
Running org.apache.activemq.artemis.uri.AcceptorParserTest
config:TransportConfiguration(name=test, factory=org-apache-activemq-artemis-core-remoting-impl-netty-NettyAcceptorFactory)
?tcpReceiveBufferSize=1048576&port=8080&host=localhost&protocols=openwire&tcpSendBufferSize=1048576&banana=x
config:TransportConfiguration(name=test, factory=org-apache-activemq-artemis-core-remoting-impl-netty-NettyAcceptorFactory)
?tcpReceiveBufferSize=1048576&port=5672&host=0-0-0-0&tcpSendBufferSize=1048576&virtualTopicConsumerWildcards=Consumer-*->;2
Consumer.*.>;2
Tests run: 3, Failures: 0, Errors: 0, Skipped: 0, Time elapsed: 0.006 sec - in org.apache.activemq.artemis.uri.AcceptorParserTest
Running org.apache.activemq.artemis.uri.ClusterConnectionConfigurationTest
Tests run: 5, Failures: 0, Errors: 0, Skipped: 0, Time elapsed: 0.007 sec - in org.apache.activemq.artemis.uri.ClusterConnectionConfigurationTest

Results :

Tests in error: 
  JdbcSharedStateManagerTest.shouldStartIfTableExistInitialized:90 ยป  test timed...

Tests run: 325, Failures: 0, Errors: 1, Skipped: 0

[INFO] ------------------------------------------------------------------------
[INFO] Reactor Summary:
[INFO] 
[INFO] ActiveMQ Artemis Parent 2.10.0-SNAPSHOT ............ SUCCESS [ 10.615 s]
[INFO] ActiveMQ Artemis Commons ........................... SUCCESS [ 35.232 s]
[INFO] ActiveMQ Artemis Core Client ....................... SUCCESS [ 27.493 s]
[INFO] ActiveMQ Artemis Selector Implementation ........... SUCCESS [  3.761 s]
[INFO] ActiveMQ Artemis JMS Client ........................ SUCCESS [  6.299 s]
[INFO] ActiveMQ Artemis Journal ........................... SUCCESS [  4.589 s]
[INFO] ActiveMQ Artemis JDBC Store ........................ SUCCESS [01:03 min]
[INFO] ActiveMQ Artemis Server ............................ FAILURE [07:49 min]
[INFO] ActiveMQ Artemis Protocols ......................... SKIPPED
[INFO] ActiveMQ Artemis AMQP Protocol ..................... SKIPPED
[INFO] ActiveMQ Artemis STOMP Protocol .................... SKIPPED
[INFO] ActiveMQ Artemis OpenWire Protocol ................. SKIPPED
[INFO] ActiveMQ Artemis HQClient Protocol ................. SKIPPED
[INFO] ActiveMQ Artemis HornetQ Protocol .................. SKIPPED
[INFO] ActiveMQ Artemis MQTT Protocol ..................... SKIPPED
[INFO] ActiveMQ Artemis DTO ............................... SKIPPED
[INFO] ActiveMQ Artemis Service Extensions ................ SKIPPED
[INFO] ActiveMQ Artemis JMS Server ........................ SKIPPED
[INFO] ActiveMQ Artemis CDI Integration ................... SKIPPED
[INFO] ActiveMQ Artemis Boot .............................. SKIPPED
[INFO] ActiveMQ Artemis Tools ............................. SKIPPED
[INFO] ActiveMQ Artemis JUnit Rules ....................... SKIPPED
[INFO] ActiveMQ Artemis CLI ............................... SKIPPED
[INFO] ActiveMQ Artemis Web ............................... SKIPPED
[INFO] ActiveMQ Artemis Web ............................... SKIPPED
[INFO] ActiveMQ Artemis Core Client All ................... SKIPPED
[INFO] ActiveMQ Artemis Client OSGi ....................... SKIPPED
[INFO] ActiveMQ Artemis JMS Client All .................... SKIPPED
[INFO] ActiveMQ Artemis JMS Client OSGi ................... SKIPPED
[INFO] ActiveMQ Artemis RAR POM ........................... SKIPPED
[INFO] ActiveMQ Artemis REST Interface Implementation ..... SKIPPED
[INFO] ActiveMQ Artemis Maven Plugin ...................... SKIPPED
[INFO] ActiveMQ Artemis Server OSGi ....................... SKIPPED
[INFO] ActiveMQ Artemis Cons .............................. SKIPPED
[INFO] ActiveMQ Artemis HawtIO Branding ................... SKIPPED
[INFO] ActiveMQ Artemis HawtIO Plugin ..................... SKIPPED
[INFO] ActiveMQ Artemis Console ........................... SKIPPED
[INFO] ActiveMQ Artemis Spring Integration ................ SKIPPED
[INFO] Apache ActiveMQ Artemis Distribution ............... SKIPPED
[INFO] ActiveMQ Artemis Tests POM ......................... SKIPPED
[INFO] ActiveMQ Artemis Test Support ...................... SKIPPED
[INFO] ActiveMQ Artemis Unit Tests ........................ SKIPPED
[INFO] ActiveMQ Artemis Joram Tests ....................... SKIPPED
[INFO] ActiveMQ Artemis timing Tests ...................... SKIPPED
[INFO] ActiveMQ Artemis JMS Tests ......................... SKIPPED
[INFO] ActiveMQ Artemis Features .......................... SKIPPED
[INFO] ActiveMQ Artemis Integration Tests ................. SKIPPED
[INFO] ActiveMQ Artemis Client Integration Tests .......... SKIPPED
[INFO] ActiveMQ Artemis Compatibility Tests ............... SKIPPED
[INFO] ActiveMQ Artemis soak Tests ........................ SKIPPED
[INFO] ActiveMQ Artemis stress Tests ...................... SKIPPED
[INFO] ActiveMQ Artemis performance Tests ................. SKIPPED
[INFO] Smoke Tests ........................................ SKIPPED
[INFO] ActiveMQ Artemis Extra Tests 2.10.0-SNAPSHOT ....... SKIPPED
[INFO] ------------------------------------------------------------------------
[INFO] BUILD FAILURE
[INFO] ------------------------------------------------------------------------
[INFO] Total time: 10:24 min
[INFO] Finished at: 2019-08-26T04:23:04Z
[INFO] ------------------------------------------------------------------------
[ERROR] Failed to execute goal org.apache.maven.plugins:maven-surefire-plugin:2.18.1:test
(default-test) on project artemis-server: There are test failures.
[ERROR] 
[ERROR] Please refer to <https://builds.apache.org/job/ActiveMQ-Artemis-Master/ws/artemis-server/target/surefire-reports>
for the individual test results.
[ERROR] -> [Help 1]
[ERROR] 
[ERROR] To see the full stack trace of the errors, re-run Maven with the -e switch.
[ERROR] Re-run Maven using the -X switch to enable full debug logging.
[ERROR] 
[ERROR] For more information about the errors and possible solutions, please read the following
articles:
[ERROR] [Help 1] http://cwiki.apache.org/confluence/display/MAVEN/MojoFailureException
[ERROR] 
[ERROR] After correcting the problems, you can resume the build with the command
[ERROR]   mvn <goals> -rf :artemis-server
Build step 'Invoke top-level Maven targets' marked build as failure
Performing Post build task...
Could not match :Too many files with unapproved license  : False
Logical operation result is FALSE
Skipping script  : cat ratReport.txt
END OF POST BUILD TASK 	: 0
Recording test results

Mime
View raw message