activemq-commits mailing list archives

Site index · List index
Message view « Date » · « Thread »
Top « Date » · « Thread »
From Apache Jenkins Server <jenk...@builds.apache.org>
Subject Build failed in Jenkins: ActiveMQ-Java8 #1607
Date Thu, 25 Jun 2020 00:56:34 GMT
See <https://builds.apache.org/job/ActiveMQ-Java8/1607/display/redirect?page=changes>

Changes:

[jbonofre] Cancel 5.16.0 release

[christopher.l.shannon] AMQ-7504 - Run apache-rat:check when apache-release profile is activated

[christopher.l.shannon] AMQ-7505 - Fix prototype.js exclusion for apache-rat:check

[christopher.l.shannon] AMQ-7505 - Adding missing license headers to two source files

[jbonofre] [maven-release-plugin] prepare release activemq-5.16.0


------------------------------------------
[...truncated 32.99 KB...]
    at sun.reflect.DelegatingMethodAccessorImpl.invoke (DelegatingMethodAccessorImpl.java:43)
    at java.lang.reflect.Method.invoke (Method.java:498)
    at org.codehaus.plexus.classworlds.launcher.Launcher.launchEnhanced (Launcher.java:282)
    at org.codehaus.plexus.classworlds.launcher.Launcher.launch (Launcher.java:225)
    at jenkins.maven3.agent.Maven35Main.launch (Maven35Main.java:178)
    at sun.reflect.NativeMethodAccessorImpl.invoke0 (Native Method)
    at sun.reflect.NativeMethodAccessorImpl.invoke (NativeMethodAccessorImpl.java:62)
    at sun.reflect.DelegatingMethodAccessorImpl.invoke (DelegatingMethodAccessorImpl.java:43)
    at java.lang.reflect.Method.invoke (Method.java:498)
    at hudson.maven.Maven3Builder.call (Maven3Builder.java:139)
    at hudson.maven.Maven3Builder.call (Maven3Builder.java:70)
    at hudson.remoting.UserRequest.perform (UserRequest.java:212)
    at hudson.remoting.UserRequest.perform (UserRequest.java:54)
    at hudson.remoting.Request$2.run (Request.java:369)
    at hudson.remoting.InterceptingExecutorService$1.call (InterceptingExecutorService.java:72)
    at java.util.concurrent.FutureTask.run (FutureTask.java:266)
    at java.util.concurrent.ThreadPoolExecutor.runWorker (ThreadPoolExecutor.java:1149)
    at java.util.concurrent.ThreadPoolExecutor$Worker.run (ThreadPoolExecutor.java:624)
    at java.lang.Thread.run (Thread.java:748)
Caused by: org.eclipse.aether.deployment.DeploymentException: Failed to deploy artifacts:
Could not transfer artifact org.apache.activemq:activemq-parent:pom:5.16.0 from/to apache.releases.https
(https://repository.apache.org/service/local/staging/deploy/maven2): Transfer failed for https://repository.apache.org/service/local/staging/deploy/maven2/org/apache/activemq/activemq-parent/5.16.0/activemq-parent-5.16.0.pom
401 Unauthorized
    at org.eclipse.aether.internal.impl.DefaultDeployer.deploy (DefaultDeployer.java:301)
    at org.eclipse.aether.internal.impl.DefaultDeployer.deploy (DefaultDeployer.java:213)
    at org.eclipse.aether.internal.impl.DefaultRepositorySystem.deploy (DefaultRepositorySystem.java:386)
    at org.apache.maven.artifact.deployer.DefaultArtifactDeployer.deploy (DefaultArtifactDeployer.java:142)
    at org.apache.maven.plugin.deploy.AbstractDeployMojo.deploy (AbstractDeployMojo.java:171)
    at org.apache.maven.plugin.deploy.DeployMojo.deployProject (DeployMojo.java:242)
    at org.apache.maven.plugin.deploy.DeployMojo.execute (DeployMojo.java:169)
    at org.apache.maven.plugin.DefaultBuildPluginManager.executeMojo (DefaultBuildPluginManager.java:137)
    at org.apache.maven.lifecycle.internal.MojoExecutor.execute (MojoExecutor.java:210)
    at org.apache.maven.lifecycle.internal.MojoExecutor.execute (MojoExecutor.java:156)
    at org.apache.maven.lifecycle.internal.MojoExecutor.execute (MojoExecutor.java:148)
    at org.apache.maven.lifecycle.internal.LifecycleModuleBuilder.buildProject (LifecycleModuleBuilder.java:117)
    at org.apache.maven.lifecycle.internal.LifecycleModuleBuilder.buildProject (LifecycleModuleBuilder.java:81)
    at org.apache.maven.lifecycle.internal.builder.singlethreaded.SingleThreadedBuilder.build
(SingleThreadedBuilder.java:56)
    at org.apache.maven.lifecycle.internal.LifecycleStarter.execute (LifecycleStarter.java:128)
    at org.apache.maven.DefaultMaven.doExecute (DefaultMaven.java:305)
    at org.apache.maven.DefaultMaven.doExecute (DefaultMaven.java:192)
    at org.apache.maven.DefaultMaven.execute (DefaultMaven.java:105)
    at org.jvnet.hudson.maven3.launcher.Maven35Launcher.main (Maven35Launcher.java:130)
    at sun.reflect.NativeMethodAccessorImpl.invoke0 (Native Method)
    at sun.reflect.NativeMethodAccessorImpl.invoke (NativeMethodAccessorImpl.java:62)
    at sun.reflect.DelegatingMethodAccessorImpl.invoke (DelegatingMethodAccessorImpl.java:43)
    at java.lang.reflect.Method.invoke (Method.java:498)
    at org.codehaus.plexus.classworlds.launcher.Launcher.launchEnhanced (Launcher.java:282)
    at org.codehaus.plexus.classworlds.launcher.Launcher.launch (Launcher.java:225)
    at jenkins.maven3.agent.Maven35Main.launch (Maven35Main.java:178)
    at sun.reflect.NativeMethodAccessorImpl.invoke0 (Native Method)
    at sun.reflect.NativeMethodAccessorImpl.invoke (NativeMethodAccessorImpl.java:62)
    at sun.reflect.DelegatingMethodAccessorImpl.invoke (DelegatingMethodAccessorImpl.java:43)
    at java.lang.reflect.Method.invoke (Method.java:498)
    at hudson.maven.Maven3Builder.call (Maven3Builder.java:139)
    at hudson.maven.Maven3Builder.call (Maven3Builder.java:70)
    at hudson.remoting.UserRequest.perform (UserRequest.java:212)
    at hudson.remoting.UserRequest.perform (UserRequest.java:54)
    at hudson.remoting.Request$2.run (Request.java:369)
    at hudson.remoting.InterceptingExecutorService$1.call (InterceptingExecutorService.java:72)
    at java.util.concurrent.FutureTask.run (FutureTask.java:266)
    at java.util.concurrent.ThreadPoolExecutor.runWorker (ThreadPoolExecutor.java:1149)
    at java.util.concurrent.ThreadPoolExecutor$Worker.run (ThreadPoolExecutor.java:624)
    at java.lang.Thread.run (Thread.java:748)
Caused by: org.eclipse.aether.transfer.ArtifactTransferException: Could not transfer artifact
org.apache.activemq:activemq-parent:pom:5.16.0 from/to apache.releases.https (https://repository.apache.org/service/local/staging/deploy/maven2):
Transfer failed for https://repository.apache.org/service/local/staging/deploy/maven2/org/apache/activemq/activemq-parent/5.16.0/activemq-parent-5.16.0.pom
401 Unauthorized
    at org.eclipse.aether.connector.basic.ArtifactTransportListener.transferFailed (ArtifactTransportListener.java:52)
    at org.eclipse.aether.connector.basic.BasicRepositoryConnector$TaskRunner.run (BasicRepositoryConnector.java:369)
    at org.eclipse.aether.connector.basic.BasicRepositoryConnector.put (BasicRepositoryConnector.java:288)
    at org.eclipse.aether.internal.impl.DefaultDeployer.deploy (DefaultDeployer.java:295)
    at org.eclipse.aether.internal.impl.DefaultDeployer.deploy (DefaultDeployer.java:213)
    at org.eclipse.aether.internal.impl.DefaultRepositorySystem.deploy (DefaultRepositorySystem.java:386)
    at org.apache.maven.artifact.deployer.DefaultArtifactDeployer.deploy (DefaultArtifactDeployer.java:142)
    at org.apache.maven.plugin.deploy.AbstractDeployMojo.deploy (AbstractDeployMojo.java:171)
    at org.apache.maven.plugin.deploy.DeployMojo.deployProject (DeployMojo.java:242)
    at org.apache.maven.plugin.deploy.DeployMojo.execute (DeployMojo.java:169)
    at org.apache.maven.plugin.DefaultBuildPluginManager.executeMojo (DefaultBuildPluginManager.java:137)
    at org.apache.maven.lifecycle.internal.MojoExecutor.execute (MojoExecutor.java:210)
    at org.apache.maven.lifecycle.internal.MojoExecutor.execute (MojoExecutor.java:156)
    at org.apache.maven.lifecycle.internal.MojoExecutor.execute (MojoExecutor.java:148)
    at org.apache.maven.lifecycle.internal.LifecycleModuleBuilder.buildProject (LifecycleModuleBuilder.java:117)
    at org.apache.maven.lifecycle.internal.LifecycleModuleBuilder.buildProject (LifecycleModuleBuilder.java:81)
    at org.apache.maven.lifecycle.internal.builder.singlethreaded.SingleThreadedBuilder.build
(SingleThreadedBuilder.java:56)
    at org.apache.maven.lifecycle.internal.LifecycleStarter.execute (LifecycleStarter.java:128)
    at org.apache.maven.DefaultMaven.doExecute (DefaultMaven.java:305)
    at org.apache.maven.DefaultMaven.doExecute (DefaultMaven.java:192)
    at org.apache.maven.DefaultMaven.execute (DefaultMaven.java:105)
    at org.jvnet.hudson.maven3.launcher.Maven35Launcher.main (Maven35Launcher.java:130)
    at sun.reflect.NativeMethodAccessorImpl.invoke0 (Native Method)
    at sun.reflect.NativeMethodAccessorImpl.invoke (NativeMethodAccessorImpl.java:62)
    at sun.reflect.DelegatingMethodAccessorImpl.invoke (DelegatingMethodAccessorImpl.java:43)
    at java.lang.reflect.Method.invoke (Method.java:498)
    at org.codehaus.plexus.classworlds.launcher.Launcher.launchEnhanced (Launcher.java:282)
    at org.codehaus.plexus.classworlds.launcher.Launcher.launch (Launcher.java:225)
    at jenkins.maven3.agent.Maven35Main.launch (Maven35Main.java:178)
    at sun.reflect.NativeMethodAccessorImpl.invoke0 (Native Method)
    at sun.reflect.NativeMethodAccessorImpl.invoke (NativeMethodAccessorImpl.java:62)
    at sun.reflect.DelegatingMethodAccessorImpl.invoke (DelegatingMethodAccessorImpl.java:43)
    at java.lang.reflect.Method.invoke (Method.java:498)
    at hudson.maven.Maven3Builder.call (Maven3Builder.java:139)
    at hudson.maven.Maven3Builder.call (Maven3Builder.java:70)
    at hudson.remoting.UserRequest.perform (UserRequest.java:212)
    at hudson.remoting.UserRequest.perform (UserRequest.java:54)
    at hudson.remoting.Request$2.run (Request.java:369)
    at hudson.remoting.InterceptingExecutorService$1.call (InterceptingExecutorService.java:72)
    at java.util.concurrent.FutureTask.run (FutureTask.java:266)
    at java.util.concurrent.ThreadPoolExecutor.runWorker (ThreadPoolExecutor.java:1149)
    at java.util.concurrent.ThreadPoolExecutor$Worker.run (ThreadPoolExecutor.java:624)
    at java.lang.Thread.run (Thread.java:748)
Caused by: org.apache.maven.wagon.TransferFailedException: Transfer failed for https://repository.apache.org/service/local/staging/deploy/maven2/org/apache/activemq/activemq-parent/5.16.0/activemq-parent-5.16.0.pom
401 Unauthorized
    at org.apache.maven.wagon.providers.http.wagon.shared.AbstractHttpClientWagon.put (AbstractHttpClientWagon.java:820)
    at org.apache.maven.wagon.providers.http.wagon.shared.AbstractHttpClientWagon.put (AbstractHttpClientWagon.java:737)
    at org.apache.maven.wagon.providers.http.wagon.shared.AbstractHttpClientWagon.put (AbstractHttpClientWagon.java:709)
    at org.apache.maven.wagon.providers.http.wagon.shared.AbstractHttpClientWagon.put (AbstractHttpClientWagon.java:703)
    at org.apache.maven.wagon.providers.http.wagon.shared.AbstractHttpClientWagon.put (AbstractHttpClientWagon.java:683)
    at org.eclipse.aether.transport.wagon.WagonTransporter$PutTaskRunner.run (WagonTransporter.java:686)
    at org.eclipse.aether.transport.wagon.WagonTransporter.execute (WagonTransporter.java:435)
    at org.eclipse.aether.transport.wagon.WagonTransporter.put (WagonTransporter.java:418)
    at org.eclipse.aether.connector.basic.BasicRepositoryConnector$PutTaskRunner.runTask (BasicRepositoryConnector.java:556)
    at org.eclipse.aether.connector.basic.BasicRepositoryConnector$TaskRunner.run (BasicRepositoryConnector.java:364)
    at org.eclipse.aether.connector.basic.BasicRepositoryConnector.put (BasicRepositoryConnector.java:288)
    at org.eclipse.aether.internal.impl.DefaultDeployer.deploy (DefaultDeployer.java:295)
    at org.eclipse.aether.internal.impl.DefaultDeployer.deploy (DefaultDeployer.java:213)
    at org.eclipse.aether.internal.impl.DefaultRepositorySystem.deploy (DefaultRepositorySystem.java:386)
    at org.apache.maven.artifact.deployer.DefaultArtifactDeployer.deploy (DefaultArtifactDeployer.java:142)
    at org.apache.maven.plugin.deploy.AbstractDeployMojo.deploy (AbstractDeployMojo.java:171)
    at org.apache.maven.plugin.deploy.DeployMojo.deployProject (DeployMojo.java:242)
    at org.apache.maven.plugin.deploy.DeployMojo.execute (DeployMojo.java:169)
    at org.apache.maven.plugin.DefaultBuildPluginManager.executeMojo (DefaultBuildPluginManager.java:137)
    at org.apache.maven.lifecycle.internal.MojoExecutor.execute (MojoExecutor.java:210)
    at org.apache.maven.lifecycle.internal.MojoExecutor.execute (MojoExecutor.java:156)
    at org.apache.maven.lifecycle.internal.MojoExecutor.execute (MojoExecutor.java:148)
    at org.apache.maven.lifecycle.internal.LifecycleModuleBuilder.buildProject (LifecycleModuleBuilder.java:117)
    at org.apache.maven.lifecycle.internal.LifecycleModuleBuilder.buildProject (LifecycleModuleBuilder.java:81)
    at org.apache.maven.lifecycle.internal.builder.singlethreaded.SingleThreadedBuilder.build
(SingleThreadedBuilder.java:56)
    at org.apache.maven.lifecycle.internal.LifecycleStarter.execute (LifecycleStarter.java:128)
    at org.apache.maven.DefaultMaven.doExecute (DefaultMaven.java:305)
    at org.apache.maven.DefaultMaven.doExecute (DefaultMaven.java:192)
    at org.apache.maven.DefaultMaven.execute (DefaultMaven.java:105)
    at org.jvnet.hudson.maven3.launcher.Maven35Launcher.main (Maven35Launcher.java:130)
    at sun.reflect.NativeMethodAccessorImpl.invoke0 (Native Method)
    at sun.reflect.NativeMethodAccessorImpl.invoke (NativeMethodAccessorImpl.java:62)
    at sun.reflect.DelegatingMethodAccessorImpl.invoke (DelegatingMethodAccessorImpl.java:43)
    at java.lang.reflect.Method.invoke (Method.java:498)
    at org.codehaus.plexus.classworlds.launcher.Launcher.launchEnhanced (Launcher.java:282)
    at org.codehaus.plexus.classworlds.launcher.Launcher.launch (Launcher.java:225)
    at jenkins.maven3.agent.Maven35Main.launch (Maven35Main.java:178)
    at sun.reflect.NativeMethodAccessorImpl.invoke0 (Native Method)
    at sun.reflect.NativeMethodAccessorImpl.invoke (NativeMethodAccessorImpl.java:62)
    at sun.reflect.DelegatingMethodAccessorImpl.invoke (DelegatingMethodAccessorImpl.java:43)
    at java.lang.reflect.Method.invoke (Method.java:498)
    at hudson.maven.Maven3Builder.call (Maven3Builder.java:139)
    at hudson.maven.Maven3Builder.call (Maven3Builder.java:70)
    at hudson.remoting.UserRequest.perform (UserRequest.java:212)
    at hudson.remoting.UserRequest.perform (UserRequest.java:54)
    at hudson.remoting.Request$2.run (Request.java:369)
    at hudson.remoting.InterceptingExecutorService$1.call (InterceptingExecutorService.java:72)
    at java.util.concurrent.FutureTask.run (FutureTask.java:266)
    at java.util.concurrent.ThreadPoolExecutor.runWorker (ThreadPoolExecutor.java:1149)
    at java.util.concurrent.ThreadPoolExecutor$Worker.run (ThreadPoolExecutor.java:624)
    at java.lang.Thread.run (Thread.java:748)
[ERROR] 
[ERROR] Re-run Maven using the -X switch to enable full debug logging.
[ERROR] 
[ERROR] For more information about the errors and possible solutions, please read the following
articles:
[ERROR] [Help 1] http://cwiki.apache.org/confluence/display/MAVEN/MojoExecutionException
[JENKINS] Archiving <https://builds.apache.org/job/ActiveMQ-Java8/ws/activemq-kahadb-store/pom.xml>
to org.apache.activemq/activemq-kahadb-store/5.16.0/activemq-kahadb-store-5.16.0.pom
[JENKINS] Archiving <https://builds.apache.org/job/ActiveMQ-Java8/ws/activemq-osgi/pom.xml>
to org.apache.activemq/activemq-osgi/5.16.0/activemq-osgi-5.16.0.pom
[JENKINS] Archiving <https://builds.apache.org/job/ActiveMQ-Java8/ws/activemq-unit-tests/pom.xml>
to org.apache.activemq/activemq-unit-tests/5.16.0/activemq-unit-tests-5.16.0.pom
[Fast Archiver] Compressed 71.81 KB of artifacts by 44.6% relative to #1606
[JENKINS] Archiving <https://builds.apache.org/job/ActiveMQ-Java8/ws/activemq-openwire-legacy/pom.xml>
to org.apache.activemq/activemq-openwire-legacy/5.16.0/activemq-openwire-legacy-5.16.0.pom
[JENKINS] Archiving <https://builds.apache.org/job/ActiveMQ-Java8/ws/activemq-karaf-itest/pom.xml>
to org.apache.activemq/activemq-karaf-itest/5.16.0/activemq-karaf-itest-5.16.0.pom
[JENKINS] Archiving <https://builds.apache.org/job/ActiveMQ-Java8/ws/activemq-rar/pom.xml>
to org.apache.activemq/activemq-rar/5.16.0/activemq-rar-5.16.0.pom
[JENKINS] Archiving <https://builds.apache.org/job/ActiveMQ-Java8/ws/activemq-http/pom.xml>
to org.apache.activemq/activemq-http/5.16.0/activemq-http-5.16.0.pom
[JENKINS] Archiving <https://builds.apache.org/job/ActiveMQ-Java8/ws/activemq-amqp/pom.xml>
to org.apache.activemq/activemq-amqp/5.16.0/activemq-amqp-5.16.0.pom
[JENKINS] Archiving <https://builds.apache.org/job/ActiveMQ-Java8/ws/activemq-client/pom.xml>
to org.apache.activemq/activemq-client/5.16.0/activemq-client-5.16.0.pom
[JENKINS] Archiving <https://builds.apache.org/job/ActiveMQ-Java8/ws/activemq-blueprint/pom.xml>
to org.apache.activemq/activemq-blueprint/5.16.0/activemq-blueprint-5.16.0.pom
[JENKINS] Archiving <https://builds.apache.org/job/ActiveMQ-Java8/ws/activemq-tooling/activemq-junit/pom.xml>
to org.apache.activemq.tooling/activemq-junit/5.16.0/activemq-junit-5.16.0.pom
[JENKINS] Archiving <https://builds.apache.org/job/ActiveMQ-Java8/ws/activemq-tooling/pom.xml>
to org.apache.activemq.tooling/activemq-tooling/5.16.0/activemq-tooling-5.16.0.pom
[JENKINS] Archiving <https://builds.apache.org/job/ActiveMQ-Java8/ws/activemq-jms-pool/pom.xml>
to org.apache.activemq/activemq-jms-pool/5.16.0/activemq-jms-pool-5.16.0.pom
[JENKINS] Archiving <https://builds.apache.org/job/ActiveMQ-Java8/ws/activemq-pool/pom.xml>
to org.apache.activemq/activemq-pool/5.16.0/activemq-pool-5.16.0.pom
[JENKINS] Archiving <https://builds.apache.org/job/ActiveMQ-Java8/ws/activemq-jdbc-store/pom.xml>
to org.apache.activemq/activemq-jdbc-store/5.16.0/activemq-jdbc-store-5.16.0.pom
[JENKINS] Archiving <https://builds.apache.org/job/ActiveMQ-Java8/ws/activemq-camel/pom.xml>
to org.apache.activemq/activemq-camel/5.16.0/activemq-camel-5.16.0.pom
[JENKINS] Archiving <https://builds.apache.org/job/ActiveMQ-Java8/ws/activemq-runtime-config/pom.xml>
to org.apache.activemq/activemq-runtime-config/5.16.0/activemq-runtime-config-5.16.0.pom
[JENKINS] Archiving <https://builds.apache.org/job/ActiveMQ-Java8/ws/pom.xml> to org.apache.activemq/activemq-parent/5.16.0/activemq-parent-5.16.0.pom
[JENKINS] Archiving <https://builds.apache.org/job/ActiveMQ-Java8/ws/activemq-stomp/pom.xml>
to org.apache.activemq/activemq-stomp/5.16.0/activemq-stomp-5.16.0.pom
[JENKINS] Archiving <https://builds.apache.org/job/ActiveMQ-Java8/ws/activemq-openwire-generator/pom.xml>
to org.apache.activemq/activemq-openwire-generator/5.16.0/activemq-openwire-generator-5.16.0.pom
[JENKINS] Archiving <https://builds.apache.org/job/ActiveMQ-Java8/ws/activemq-broker/pom.xml>
to org.apache.activemq/activemq-broker/5.16.0/activemq-broker-5.16.0.pom
[JENKINS] Archiving <https://builds.apache.org/job/ActiveMQ-Java8/ws/activemq-web-demo/pom.xml>
to org.apache.activemq/activemq-web-demo/5.16.0/activemq-web-demo-5.16.0.pom
[JENKINS] Archiving <https://builds.apache.org/job/ActiveMQ-Java8/ws/activemq-mqtt/pom.xml>
to org.apache.activemq/activemq-mqtt/5.16.0/activemq-mqtt-5.16.0.pom
[JENKINS] Archiving <https://builds.apache.org/job/ActiveMQ-Java8/ws/activemq-shiro/pom.xml>
to org.apache.activemq/activemq-shiro/5.16.0/activemq-shiro-5.16.0.pom
[JENKINS] Archiving <https://builds.apache.org/job/ActiveMQ-Java8/ws/activemq-tooling/activemq-perf-maven-plugin/pom.xml>
to org.apache.activemq.tooling/activemq-perf-maven-plugin/5.16.0/activemq-perf-maven-plugin-5.16.0.pom
[JENKINS] Archiving <https://builds.apache.org/job/ActiveMQ-Java8/ws/activemq-run/pom.xml>
to org.apache.activemq/activemq-run/5.16.0/activemq-run-5.16.0.pom
[JENKINS] Archiving <https://builds.apache.org/job/ActiveMQ-Java8/ws/activemq-tooling/activemq-maven-plugin/pom.xml>
to org.apache.activemq.tooling/activemq-maven-plugin/5.16.0/activemq-maven-plugin-5.16.0.pom
[JENKINS] Archiving <https://builds.apache.org/job/ActiveMQ-Java8/ws/activemq-karaf/pom.xml>
to org.apache.activemq/activemq-karaf/5.16.0/activemq-karaf-5.16.0.pom
[JENKINS] Archiving <https://builds.apache.org/job/ActiveMQ-Java8/ws/activemq-web-console/pom.xml>
to org.apache.activemq/activemq-web-console/5.16.0/activemq-web-console-5.16.0.pom
[JENKINS] Archiving <https://builds.apache.org/job/ActiveMQ-Java8/ws/activemq-jaas/pom.xml>
to org.apache.activemq/activemq-jaas/5.16.0/activemq-jaas-5.16.0.pom
[JENKINS] Archiving <https://builds.apache.org/job/ActiveMQ-Java8/ws/activemq-itests-spring31/pom.xml>
to org.apache.activemq/activemq-itests-spring31/5.16.0/activemq-itests-spring31-5.16.0.pom
[JENKINS] Archiving <https://builds.apache.org/job/ActiveMQ-Java8/ws/activemq-tooling/activemq-memtest-maven-plugin/pom.xml>
to org.apache.activemq.tooling/activemq-memtest-maven-plugin/5.16.0/activemq-memtest-maven-plugin-5.16.0.pom
[JENKINS] Archiving <https://builds.apache.org/job/ActiveMQ-Java8/ws/activemq-ra/pom.xml>
to org.apache.activemq/activemq-ra/5.16.0/activemq-ra-5.16.0.pom
[JENKINS] Archiving <https://builds.apache.org/job/ActiveMQ-Java8/ws/activemq-partition/pom.xml>
to org.apache.activemq/activemq-partition/5.16.0/activemq-partition-5.16.0.pom
[JENKINS] Archiving <https://builds.apache.org/job/ActiveMQ-Java8/ws/activemq-all/pom.xml>
to org.apache.activemq/activemq-all/5.16.0/activemq-all-5.16.0.pom
[JENKINS] Archiving <https://builds.apache.org/job/ActiveMQ-Java8/ws/assembly/pom.xml>
to org.apache.activemq/apache-activemq/5.16.0/apache-activemq-5.16.0.pom
[JENKINS] Archiving <https://builds.apache.org/job/ActiveMQ-Java8/ws/activemq-console/pom.xml>
to org.apache.activemq/activemq-console/5.16.0/activemq-console-5.16.0.pom
[JENKINS] Archiving <https://builds.apache.org/job/ActiveMQ-Java8/ws/activemq-spring/pom.xml>
to org.apache.activemq/activemq-spring/5.16.0/activemq-spring-5.16.0.pom
[JENKINS] Archiving <https://builds.apache.org/job/ActiveMQ-Java8/ws/activemq-cf/pom.xml>
to org.apache.activemq/activemq-cf/5.16.0/activemq-cf-5.16.0.pom
[JENKINS] Archiving <https://builds.apache.org/job/ActiveMQ-Java8/ws/activemq-leveldb-store/pom.xml>
to org.apache.activemq/activemq-leveldb-store/5.16.0/activemq-leveldb-store-5.16.0.pom
[JENKINS] Archiving <https://builds.apache.org/job/ActiveMQ-Java8/ws/activemq-web/pom.xml>
to org.apache.activemq/activemq-web/5.16.0/activemq-web-5.16.0.pom
[JENKINS] Archiving <https://builds.apache.org/job/ActiveMQ-Java8/ws/activemq-log4j-appender/pom.xml>
to org.apache.activemq/activemq-log4j-appender/5.16.0/activemq-log4j-appender-5.16.0.pom
No mail will be sent out, as 'ActiveMQ-Java8 » ActiveMQ :: KahaDB Store #1607' does not
have a result yet. Please make sure you set a proper result in case of pipeline/build scripts.
No mail will be sent out, as 'ActiveMQ-Java8 » ActiveMQ :: OSGi bundle #1607' does not
have a result yet. Please make sure you set a proper result in case of pipeline/build scripts.
No mail will be sent out, as 'ActiveMQ-Java8 » ActiveMQ :: Unit Tests #1607' does not have
a result yet. Please make sure you set a proper result in case of pipeline/build scripts.
No mail will be sent out, as 'ActiveMQ-Java8 » ActiveMQ :: Openwire Legacy Support #1607'
does not have a result yet. Please make sure you set a proper result in case of pipeline/build
scripts.
No mail will be sent out, as 'ActiveMQ-Java8 » ActiveMQ :: Karaf Integration Tests #1607'
does not have a result yet. Please make sure you set a proper result in case of pipeline/build
scripts.
No mail will be sent out, as 'ActiveMQ-Java8 » ActiveMQ :: RAR #1607' does not have a result
yet. Please make sure you set a proper result in case of pipeline/build scripts.
No mail will be sent out, as 'ActiveMQ-Java8 » ActiveMQ :: HTTP Protocol Support #1607'
does not have a result yet. Please make sure you set a proper result in case of pipeline/build
scripts.
No mail will be sent out, as 'ActiveMQ-Java8 » ActiveMQ :: AMQP #1607' does not have a
result yet. Please make sure you set a proper result in case of pipeline/build scripts.
No mail will be sent out, as 'ActiveMQ-Java8 » ActiveMQ :: Client #1607' does not have
a result yet. Please make sure you set a proper result in case of pipeline/build scripts.
No mail will be sent out, as 'ActiveMQ-Java8 » ActiveMQ :: Blueprint #1607' does not have
a result yet. Please make sure you set a proper result in case of pipeline/build scripts.
No mail will be sent out, as 'ActiveMQ-Java8 » ActiveMQ :: JUnit Rule #1607' does not have
a result yet. Please make sure you set a proper result in case of pipeline/build scripts.
No mail will be sent out, as 'ActiveMQ-Java8 » ActiveMQ :: Tooling #1607' does not have
a result yet. Please make sure you set a proper result in case of pipeline/build scripts.
No mail will be sent out, as 'ActiveMQ-Java8 » ActiveMQ :: Generic JMS Pool #1607' does
not have a result yet. Please make sure you set a proper result in case of pipeline/build
scripts.
No mail will be sent out, as 'ActiveMQ-Java8 » ActiveMQ :: Pool #1607' does not have a
result yet. Please make sure you set a proper result in case of pipeline/build scripts.
No mail will be sent out, as 'ActiveMQ-Java8 » ActiveMQ :: JDBC Store #1607' does not have
a result yet. Please make sure you set a proper result in case of pipeline/build scripts.
No mail will be sent out, as 'ActiveMQ-Java8 » ActiveMQ :: Camel #1607' does not have a
result yet. Please make sure you set a proper result in case of pipeline/build scripts.
No mail will be sent out, as 'ActiveMQ-Java8 » ActiveMQ :: Runtime Configuration #1607'
does not have a result yet. Please make sure you set a proper result in case of pipeline/build
scripts.
Sending e-mails to: commits@activemq.apache.org
No mail will be sent out, as 'ActiveMQ-Java8 » ActiveMQ :: STOMP Protocol #1607' does not
have a result yet. Please make sure you set a proper result in case of pipeline/build scripts.
No mail will be sent out, as 'ActiveMQ-Java8 » ActiveMQ :: Openwire Generator #1607' does
not have a result yet. Please make sure you set a proper result in case of pipeline/build
scripts.
No mail will be sent out, as 'ActiveMQ-Java8 » ActiveMQ :: Broker #1607' does not have
a result yet. Please make sure you set a proper result in case of pipeline/build scripts.
No mail will be sent out, as 'ActiveMQ-Java8 » ActiveMQ :: Web Demo #1607' does not have
a result yet. Please make sure you set a proper result in case of pipeline/build scripts.
No mail will be sent out, as 'ActiveMQ-Java8 » ActiveMQ :: MQTT Protocol #1607' does not
have a result yet. Please make sure you set a proper result in case of pipeline/build scripts.
No mail will be sent out, as 'ActiveMQ-Java8 » ActiveMQ :: Shiro #1607' does not have a
result yet. Please make sure you set a proper result in case of pipeline/build scripts.
No mail will be sent out, as 'ActiveMQ-Java8 » ActiveMQ :: Performance Test Plugin #1607'
does not have a result yet. Please make sure you set a proper result in case of pipeline/build
scripts.
No mail will be sent out, as 'ActiveMQ-Java8 » ActiveMQ :: Run Jar #1607' does not have
a result yet. Please make sure you set a proper result in case of pipeline/build scripts.
No mail will be sent out, as 'ActiveMQ-Java8 » ActiveMQ :: StartUp/Stop Plugin #1607' does
not have a result yet. Please make sure you set a proper result in case of pipeline/build
scripts.
No mail will be sent out, as 'ActiveMQ-Java8 » ActiveMQ :: Apache Karaf #1607' does not
have a result yet. Please make sure you set a proper result in case of pipeline/build scripts.
No mail will be sent out, as 'ActiveMQ-Java8 » ActiveMQ :: Web Console #1607' does not
have a result yet. Please make sure you set a proper result in case of pipeline/build scripts.
No mail will be sent out, as 'ActiveMQ-Java8 » ActiveMQ :: JAAS #1607' does not have a
result yet. Please make sure you set a proper result in case of pipeline/build scripts.
No mail will be sent out, as 'ActiveMQ-Java8 » ActiveMQ :: Integration Test :: Spring 3.1
#1607' does not have a result yet. Please make sure you set a proper result in case of pipeline/build
scripts.
No mail will be sent out, as 'ActiveMQ-Java8 » ActiveMQ :: Memory Usage Test Plugin #1607'
does not have a result yet. Please make sure you set a proper result in case of pipeline/build
scripts.
No mail will be sent out, as 'ActiveMQ-Java8 » ActiveMQ :: RA #1607' does not have a result
yet. Please make sure you set a proper result in case of pipeline/build scripts.
No mail will be sent out, as 'ActiveMQ-Java8 » ActiveMQ :: Partition Management #1607'
does not have a result yet. Please make sure you set a proper result in case of pipeline/build
scripts.
No mail will be sent out, as 'ActiveMQ-Java8 » ActiveMQ :: All JAR bundle #1607' does not
have a result yet. Please make sure you set a proper result in case of pipeline/build scripts.
No mail will be sent out, as 'ActiveMQ-Java8 » ActiveMQ :: Assembly #1607' does not have
a result yet. Please make sure you set a proper result in case of pipeline/build scripts.
No mail will be sent out, as 'ActiveMQ-Java8 » ActiveMQ :: Console #1607' does not have
a result yet. Please make sure you set a proper result in case of pipeline/build scripts.
No mail will be sent out, as 'ActiveMQ-Java8 » ActiveMQ :: Spring #1607' does not have
a result yet. Please make sure you set a proper result in case of pipeline/build scripts.
No mail will be sent out, as 'ActiveMQ-Java8 » ActiveMQ :: ConnectionFactory #1607' does
not have a result yet. Please make sure you set a proper result in case of pipeline/build
scripts.
No mail will be sent out, as 'ActiveMQ-Java8 » ActiveMQ :: LevelDB Store #1607' does not
have a result yet. Please make sure you set a proper result in case of pipeline/build scripts.
No mail will be sent out, as 'ActiveMQ-Java8 » ActiveMQ :: Web #1607' does not have a result
yet. Please make sure you set a proper result in case of pipeline/build scripts.
No mail will be sent out, as 'ActiveMQ-Java8 » ActiveMQ :: Log4j Appender #1607' does not
have a result yet. Please make sure you set a proper result in case of pipeline/build scripts.
[locks-and-latches] Releasing all the locks
[locks-and-latches] All the locks released
channel stopped

Mime
View raw message