apr-bugs mailing list archives

Site index · List index
Message view « Date » · « Thread »
Top « Date » · « Thread »
From bugzi...@apache.org
Subject DO NOT REPLY [Bug 50269] testsock fails - Determine whether at EOF, #1 (20014): Internal error
Date Mon, 27 Feb 2012 09:12:39 GMT
https://issues.apache.org/bugzilla/show_bug.cgi?id=50269

--- Comment #3 from Peter West <lists@pbw.id.au> 2012-02-27 09:12:39 UTC ---
This bug is still present in 1.4.6. Mac OS X 10.7 (Lion)

Note that neither apr 1.4.6 nor OS X 10.7 are available in Bugzilla.


testsock            : FAILED 1 of 9
testsockets         : SUCCESS
testsockopt         : SUCCESS
teststr             : SUCCESS
teststrnatcmp       : SUCCESS
testtable           : SUCCESS
testtemp            : SUCCESS
testthread          : SUCCESS
testtime            : SUCCESS
testud              : SUCCESS
testuser            : SUCCESS
testvsn             : SUCCESS
Failed Tests           Total    Fail    Failed %
===================================================
testsock                   9       1     11.11%
Programs failed: testall
make[1]: *** [check] Error 1
make: *** [check] Error 2

-- 
Configure bugmail: https://issues.apache.org/bugzilla/userprefs.cgi?tab=email
------- You are receiving this mail because: -------
You are the assignee for the bug.

---------------------------------------------------------------------
To unsubscribe, e-mail: bugs-unsubscribe@apr.apache.org
For additional commands, e-mail: bugs-help@apr.apache.org


Mime
View raw message