aries-dev mailing list archives

Site index · List index
Message view « Date » · « Thread »
Top « Date » · « Thread »
From Apache Hudson Server <hud...@hudson.zones.apache.org>
Subject Build failed in Hudson: Aries #567
Date Thu, 01 Jul 2010 16:59:54 GMT
See <http://hudson.zones.apache.org/hudson/job/Aries/567/changes>

Changes:

[mnuttall] ARIES-344: BundleConverter interface returns one-use-only inputstream

[mnuttall] ARIES-344: BundleConverter interface returns one-use-only inputstream

------------------------------------------
[...truncated 6064 lines...]
[INFO] Installing <http://hudson.zones.apache.org/hudson/job/Aries/ws/aries/application/application-api/target/org.apache.aries.application.api-0.2-incubating-SNAPSHOT.jar>
to /home/hudson/.m2/repository/org/apache/aries/application/org.apache.aries.application.api/0.2-incubating-SNAPSHOT/org.apache.aries.application.api-0.2-incubating-SNAPSHOT.jar
[INFO] [bundle:install {execution: default-install}]
[INFO] Parsing file:/home/hudson/.m2/repository/repository.xml
[Fatal Error] repository.xml:3:1: Premature end of file.
org.xml.sax.SAXParseException: Premature end of file.
	at com.sun.org.apache.xerces.internal.parsers.DOMParser.parse(DOMParser.java:249)
	at com.sun.org.apache.xerces.internal.jaxp.DocumentBuilderImpl.parse(DocumentBuilderImpl.java:284)
	at javax.xml.parsers.DocumentBuilder.parse(DocumentBuilder.java:208)
	at org.apache.felix.obrplugin.ObrUpdate.parseFile(ObrUpdate.java:347)
	at org.apache.felix.obrplugin.ObrUpdate.parseRepositoryXml(ObrUpdate.java:324)
	at org.apache.felix.obrplugin.ObrInstall.execute(ObrInstall.java:140)
	at org.apache.maven.plugin.DefaultPluginManager.executeMojo(DefaultPluginManager.java:490)
	at hudson.maven.agent.PluginManagerInterceptor.executeMojo(PluginManagerInterceptor.java:182)
	at org.apache.maven.lifecycle.DefaultLifecycleExecutor.executeGoals(DefaultLifecycleExecutor.java:694)
	at org.apache.maven.lifecycle.DefaultLifecycleExecutor.executeGoalWithLifecycle(DefaultLifecycleExecutor.java:556)
	at org.apache.maven.lifecycle.DefaultLifecycleExecutor.executeGoal(DefaultLifecycleExecutor.java:535)
	at org.apache.maven.lifecycle.DefaultLifecycleExecutor.executeGoalAndHandleFailures(DefaultLifecycleExecutor.java:387)
	at org.apache.maven.lifecycle.DefaultLifecycleExecutor.executeTaskSegments(DefaultLifecycleExecutor.java:348)
	at org.apache.maven.lifecycle.DefaultLifecycleExecutor.execute(DefaultLifecycleExecutor.java:180)
	at org.apache.maven.lifecycle.LifecycleExecutorInterceptor.execute(LifecycleExecutorInterceptor.java:65)
	at org.apache.maven.DefaultMaven.doExecute(DefaultMaven.java:328)
	at org.apache.maven.DefaultMaven.execute(DefaultMaven.java:138)
	at org.apache.maven.cli.MavenCli.main(MavenCli.java:362)
	at sun.reflect.NativeMethodAccessorImpl.invoke0(Native Method)
	at sun.reflect.NativeMethodAccessorImpl.invoke(NativeMethodAccessorImpl.java:39)
	at sun.reflect.DelegatingMethodAccessorImpl.invoke(DelegatingMethodAccessorImpl.java:25)
	at java.lang.reflect.Method.invoke(Method.java:597)
	at org.codehaus.classworlds.Launcher.launchEnhanced(Launcher.java:315)
	at org.codehaus.classworlds.Launcher.launch(Launcher.java:255)
	at hudson.maven.agent.Main.launch(Main.java:165)
	at hudson.maven.MavenBuilder.call(MavenBuilder.java:159)
	at hudson.maven.MavenModuleSetBuild$Builder.call(MavenModuleSetBuild.java:688)
	at hudson.maven.MavenModuleSetBuild$Builder.call(MavenModuleSetBuild.java:632)
	at hudson.remoting.UserRequest.perform(UserRequest.java:114)
	at hudson.remoting.UserRequest.perform(UserRequest.java:48)
	at hudson.remoting.Request$2.run(Request.java:270)
	at java.util.concurrent.Executors$RunnableAdapter.call(Executors.java:441)
	at java.util.concurrent.FutureTask$Sync.innerRun(FutureTask.java:303)
	at java.util.concurrent.FutureTask.run(FutureTask.java:138)
	at java.util.concurrent.ThreadPoolExecutor$Worker.runTask(ThreadPoolExecutor.java:886)
	at java.util.concurrent.ThreadPoolExecutor$Worker.run(ThreadPoolExecutor.java:908)
	at java.lang.Thread.run(Thread.java:619)
[INFO] Writing OBR metadata
[HUDSON] Archiving <http://hudson.zones.apache.org/hudson/job/Aries/ws/aries/application/application-api/pom.xml>
to /export/home/hudson/hudson/jobs/Aries/modules/org.apache.aries.application$org.apache.aries.application.api/builds/2010-07-01_16-52-50/archive/org.apache.aries.application/org.apache.aries.application.api/0.2-incubating-SNAPSHOT/pom.xml
[HUDSON] Archiving <http://hudson.zones.apache.org/hudson/job/Aries/ws/aries/application/application-api/target/org.apache.aries.application.api-0.2-incubating-SNAPSHOT.jar>
to /export/home/hudson/hudson/jobs/Aries/modules/org.apache.aries.application$org.apache.aries.application.api/builds/2010-07-01_16-52-50/archive/org.apache.aries.application/org.apache.aries.application.api/0.2-incubating-SNAPSHOT/org.apache.aries.application.api-0.2-incubating-SNAPSHOT.jar
[INFO] ------------------------------------------------------------------------
[INFO] Building Apache Aries Application Utils
[INFO]    task-segment: [clean, install]
[INFO] ------------------------------------------------------------------------
[INFO] [clean:clean {execution: default-clean}]
[INFO] snapshot org.apache.aries.application:org.apache.aries.application.api:0.2-incubating-SNAPSHOT:
checking for updates from codehaus.snapshots
[INFO] snapshot org.apache.aries.application:org.apache.aries.application.api:0.2-incubating-SNAPSHOT:
checking for updates from apache.snapshots
[INFO] [enforcer:enforce {execution: default}]
[INFO] [antrun:run {execution: create-prop}]
[INFO] Executing tasks
     [echo] Maven version: 0.2-incubating-SNAPSHOT
     [echo] OSGi version: 0.2.0.incubating-SNAPSHOT
    [mkdir] Created dir: <http://hudson.zones.apache.org/hudson/job/Aries/ws/aries/application/application-utils/target>
[INFO] Executed tasks
[INFO] [properties:read-project-properties {execution: default}]
[INFO] [remote-resources:process {execution: default}]
[INFO] [resources:resources {execution: default-resources}]
[INFO] Using 'UTF-8' encoding to copy filtered resources.
[INFO] Copying 2 resources
[INFO] skip non existing resourceDirectory <http://hudson.zones.apache.org/hudson/job/Aries/ws/aries/application/application-utils/src/main/filtered-resources>
[INFO] Copying 4 resources
[INFO] [compiler:compile {execution: default-compile}]
[INFO] Compiling 21 source files to <http://hudson.zones.apache.org/hudson/job/Aries/ws/aries/application/application-utils/target/classes>
[INFO] [resources:testResources {execution: default-testResources}]
[INFO] Using 'UTF-8' encoding to copy filtered resources.
[INFO] Copying 9 resources
[INFO] skip non existing resourceDirectory <http://hudson.zones.apache.org/hudson/job/Aries/ws/aries/application/application-utils/src/test/filtered-resources>
[INFO] Copying 4 resources
[INFO] [compiler:testCompile {execution: default-testCompile}]
[INFO] Compiling 8 source files to <http://hudson.zones.apache.org/hudson/job/Aries/ws/aries/application/application-utils/target/test-classes>
[WARNING] <http://hudson.zones.apache.org/hudson/job/Aries/ws/aries/application/application-utils/src/test/java/org/apache/aries/application/utils/filesystem/IOUtilsTest.java>:[31,14]
[deprecation] java.io.StringBufferInputStream in java.io has been deprecated

[WARNING] <http://hudson.zones.apache.org/hudson/job/Aries/ws/aries/application/application-utils/src/test/java/org/apache/aries/application/utils/filesystem/IOUtilsTest.java>:[70,47]
[deprecation] java.io.StringBufferInputStream in java.io has been deprecated

[WARNING] <http://hudson.zones.apache.org/hudson/job/Aries/ws/aries/application/application-utils/src/test/java/org/apache/aries/application/utils/filesystem/IOUtilsTest.java>:[71,72]
[deprecation] java.io.StringBufferInputStream in java.io has been deprecated

[WARNING] <http://hudson.zones.apache.org/hudson/job/Aries/ws/aries/application/application-utils/src/test/java/org/apache/aries/application/utils/filesystem/IOUtilsTest.java>:[72,73]
[deprecation] java.io.StringBufferInputStream in java.io has been deprecated

[INFO] [surefire:test {execution: default-test}]
[INFO] Surefire report directory: <http://hudson.zones.apache.org/hudson/job/Aries/ws/aries/application/application-utils/target/surefire-reports>

-------------------------------------------------------
 T E S T S
-------------------------------------------------------
Running org.apache.aries.application.impl.VersionRangeTest
Tests run: 10, Failures: 0, Errors: 0, Skipped: 0, Time elapsed: 0.098 sec
Running org.apache.aries.application.impl.ApplicationMetadataImplTest
Tests run: 1, Failures: 0, Errors: 0, Skipped: 0, Time elapsed: 0.013 sec
Running org.apache.aries.application.utils.manifest.BundleManifestTest
Tests run: 2, Failures: 0, Errors: 0, Skipped: 0, Time elapsed: 0.019 sec
Running org.apache.aries.application.utils.filesystem.FileSystemTest
Tests run: 4, Failures: 0, Errors: 0, Skipped: 0, Time elapsed: 0.028 sec
Running org.apache.aries.application.utils.filesystem.IOUtilsTest
Tests run: 2, Failures: 0, Errors: 0, Skipped: 0, Time elapsed: 0.017 sec
Running org.apache.aries.application.utils.manifest.ManifestProcessorTest
Tests run: 4, Failures: 0, Errors: 0, Skipped: 0, Time elapsed: 0.008 sec
Running org.apache.aries.application.utils.manifest.ManifestHeaderProcessorTest
Tests run: 11, Failures: 0, Errors: 0, Skipped: 0, Time elapsed: 0.016 sec
Running org.apache.aries.application.impl.DeploymentContentImplTest
Tests run: 3, Failures: 0, Errors: 0, Skipped: 0, Time elapsed: 0.006 sec

Results :

Tests run: 37, Failures: 0, Errors: 0, Skipped: 0

[HUDSON] Recording test results
[INFO] [bundle:bundle {execution: default-bundle}]
[INFO] [ianal:verify-legal-files {execution: default}]
[INFO] Checking legal files in: org.apache.aries.application.utils-0.2-incubating-SNAPSHOT.jar
[INFO] [install:install {execution: default-install}]
[INFO] Installing <http://hudson.zones.apache.org/hudson/job/Aries/ws/aries/application/application-utils/target/org.apache.aries.application.utils-0.2-incubating-SNAPSHOT.jar>
to /home/hudson/.m2/repository/org/apache/aries/application/org.apache.aries.application.utils/0.2-incubating-SNAPSHOT/org.apache.aries.application.utils-0.2-incubating-SNAPSHOT.jar
[INFO] [bundle:install {execution: default-install}]
[INFO] Parsing file:/home/hudson/.m2/repository/repository.xml
[Fatal Error] repository.xml:3:1: Premature end of file.
org.xml.sax.SAXParseException: Premature end of file.
	at com.sun.org.apache.xerces.internal.parsers.DOMParser.parse(DOMParser.java:249)
	at com.sun.org.apache.xerces.internal.jaxp.DocumentBuilderImpl.parse(DocumentBuilderImpl.java:284)
	at javax.xml.parsers.DocumentBuilder.parse(DocumentBuilder.java:208)
	at org.apache.felix.obrplugin.ObrUpdate.parseFile(ObrUpdate.java:347)
	at org.apache.felix.obrplugin.ObrUpdate.parseRepositoryXml(ObrUpdate.java:324)
	at org.apache.felix.obrplugin.ObrInstall.execute(ObrInstall.java:140)
	at org.apache.maven.plugin.DefaultPluginManager.executeMojo(DefaultPluginManager.java:490)
	at hudson.maven.agent.PluginManagerInterceptor.executeMojo(PluginManagerInterceptor.java:182)
	at org.apache.maven.lifecycle.DefaultLifecycleExecutor.executeGoals(DefaultLifecycleExecutor.java:694)
	at org.apache.maven.lifecycle.DefaultLifecycleExecutor.executeGoalWithLifecycle(DefaultLifecycleExecutor.java:556)
	at org.apache.maven.lifecycle.DefaultLifecycleExecutor.executeGoal(DefaultLifecycleExecutor.java:535)
	at org.apache.maven.lifecycle.DefaultLifecycleExecutor.executeGoalAndHandleFailures(DefaultLifecycleExecutor.java:387)
	at org.apache.maven.lifecycle.DefaultLifecycleExecutor.executeTaskSegments(DefaultLifecycleExecutor.java:348)
	at org.apache.maven.lifecycle.DefaultLifecycleExecutor.execute(DefaultLifecycleExecutor.java:180)
	at org.apache.maven.lifecycle.LifecycleExecutorInterceptor.execute(LifecycleExecutorInterceptor.java:65)
	at org.apache.maven.DefaultMaven.doExecute(DefaultMaven.java:328)
	at org.apache.maven.DefaultMaven.execute(DefaultMaven.java:138)
	at org.apache.maven.cli.MavenCli.main(MavenCli.java:362)
	at sun.reflect.NativeMethodAccessorImpl.invoke0(Native Method)
	at sun.reflect.NativeMethodAccessorImpl.invoke(NativeMethodAccessorImpl.java:39)
	at sun.reflect.DelegatingMethodAccessorImpl.invoke(DelegatingMethodAccessorImpl.java:25)
	at java.lang.reflect.Method.invoke(Method.java:597)
	at org.codehaus.classworlds.Launcher.launchEnhanced(Launcher.java:315)
	at org.codehaus.classworlds.Launcher.launch(Launcher.java:255)
	at hudson.maven.agent.Main.launch(Main.java:165)
	at hudson.maven.MavenBuilder.call(MavenBuilder.java:159)
	at hudson.maven.MavenModuleSetBuild$Builder.call(MavenModuleSetBuild.java:688)
	at hudson.maven.MavenModuleSetBuild$Builder.call(MavenModuleSetBuild.java:632)
	at hudson.remoting.UserRequest.perform(UserRequest.java:114)
	at hudson.remoting.UserRequest.perform(UserRequest.java:48)
	at hudson.remoting.Request$2.run(Request.java:270)
	at java.util.concurrent.Executors$RunnableAdapter.call(Executors.java:441)
	at java.util.concurrent.FutureTask$Sync.innerRun(FutureTask.java:303)
	at java.util.concurrent.FutureTask.run(FutureTask.java:138)
	at java.util.concurrent.ThreadPoolExecutor$Worker.runTask(ThreadPoolExecutor.java:886)
	at java.util.concurrent.ThreadPoolExecutor$Worker.run(ThreadPoolExecutor.java:908)
	at java.lang.Thread.run(Thread.java:619)
[INFO] Writing OBR metadata
[HUDSON] Archiving <http://hudson.zones.apache.org/hudson/job/Aries/ws/aries/application/application-utils/pom.xml>
to /export/home/hudson/hudson/jobs/Aries/modules/org.apache.aries.application$org.apache.aries.application.utils/builds/2010-07-01_16-52-50/archive/org.apache.aries.application/org.apache.aries.application.utils/0.2-incubating-SNAPSHOT/pom.xml
[HUDSON] Archiving <http://hudson.zones.apache.org/hudson/job/Aries/ws/aries/application/application-utils/target/org.apache.aries.application.utils-0.2-incubating-SNAPSHOT.jar>
to /export/home/hudson/hudson/jobs/Aries/modules/org.apache.aries.application$org.apache.aries.application.utils/builds/2010-07-01_16-52-50/archive/org.apache.aries.application/org.apache.aries.application.utils/0.2-incubating-SNAPSHOT/org.apache.aries.application.utils-0.2-incubating-SNAPSHOT.jar
[INFO] ------------------------------------------------------------------------
[INFO] Building Apache Aries Application Management
[INFO]    task-segment: [clean, install]
[INFO] ------------------------------------------------------------------------
[INFO] [clean:clean {execution: default-clean}]
[INFO] snapshot org.apache.aries.application:org.apache.aries.application.utils:0.2-incubating-SNAPSHOT:
checking for updates from codehaus.snapshots
[INFO] snapshot org.apache.aries.application:org.apache.aries.application.utils:0.2-incubating-SNAPSHOT:
checking for updates from apache.snapshots
[INFO] [enforcer:enforce {execution: default}]
[INFO] [antrun:run {execution: create-prop}]
[INFO] Executing tasks
     [echo] Maven version: 0.2-incubating-SNAPSHOT
     [echo] OSGi version: 0.2.0.incubating-SNAPSHOT
    [mkdir] Created dir: <http://hudson.zones.apache.org/hudson/job/Aries/ws/aries/application/application-management/target>
[INFO] Executed tasks
[INFO] [properties:read-project-properties {execution: default}]
[INFO] [remote-resources:process {execution: default}]
[INFO] [resources:resources {execution: default-resources}]
[INFO] Using 'UTF-8' encoding to copy filtered resources.
[INFO] Copying 2 resources
[INFO] skip non existing resourceDirectory <http://hudson.zones.apache.org/hudson/job/Aries/ws/aries/application/application-management/src/main/filtered-resources>
[INFO] Copying 4 resources
[INFO] [compiler:compile {execution: default-compile}]
[INFO] Compiling 3 source files to <http://hudson.zones.apache.org/hudson/job/Aries/ws/aries/application/application-management/target/classes>
[HUDSON] Archiving <http://hudson.zones.apache.org/hudson/job/Aries/ws/aries/application/application-management/pom.xml>
to /export/home/hudson/hudson/jobs/Aries/modules/org.apache.aries.application$org.apache.aries.application.management/builds/2010-07-01_16-52-51/archive/org.apache.aries.application/org.apache.aries.application.management/0.2-incubating-SNAPSHOT/pom.xml
[INFO] ------------------------------------------------------------------------
[ERROR] BUILD FAILURE
[INFO] ------------------------------------------------------------------------
[INFO] Compilation failure
<http://hudson.zones.apache.org/hudson/job/Aries/ws/aries/application/application-management/src/main/java/org/apache/aries/application/management/impl/AriesApplicationManagerImpl.java>:[157,59]
incompatible types
found   : org.apache.aries.application.management.BundleConversion
required: java.io.InputStream


[INFO] ------------------------------------------------------------------------
[INFO] Trace
org.apache.maven.BuildFailureException: Compilation failure
<http://hudson.zones.apache.org/hudson/job/Aries/ws/aries/application/application-management/src/main/java/org/apache/aries/application/management/impl/AriesApplicationManagerImpl.java>:[157,59]
incompatible types
found   : org.apache.aries.application.management.BundleConversion
required: java.io.InputStream


	at org.apache.maven.lifecycle.DefaultLifecycleExecutor.executeGoals(DefaultLifecycleExecutor.java:715)
	at org.apache.maven.lifecycle.DefaultLifecycleExecutor.executeGoalWithLifecycle(DefaultLifecycleExecutor.java:556)
	at org.apache.maven.lifecycle.DefaultLifecycleExecutor.executeGoal(DefaultLifecycleExecutor.java:535)
	at org.apache.maven.lifecycle.DefaultLifecycleExecutor.executeGoalAndHandleFailures(DefaultLifecycleExecutor.java:387)
	at org.apache.maven.lifecycle.DefaultLifecycleExecutor.executeTaskSegments(DefaultLifecycleExecutor.java:348)
	at org.apache.maven.lifecycle.DefaultLifecycleExecutor.execute(DefaultLifecycleExecutor.java:180)
	at org.apache.maven.lifecycle.LifecycleExecutorInterceptor.execute(LifecycleExecutorInterceptor.java:65)
	at org.apache.maven.DefaultMaven.doExecute(DefaultMaven.java:328)
	at org.apache.maven.DefaultMaven.execute(DefaultMaven.java:138)
	at org.apache.maven.cli.MavenCli.main(MavenCli.java:362)
	at sun.reflect.NativeMethodAccessorImpl.invoke0(Native Method)
	at sun.reflect.NativeMethodAccessorImpl.invoke(NativeMethodAccessorImpl.java:39)
	at sun.reflect.DelegatingMethodAccessorImpl.invoke(DelegatingMethodAccessorImpl.java:25)
	at java.lang.reflect.Method.invoke(Method.java:597)
	at org.codehaus.classworlds.Launcher.launchEnhanced(Launcher.java:315)
	at org.codehaus.classworlds.Launcher.launch(Launcher.java:255)
	at hudson.maven.agent.Main.launch(Main.java:165)
	at hudson.maven.MavenBuilder.call(MavenBuilder.java:159)
	at hudson.maven.MavenModuleSetBuild$Builder.call(MavenModuleSetBuild.java:688)
	at hudson.maven.MavenModuleSetBuild$Builder.call(MavenModuleSetBuild.java:632)
	at hudson.remoting.UserRequest.perform(UserRequest.java:114)
	at hudson.remoting.UserRequest.perform(UserRequest.java:48)
	at hudson.remoting.Request$2.run(Request.java:270)
	at java.util.concurrent.Executors$RunnableAdapter.call(Executors.java:441)
	at java.util.concurrent.FutureTask$Sync.innerRun(FutureTask.java:303)
	at java.util.concurrent.FutureTask.run(FutureTask.java:138)
	at java.util.concurrent.ThreadPoolExecutor$Worker.runTask(ThreadPoolExecutor.java:886)
	at java.util.concurrent.ThreadPoolExecutor$Worker.run(ThreadPoolExecutor.java:908)
	at java.lang.Thread.run(Thread.java:619)
Caused by: org.apache.maven.plugin.CompilationFailureException: Compilation failure
<http://hudson.zones.apache.org/hudson/job/Aries/ws/aries/application/application-management/src/main/java/org/apache/aries/application/management/impl/AriesApplicationManagerImpl.java>:[157,59]
incompatible types
found   : org.apache.aries.application.management.BundleConversion
required: java.io.InputStream


	at org.apache.maven.plugin.AbstractCompilerMojo.execute(AbstractCompilerMojo.java:516)
	at org.apache.maven.plugin.CompilerMojo.execute(CompilerMojo.java:114)
	at org.apache.maven.plugin.DefaultPluginManager.executeMojo(DefaultPluginManager.java:490)
	at hudson.maven.agent.PluginManagerInterceptor.executeMojo(PluginManagerInterceptor.java:182)
	at org.apache.maven.lifecycle.DefaultLifecycleExecutor.executeGoals(DefaultLifecycleExecutor.java:694)
	... 28 more
[INFO] ------------------------------------------------------------------------
[INFO] Total time: 5 minutes 15 seconds
[INFO] Finished at: Thu Jul 01 16:58:26 UTC 2010
[INFO] Final Memory: 132M/522M
[INFO] ------------------------------------------------------------------------
Sending e-mails to: aries-dev@incubator.apache.org
channel stopped


Mime
View raw message