aries-dev mailing list archives

Site index · List index
Message view « Date » · « Thread »
Top « Date » · « Thread »
From Apache Hudson Server <hud...@hudson.zones.apache.org>
Subject Build failed in Hudson: Aries #615
Date Fri, 13 Aug 2010 07:52:05 GMT
See <http://hudson.zones.apache.org/hudson/job/Aries/615/changes>

Changes:

[timothyjward] ARIES-378 - JPA Persistence container, lazy DataSource lookup

[timothyjward] ARIES-371 - Quiesce Manager implementation (from Hannah Ramlee)

------------------------------------------
Started by an SCM change
Building remotely on vesta.apache.org (Ubuntu)
Updating http://svn.apache.org/repos/asf/incubator/aries/trunk
U         quiesce/pom.xml
U         jpa/jpa-container/src/main/java/org/apache/aries/jpa/container/unit/impl/PersistenceUnitInfoImpl.java
A         jpa/jpa-container/src/main/java/org/apache/aries/jpa/container/unit/impl/DelayedLookupDataSource.java
At revision 985119
Parsing POMs
ERROR: Failed to parse POMs
hudson.util.IOException2: remote file operation failed: <http://hudson.zones.apache.org/hudson/job/Aries/ws/aries>
at hudson.remoting.Channel@456dc9:vesta.apache.org (Ubuntu)
	at hudson.FilePath.act(FilePath.java:749)
	at hudson.FilePath.act(FilePath.java:735)
	at hudson.maven.MavenModuleSetBuild$RunnerImpl.parsePoms(MavenModuleSetBuild.java:546)
	at hudson.maven.MavenModuleSetBuild$RunnerImpl.doRun(MavenModuleSetBuild.java:432)
	at hudson.model.AbstractBuild$AbstractRunner.run(AbstractBuild.java:416)
	at hudson.model.Run.run(Run.java:1248)
	at hudson.maven.MavenModuleSetBuild.run(MavenModuleSetBuild.java:318)
	at hudson.model.ResourceController.execute(ResourceController.java:88)
	at hudson.model.Executor.run(Executor.java:129)
Caused by: hudson.remoting.ProxyException: hudson.maven.MavenModuleSetBuild$MavenExecutionException:
hudson.maven.MavenEmbedder$1: Failed to validate POM for project org.apache.aries.quiesce:org.apache.aries.quiesce.manager.itest
at <http://hudson.zones.apache.org/hudson/job/Aries/ws/aries/quiesce/quiesce-manager-itest/pom.xml>
- [0]  'dependencies.dependency.version' is missing for org.apache.aries:org.apache.aries.util
- [1]  'dependencies.dependency.version' is missing for org.apache.felix:org.apache.felix.configadmin
- [2]  'dependencies.dependency.version' is missing for commons-lang:commons-lang
- [3]  'dependencies.dependency.version' is missing for commons-collections:commons-collections
- [4]  'dependencies.dependency.version' is missing for commons-pool:commons-pool
- [5]  'dependencies.dependency.version' is missing for org.apache.servicemix.bundles:org.apache.servicemix.bundles.serp

	at hudson.maven.MavenModuleSetBuild$PomParser.invoke(MavenModuleSetBuild.java:903)
	at hudson.maven.MavenModuleSetBuild$PomParser.invoke(MavenModuleSetBuild.java:806)
	at hudson.FilePath$FileCallableWrapper.call(FilePath.java:1899)
	at hudson.remoting.UserRequest.perform(UserRequest.java:114)
	at hudson.remoting.UserRequest.perform(UserRequest.java:48)
	at hudson.remoting.Request$2.run(Request.java:270)
	at java.util.concurrent.Executors$RunnableAdapter.call(Executors.java:441)
	at java.util.concurrent.FutureTask$Sync.innerRun(FutureTask.java:303)
	at java.util.concurrent.FutureTask.run(FutureTask.java:138)
	at java.util.concurrent.ThreadPoolExecutor$Worker.runTask(ThreadPoolExecutor.java:886)
	at java.util.concurrent.ThreadPoolExecutor$Worker.run(ThreadPoolExecutor.java:908)
	at java.lang.Thread.run(Thread.java:619)
Caused by: hudson.remoting.ProxyException: hudson.maven.MavenEmbedder$1: Failed to validate
POM for project org.apache.aries.quiesce:org.apache.aries.quiesce.manager.itest at <http://hudson.zones.apache.org/hudson/job/Aries/ws/aries/quiesce/quiesce-manager-itest/pom.xml>
- [0]  'dependencies.dependency.version' is missing for org.apache.aries:org.apache.aries.util
- [1]  'dependencies.dependency.version' is missing for org.apache.felix:org.apache.felix.configadmin
- [2]  'dependencies.dependency.version' is missing for commons-lang:commons-lang
- [3]  'dependencies.dependency.version' is missing for commons-collections:commons-collections
- [4]  'dependencies.dependency.version' is missing for commons-pool:commons-pool
- [5]  'dependencies.dependency.version' is missing for org.apache.servicemix.bundles:org.apache.servicemix.bundles.serp

	at hudson.maven.MavenEmbedder.readProject(MavenEmbedder.java:334)
	at hudson.maven.MavenUtil.resolveModules(MavenUtil.java:226)
	at hudson.maven.MavenUtil.resolveModules(MavenUtil.java:227)
	at hudson.maven.MavenModuleSetBuild$PomParser.invoke(MavenModuleSetBuild.java:885)
	... 11 more
Caused by: hudson.remoting.ProxyException: org.apache.maven.project.InvalidProjectModelException:
Failed to validate POM for project org.apache.aries.quiesce:org.apache.aries.quiesce.manager.itest
at <http://hudson.zones.apache.org/hudson/job/Aries/ws/aries/quiesce/quiesce-manager-itest/pom.xml>
	at org.apache.maven.project.DefaultMavenProjectBuilder.processProjectLogic(DefaultMavenProjectBuilder.java:1108)
	at org.apache.maven.project.DefaultMavenProjectBuilder.buildInternal(DefaultMavenProjectBuilder.java:878)
	at org.apache.maven.project.DefaultMavenProjectBuilder.buildFromSourceFileInternal(DefaultMavenProjectBuilder.java:506)
	at org.apache.maven.project.DefaultMavenProjectBuilder.build(DefaultMavenProjectBuilder.java:215)
	at hudson.maven.MavenEmbedder.readProject(MavenEmbedder.java:332)
	... 14 more


Mime
View raw message