aries-dev mailing list archives

Site index · List index
Message view « Date » · « Thread »
Top « Date » · « Thread »
From Apache Hudson Server <hud...@hudson.zones.apache.org>
Subject Build failed in Hudson: Aries #607
Date Tue, 10 Aug 2010 12:57:54 GMT
See <http://hudson.zones.apache.org/hudson/job/Aries/607/changes>

Changes:

[mnuttall] ARIES-359: Isolated application support. From a patch by Chris Wilkinson.

[mnuttall] ARIES-359: Isolated application support. From a patch by Chris Wilkinson.

[mnuttall] ARIES-359: Isolated application support. From a patch by Chris Wilkinson.

[mnuttall] ARIES-359: Isolated application support. From a patch by Chris Wilkinson.

[mnuttall] Aries-359: Isolated application runtime support

------------------------------------------
[...truncated 2839 lines...]
[INFO] [depends:generate-depends-file {execution: generate-depends-file}]
[INFO] Created: <http://hudson.zones.apache.org/hudson/job/Aries/ws/aries/web/web-itests/target/classes/META-INF/maven/dependencies.properties>
[INFO] [resources:resources {execution: default-resources}]
[INFO] Using 'UTF-8' encoding to copy filtered resources.
[INFO] Copying 0 resource
[INFO] skip non existing resourceDirectory <http://hudson.zones.apache.org/hudson/job/Aries/ws/aries/web/web-itests/src/main/filtered-resources>
[INFO] Copying 4 resources
[INFO] [compiler:compile {execution: default-compile}]
[INFO] Nothing to compile - all classes are up to date
[INFO] [resources:testResources {execution: default-testResources}]
[INFO] Using 'UTF-8' encoding to copy filtered resources.
[INFO] Copying 0 resource
[INFO] skip non existing resourceDirectory <http://hudson.zones.apache.org/hudson/job/Aries/ws/aries/web/web-itests/src/test/filtered-resources>
[INFO] Copying 4 resources
[INFO] [compiler:testCompile {execution: default-testCompile}]
[INFO] Compiling 2 source files to <http://hudson.zones.apache.org/hudson/job/Aries/ws/aries/web/web-itests/target/test-classes>
[INFO] [surefire:test {execution: default-test}]
[INFO] Surefire report directory: <http://hudson.zones.apache.org/hudson/job/Aries/ws/aries/web/web-itests/target/surefire-reports>

-------------------------------------------------------
 T E S T S
-------------------------------------------------------
Running org.apache.aries.web.converter.itest.WabConverterITest
Tests run: 1, Failures: 0, Errors: 0, Skipped: 0, Time elapsed: 5.744 sec

Results :

Tests run: 1, Failures: 0, Errors: 0, Skipped: 0

[HUDSON] Recording test results
[INFO] [jar:jar {execution: default-jar}]
[INFO] Building jar: <http://hudson.zones.apache.org/hudson/job/Aries/ws/aries/web/web-itests/target/org.apache.aries.web.itests-0.2-incubating-SNAPSHOT.jar>
[INFO] [ianal:verify-legal-files {execution: default}]
[INFO] Checking legal files in: org.apache.aries.web.itests-0.2-incubating-SNAPSHOT.jar
[INFO] [install:install {execution: default-install}]
[INFO] Installing <http://hudson.zones.apache.org/hudson/job/Aries/ws/aries/web/web-itests/target/org.apache.aries.web.itests-0.2-incubating-SNAPSHOT.jar>
to /home/hudson/.m2/repository/org/apache/aries/web/org.apache.aries.web.itests/0.2-incubating-SNAPSHOT/org.apache.aries.web.itests-0.2-incubating-SNAPSHOT.jar
[HUDSON] Archiving <http://hudson.zones.apache.org/hudson/job/Aries/ws/aries/web/web-itests/pom.xml>
to /export/home/hudson/hudson/jobs/Aries/modules/org.apache.aries.web$org.apache.aries.web.itests/builds/2010-08-10_12-51-57/archive/org.apache.aries.web/org.apache.aries.web.itests/0.2-incubating-SNAPSHOT/pom.xml
[HUDSON] Archiving <http://hudson.zones.apache.org/hudson/job/Aries/ws/aries/web/web-itests/target/org.apache.aries.web.itests-0.2-incubating-SNAPSHOT.jar>
to /export/home/hudson/hudson/jobs/Aries/modules/org.apache.aries.web$org.apache.aries.web.itests/builds/2010-08-10_12-51-57/archive/org.apache.aries.web/org.apache.aries.web.itests/0.2-incubating-SNAPSHOT/org.apache.aries.web.itests-0.2-incubating-SNAPSHOT.jar
[INFO] ------------------------------------------------------------------------
[INFO] Building Apache Aries Application
[INFO]    task-segment: [clean, install]
[INFO] ------------------------------------------------------------------------
[INFO] [clean:clean {execution: default-clean}]
[INFO] Deleting file set: <http://hudson.zones.apache.org/hudson/job/Aries/ws/aries/application/target>
(included: [**], excluded: [])
[INFO] [enforcer:enforce {execution: default}]
[INFO] [antrun:run {execution: create-prop}]
[INFO] Executing tasks
     [echo] Maven version: 0.2-incubating-SNAPSHOT
     [echo] OSGi version: 0.2.0.incubating-SNAPSHOT
    [mkdir] Created dir: <http://hudson.zones.apache.org/hudson/job/Aries/ws/aries/application/target>
[INFO] Executed tasks
[INFO] [properties:read-project-properties {execution: default}]
[INFO] [remote-resources:process {execution: default}]
[INFO] [site:attach-descriptor {execution: default-attach-descriptor}]
[INFO] [ianal:verify-legal-files {execution: default}]
[INFO] [install:install {execution: default-install}]
[INFO] Installing <http://hudson.zones.apache.org/hudson/job/Aries/ws/aries/application/pom.xml>
to /home/hudson/.m2/repository/org/apache/aries/application/application/0.2-incubating-SNAPSHOT/application-0.2-incubating-SNAPSHOT.pom
[HUDSON] Archiving <http://hudson.zones.apache.org/hudson/job/Aries/ws/aries/application/pom.xml>
to /export/home/hudson/hudson/jobs/Aries/modules/org.apache.aries.application$application/builds/2010-08-10_12-51-57/archive/org.apache.aries.application/application/0.2-incubating-SNAPSHOT/pom.xml
[HUDSON] Archiving /home/hudson/.m2/repository/org/apache/aries/application/application/0.2-incubating-SNAPSHOT/application-0.2-incubating-SNAPSHOT.pom
to /export/home/hudson/hudson/jobs/Aries/modules/org.apache.aries.application$application/builds/2010-08-10_12-51-57/archive/org.apache.aries.application/application/0.2-incubating-SNAPSHOT/application-0.2-incubating-SNAPSHOT.pom
[INFO] ------------------------------------------------------------------------
[INFO] Building Apache Aries Application API
[INFO]    task-segment: [clean, install]
[INFO] ------------------------------------------------------------------------
[INFO] [clean:clean {execution: default-clean}]
[INFO] Deleting file set: <http://hudson.zones.apache.org/hudson/job/Aries/ws/aries/application/application-api/target>
(included: [**], excluded: [])
[INFO] [enforcer:enforce {execution: default}]
[INFO] [antrun:run {execution: create-prop}]
[INFO] Executing tasks
     [echo] Maven version: 0.2-incubating-SNAPSHOT
     [echo] OSGi version: 0.2.0.incubating-SNAPSHOT
    [mkdir] Created dir: <http://hudson.zones.apache.org/hudson/job/Aries/ws/aries/application/application-api/target>
[INFO] Executed tasks
[INFO] [properties:read-project-properties {execution: default}]
[INFO] [remote-resources:process {execution: default}]
[INFO] [resources:resources {execution: default-resources}]
[INFO] Using 'UTF-8' encoding to copy filtered resources.
[INFO] skip non existing resourceDirectory <http://hudson.zones.apache.org/hudson/job/Aries/ws/aries/application/application-api/src/main/resources>
[INFO] skip non existing resourceDirectory <http://hudson.zones.apache.org/hudson/job/Aries/ws/aries/application/application-api/src/main/filtered-resources>
[INFO] Copying 4 resources
[INFO] [compiler:compile {execution: default-compile}]
[INFO] Compiling 31 source files to <http://hudson.zones.apache.org/hudson/job/Aries/ws/aries/application/application-api/target/classes>
[INFO] [resources:testResources {execution: default-testResources}]
[INFO] Using 'UTF-8' encoding to copy filtered resources.
[INFO] skip non existing resourceDirectory <http://hudson.zones.apache.org/hudson/job/Aries/ws/aries/application/application-api/src/test/resources>
[INFO] skip non existing resourceDirectory <http://hudson.zones.apache.org/hudson/job/Aries/ws/aries/application/application-api/src/test/filtered-resources>
[INFO] Copying 4 resources
[INFO] [compiler:testCompile {execution: default-testCompile}]
[INFO] No sources to compile
[INFO] [surefire:test {execution: default-test}]
[INFO] Surefire report directory: <http://hudson.zones.apache.org/hudson/job/Aries/ws/aries/application/application-api/target/surefire-reports>

-------------------------------------------------------
 T E S T S
-------------------------------------------------------
There are no tests to run.

Results :

Tests run: 0, Failures: 0, Errors: 0, Skipped: 0

[INFO] [bundle:bundle {execution: default-bundle}]
[HUDSON] Recording test results[WARNING] Warning building bundle org.apache.aries.application:org.apache.aries.application.api:bundle:0.2-incubating-SNAPSHOT
: Instructions in Private-Package, or -testpackages that are never used: org\.apache\.aries\.application\.api.*\.impl
[WARNING] Warning building bundle org.apache.aries.application:org.apache.aries.application.api:bundle:0.2-incubating-SNAPSHOT
: Did not find matching referal for org.apache.aries.*

[INFO] [ianal:verify-legal-files {execution: default}]
[INFO] Checking legal files in: org.apache.aries.application.api-0.2-incubating-SNAPSHOT.jar
[INFO] [install:install {execution: default-install}]
[INFO] Installing <http://hudson.zones.apache.org/hudson/job/Aries/ws/aries/application/application-api/target/org.apache.aries.application.api-0.2-incubating-SNAPSHOT.jar>
to /home/hudson/.m2/repository/org/apache/aries/application/org.apache.aries.application.api/0.2-incubating-SNAPSHOT/org.apache.aries.application.api-0.2-incubating-SNAPSHOT.jar
[INFO] [bundle:install {execution: default-install}]
[INFO] Parsing file:/home/hudson/.m2/repository/repository.xml
[Fatal Error] repository.xml:3:1: Premature end of file.
org.xml.sax.SAXParseException: Premature end of file.
	at com.sun.org.apache.xerces.internal.parsers.DOMParser.parse(DOMParser.java:249)
	at com.sun.org.apache.xerces.internal.jaxp.DocumentBuilderImpl.parse(DocumentBuilderImpl.java:284)
	at javax.xml.parsers.DocumentBuilder.parse(DocumentBuilder.java:208)
	at org.apache.felix.obrplugin.ObrUpdate.parseFile(ObrUpdate.java:347)
	at org.apache.felix.obrplugin.ObrUpdate.parseRepositoryXml(ObrUpdate.java:324)
	at org.apache.felix.obrplugin.ObrInstall.execute(ObrInstall.java:140)
	at org.apache.maven.plugin.DefaultPluginManager.executeMojo(DefaultPluginManager.java:490)
	at hudson.maven.agent.PluginManagerInterceptor.executeMojo(PluginManagerInterceptor.java:182)
	at org.apache.maven.lifecycle.DefaultLifecycleExecutor.executeGoals(DefaultLifecycleExecutor.java:694)
	at org.apache.maven.lifecycle.DefaultLifecycleExecutor.executeGoalWithLifecycle(DefaultLifecycleExecutor.java:556)
	at org.apache.maven.lifecycle.DefaultLifecycleExecutor.executeGoal(DefaultLifecycleExecutor.java:535)
	at org.apache.maven.lifecycle.DefaultLifecycleExecutor.executeGoalAndHandleFailures(DefaultLifecycleExecutor.java:387)
	at org.apache.maven.lifecycle.DefaultLifecycleExecutor.executeTaskSegments(DefaultLifecycleExecutor.java:348)
	at org.apache.maven.lifecycle.DefaultLifecycleExecutor.execute(DefaultLifecycleExecutor.java:180)
	at org.apache.maven.lifecycle.LifecycleExecutorInterceptor.execute(LifecycleExecutorInterceptor.java:65)
	at org.apache.maven.DefaultMaven.doExecute(DefaultMaven.java:328)
	at org.apache.maven.DefaultMaven.execute(DefaultMaven.java:138)
	at org.apache.maven.cli.MavenCli.main(MavenCli.java:362)
	at sun.reflect.NativeMethodAccessorImpl.invoke0(Native Method)
	at sun.reflect.NativeMethodAccessorImpl.invoke(NativeMethodAccessorImpl.java:39)
	at sun.reflect.DelegatingMethodAccessorImpl.invoke(DelegatingMethodAccessorImpl.java:25)
	at java.lang.reflect.Method.invoke(Method.java:597)
	at org.codehaus.classworlds.Launcher.launchEnhanced(Launcher.java:315)
	at org.codehaus.classworlds.Launcher.launch(Launcher.java:255)
	at hudson.maven.agent.Main.launch(Main.java:165)
	at hudson.maven.MavenBuilder.call(MavenBuilder.java:165)
	at hudson.maven.MavenModuleSetBuild$Builder.call(MavenModuleSetBuild.java:708)
	at hudson.maven.MavenModuleSetBuild$Builder.call(MavenModuleSetBuild.java:652)
	at hudson.remoting.UserRequest.perform(UserRequest.java:114)
	at hudson.remoting.UserRequest.perform(UserRequest.java:48)
	at hudson.remoting.Request$2.run(Request.java:270)
	at java.util.concurrent.Executors$RunnableAdapter.call(Executors.java:441)
	at java.util.concurrent.FutureTask$Sync.innerRun(FutureTask.java:303)
	at java.util.concurrent.FutureTask.run(FutureTask.java:138)
	at java.util.concurrent.ThreadPoolExecutor$Worker.runTask(ThreadPoolExecutor.java:886)
	at java.util.concurrent.ThreadPoolExecutor$Worker.run(ThreadPoolExecutor.java:908)
	at java.lang.Thread.run(Thread.java:619)
[INFO] Writing OBR metadata
[HUDSON] Archiving <http://hudson.zones.apache.org/hudson/job/Aries/ws/aries/application/application-api/pom.xml>
to /export/home/hudson/hudson/jobs/Aries/modules/org.apache.aries.application$org.apache.aries.application.api/builds/2010-08-10_12-51-57/archive/org.apache.aries.application/org.apache.aries.application.api/0.2-incubating-SNAPSHOT/pom.xml
[HUDSON] Archiving <http://hudson.zones.apache.org/hudson/job/Aries/ws/aries/application/application-api/target/org.apache.aries.application.api-0.2-incubating-SNAPSHOT.jar>
to /export/home/hudson/hudson/jobs/Aries/modules/org.apache.aries.application$org.apache.aries.application.api/builds/2010-08-10_12-51-57/archive/org.apache.aries.application/org.apache.aries.application.api/0.2-incubating-SNAPSHOT/org.apache.aries.application.api-0.2-incubating-SNAPSHOT.jar
[INFO] ------------------------------------------------------------------------
[INFO] Building Apache Aries Application Utils
[INFO]    task-segment: [clean, install]
[INFO] ------------------------------------------------------------------------
[INFO] [clean:clean {execution: default-clean}]
[INFO] Deleting file set: <http://hudson.zones.apache.org/hudson/job/Aries/ws/aries/application/application-utils/target>
(included: [**], excluded: [])
[INFO] snapshot org.apache.aries.application:org.apache.aries.application.api:0.2-incubating-SNAPSHOT:
checking for updates from codehaus.snapshots
[INFO] snapshot org.apache.aries.application:org.apache.aries.application.api:0.2-incubating-SNAPSHOT:
checking for updates from apache.snapshots
[INFO] [enforcer:enforce {execution: default}]
[INFO] [antrun:run {execution: create-prop}]
[INFO] Executing tasks
     [echo] Maven version: 0.2-incubating-SNAPSHOT
     [echo] OSGi version: 0.2.0.incubating-SNAPSHOT
    [mkdir] Created dir: <http://hudson.zones.apache.org/hudson/job/Aries/ws/aries/application/application-utils/target>
[INFO] Executed tasks
[INFO] [properties:read-project-properties {execution: default}]
[INFO] [remote-resources:process {execution: default}]
[INFO] [resources:resources {execution: default-resources}]
[INFO] Using 'UTF-8' encoding to copy filtered resources.
[INFO] Copying 2 resources
[INFO] skip non existing resourceDirectory <http://hudson.zones.apache.org/hudson/job/Aries/ws/aries/application/application-utils/src/main/filtered-resources>
[INFO] Copying 4 resources
[INFO] [compiler:compile {execution: default-compile}]
[INFO] Compiling 21 source files to <http://hudson.zones.apache.org/hudson/job/Aries/ws/aries/application/application-utils/target/classes>
[HUDSON] Archiving <http://hudson.zones.apache.org/hudson/job/Aries/ws/aries/application/application-utils/pom.xml>
to /export/home/hudson/hudson/jobs/Aries/modules/org.apache.aries.application$org.apache.aries.application.utils/builds/2010-08-10_12-51-57/archive/org.apache.aries.application/org.apache.aries.application.utils/0.2-incubating-SNAPSHOT/pom.xml
[INFO] ------------------------------------------------------------------------
[ERROR] BUILD FAILURE
[INFO] ------------------------------------------------------------------------
[INFO] Compilation failure

<http://hudson.zones.apache.org/hudson/job/Aries/ws/aries/application/application-utils/src/main/java/org/apache/aries/application/impl/DeploymentMetadataFactoryImpl.java>:[35,7]
org.apache.aries.application.impl.DeploymentMetadataFactoryImpl is not abstract and does not
override abstract method parseDeploymentMetadata(java.io.InputStream) in org.apache.aries.application.DeploymentMetadataFactory

<http://hudson.zones.apache.org/hudson/job/Aries/ws/aries/application/application-utils/src/main/java/org/apache/aries/application/impl/DeploymentMetadataFactoryImpl.java>:[51,28]
[deprecation] createDeploymentMetadata(java.io.InputStream) in org.apache.aries.application.DeploymentMetadataFactory
has been deprecated

<http://hudson.zones.apache.org/hudson/job/Aries/ws/aries/application/application-utils/src/main/java/org/apache/aries/application/impl/DeploymentMetadataFactoryImpl.java>:[42,28]
[deprecation] createDeploymentMetadata(org.apache.aries.application.filesystem.IFile) in org.apache.aries.application.DeploymentMetadataFactory
has been deprecated

<http://hudson.zones.apache.org/hudson/job/Aries/ws/aries/application/application-utils/src/main/java/org/apache/aries/application/utils/management/SimpleBundleInfo.java>:[52,23]
cannot find symbol
symbol  : method parseContent(java.lang.String)
location: interface org.apache.aries.application.ApplicationMetadataFactory

<http://hudson.zones.apache.org/hudson/job/Aries/ws/aries/application/application-utils/src/main/java/org/apache/aries/application/utils/management/SimpleBundleInfo.java>:[68,71]
[deprecation] EXPORT_SERVICE in org.osgi.framework.Constants has been deprecated

<http://hudson.zones.apache.org/hudson/job/Aries/ws/aries/application/application-utils/src/main/java/org/apache/aries/application/utils/management/SimpleBundleInfo.java>:[92,71]
[deprecation] IMPORT_SERVICE in org.osgi.framework.Constants has been deprecated

<http://hudson.zones.apache.org/hudson/job/Aries/ws/aries/application/application-utils/src/main/java/org/apache/aries/application/utils/management/SimpleBundleInfo.java>:[114,45]
cannot find symbol
symbol  : method parseContent(java.lang.String)
location: interface org.apache.aries.application.ApplicationMetadataFactory

<http://hudson.zones.apache.org/hudson/job/Aries/ws/aries/application/application-utils/src/main/java/org/apache/aries/application/impl/DeploymentMetadataImpl.java>:[48,7]
org.apache.aries.application.impl.DeploymentMetadataImpl is not abstract and does not override
abstract method getImportPackage() in org.apache.aries.application.DeploymentMetadata


[INFO] ------------------------------------------------------------------------
[INFO] Trace
org.apache.maven.BuildFailureException: Compilation failure
	at org.apache.maven.lifecycle.DefaultLifecycleExecutor.executeGoals(DefaultLifecycleExecutor.java:715)
	at org.apache.maven.lifecycle.DefaultLifecycleExecutor.executeGoalWithLifecycle(DefaultLifecycleExecutor.java:556)
	at org.apache.maven.lifecycle.DefaultLifecycleExecutor.executeGoal(DefaultLifecycleExecutor.java:535)
	at org.apache.maven.lifecycle.DefaultLifecycleExecutor.executeGoalAndHandleFailures(DefaultLifecycleExecutor.java:387)
	at org.apache.maven.lifecycle.DefaultLifecycleExecutor.executeTaskSegments(DefaultLifecycleExecutor.java:348)
	at org.apache.maven.lifecycle.DefaultLifecycleExecutor.execute(DefaultLifecycleExecutor.java:180)
	at org.apache.maven.lifecycle.LifecycleExecutorInterceptor.execute(LifecycleExecutorInterceptor.java:65)
	at org.apache.maven.DefaultMaven.doExecute(DefaultMaven.java:328)
	at org.apache.maven.DefaultMaven.execute(DefaultMaven.java:138)
	at org.apache.maven.cli.MavenCli.main(MavenCli.java:362)
	at sun.reflect.NativeMethodAccessorImpl.invoke0(Native Method)
	at sun.reflect.NativeMethodAccessorImpl.invoke(NativeMethodAccessorImpl.java:39)
	at sun.reflect.DelegatingMethodAccessorImpl.invoke(DelegatingMethodAccessorImpl.java:25)
	at java.lang.reflect.Method.invoke(Method.java:597)
	at org.codehaus.classworlds.Launcher.launchEnhanced(Launcher.java:315)
	at org.codehaus.classworlds.Launcher.launch(Launcher.java:255)
	at hudson.maven.agent.Main.launch(Main.java:165)
	at hudson.maven.MavenBuilder.call(MavenBuilder.java:165)
	at hudson.maven.MavenModuleSetBuild$Builder.call(MavenModuleSetBuild.java:708)
	at hudson.maven.MavenModuleSetBuild$Builder.call(MavenModuleSetBuild.java:652)
	at hudson.remoting.UserRequest.perform(UserRequest.java:114)
	at hudson.remoting.UserRequest.perform(UserRequest.java:48)
	at hudson.remoting.Request$2.run(Request.java:270)
	at java.util.concurrent.Executors$RunnableAdapter.call(Executors.java:441)
	at java.util.concurrent.FutureTask$Sync.innerRun(FutureTask.java:303)
	at java.util.concurrent.FutureTask.run(FutureTask.java:138)
	at java.util.concurrent.ThreadPoolExecutor$Worker.runTask(ThreadPoolExecutor.java:886)
	at java.util.concurrent.ThreadPoolExecutor$Worker.run(ThreadPoolExecutor.java:908)
	at java.lang.Thread.run(Thread.java:619)
Caused by: org.apache.maven.plugin.CompilationFailureException: Compilation failure
	at org.apache.maven.plugin.AbstractCompilerMojo.execute(AbstractCompilerMojo.java:516)
	at org.apache.maven.plugin.CompilerMojo.execute(CompilerMojo.java:114)
	at org.apache.maven.plugin.DefaultPluginManager.executeMojo(DefaultPluginManager.java:490)
	at hudson.maven.agent.PluginManagerInterceptor.executeMojo(PluginManagerInterceptor.java:182)
	at org.apache.maven.lifecycle.DefaultLifecycleExecutor.executeGoals(DefaultLifecycleExecutor.java:694)
	... 28 more
[INFO] ------------------------------------------------------------------------
[INFO] Total time: 5 minutes 18 seconds
[INFO] Finished at: Tue Aug 10 12:57:32 UTC 2010
[INFO] Final Memory: 128M/501M
[INFO] ------------------------------------------------------------------------
Sending e-mails to: aries-dev@incubator.apache.org
channel stopped


Mime
View raw message