aries-dev mailing list archives

Site index · List index
Message view « Date » · « Thread »
Top « Date » · « Thread »
From Apache Hudson Server <hud...@hudson.zones.apache.org>
Subject Build failed in Hudson: Aries » Aries JPA iTests #609
Date Tue, 10 Aug 2010 15:59:36 GMT
See <http://hudson.zones.apache.org/hudson/job/Aries/org.apache.aries.jpa$org.apache.aries.jpa.container.itest/609/>

------------------------------------------
[INFO] ------------------------------------------------------------------------
[INFO] Building Aries JPA iTests
[INFO]    task-segment: [clean, install]
[INFO] ------------------------------------------------------------------------
[INFO] [clean:clean {execution: default-clean}]
[INFO] Deleting file set: <http://hudson.zones.apache.org/hudson/job/Aries/org.apache.aries.jpa$org.apache.aries.jpa.container.itest/ws/target>
(included: [**], excluded: [])
[INFO] snapshot org.apache.aries.jpa:org.apache.aries.jpa.container:0.2-incubating-SNAPSHOT:
checking for updates from codehaus.snapshots
[INFO] snapshot org.apache.aries.jpa:org.apache.aries.jpa.container:0.2-incubating-SNAPSHOT:
checking for updates from apache.snapshots
[INFO] snapshot org.apache.aries.jpa:org.apache.aries.jpa.container.context:0.2-incubating-SNAPSHOT:
checking for updates from codehaus.snapshots
[INFO] snapshot org.apache.aries.jpa:org.apache.aries.jpa.container.context:0.2-incubating-SNAPSHOT:
checking for updates from apache.snapshots
[INFO] snapshot org.apache.aries.jpa:org.apache.aries.jpa.blueprint.aries:0.2-incubating-SNAPSHOT:
checking for updates from codehaus.snapshots
[INFO] snapshot org.apache.aries.jpa:org.apache.aries.jpa.blueprint.aries:0.2-incubating-SNAPSHOT:
checking for updates from apache.snapshots
[INFO] snapshot org.apache.aries.jpa:org.apache.aries.jpa.container.itest.bundle:0.2-incubating-SNAPSHOT:
checking for updates from codehaus.snapshots
[INFO] snapshot org.apache.aries.jpa:org.apache.aries.jpa.container.itest.bundle:0.2-incubating-SNAPSHOT:
checking for updates from apache.snapshots
[INFO] snapshot org.apache.aries.jpa:org.apache.aries.jpa.blueprint.itest.bundle:0.2-incubating-SNAPSHOT:
checking for updates from codehaus.snapshots
[INFO] snapshot org.apache.aries.jpa:org.apache.aries.jpa.blueprint.itest.bundle:0.2-incubating-SNAPSHOT:
checking for updates from apache.snapshots
[INFO] [enforcer:enforce {execution: default}]
[INFO] [antrun:run {execution: create-prop}]
[INFO] Executing tasks
     [echo] Maven version: 0.2-incubating-SNAPSHOT
     [echo] OSGi version: 0.2.0.incubating-SNAPSHOT
    [mkdir] Created dir: <http://hudson.zones.apache.org/hudson/job/Aries/org.apache.aries.jpa$org.apache.aries.jpa.container.itest/ws/target>
[INFO] Executed tasks
[INFO] [properties:read-project-properties {execution: default}]
[INFO] [remote-resources:process {execution: default}]
[INFO] [depends:generate-depends-file {execution: generate-depends-file}]
[INFO] Created: <http://hudson.zones.apache.org/hudson/job/Aries/org.apache.aries.jpa$org.apache.aries.jpa.container.itest/ws/target/classes/META-INF/maven/dependencies.properties>
[INFO] [resources:resources {execution: default-resources}]
[INFO] Using 'UTF-8' encoding to copy filtered resources.
[INFO] skip non existing resourceDirectory <http://hudson.zones.apache.org/hudson/job/Aries/org.apache.aries.jpa$org.apache.aries.jpa.container.itest/ws/src/main/resources>
[INFO] skip non existing resourceDirectory <http://hudson.zones.apache.org/hudson/job/Aries/org.apache.aries.jpa$org.apache.aries.jpa.container.itest/ws/src/main/filtered-resources>
[INFO] Copying 4 resources
[INFO] [compiler:compile {execution: default-compile}]
[INFO] No sources to compile
[INFO] [resources:testResources {execution: default-testResources}]
[INFO] Using 'UTF-8' encoding to copy filtered resources.
[INFO] skip non existing resourceDirectory <http://hudson.zones.apache.org/hudson/job/Aries/org.apache.aries.jpa$org.apache.aries.jpa.container.itest/ws/src/test/resources>
[INFO] skip non existing resourceDirectory <http://hudson.zones.apache.org/hudson/job/Aries/org.apache.aries.jpa$org.apache.aries.jpa.container.itest/ws/src/test/filtered-resources>
[INFO] Copying 4 resources
[INFO] [compiler:testCompile {execution: default-testCompile}]
[INFO] Compiling 4 source files to <http://hudson.zones.apache.org/hudson/job/Aries/org.apache.aries.jpa$org.apache.aries.jpa.container.itest/ws/target/test-classes>
[HUDSON] Archiving <http://hudson.zones.apache.org/hudson/job/Aries/org.apache.aries.jpa$org.apache.aries.jpa.container.itest/ws/pom.xml>
to /export/home/hudson/hudson/jobs/Aries/modules/org.apache.aries.jpa$org.apache.aries.jpa.container.itest/builds/2010-08-10_15-51-45/archive/org.apache.aries.jpa/org.apache.aries.jpa.container.itest/0.2-incubating-SNAPSHOT/pom.xml
[INFO] ------------------------------------------------------------------------
[ERROR] BUILD FAILURE
[INFO] ------------------------------------------------------------------------
[INFO] Compilation failure

<http://hudson.zones.apache.org/hudson/job/Aries/org.apache.aries.jpa$org.apache.aries.jpa.container.itest/ws/src/test/java/org/apache/aries/jpa/quiesce/itest/QuiesceJPATest.java>:[62,47]
package com.sun.xml.internal.messaging.saaj.util does not exist

<http://hudson.zones.apache.org/hudson/job/Aries/org.apache.aries.jpa$org.apache.aries.jpa.container.itest/ws/src/test/java/org/apache/aries/jpa/quiesce/itest/QuiesceJPATest.java>:[62,47]
package com.sun.xml.internal.messaging.saaj.util does not exist


[INFO] ------------------------------------------------------------------------
[INFO] Trace
org.apache.maven.BuildFailureException: Compilation failure
	at org.apache.maven.lifecycle.DefaultLifecycleExecutor.executeGoals(DefaultLifecycleExecutor.java:715)
	at org.apache.maven.lifecycle.DefaultLifecycleExecutor.executeGoalWithLifecycle(DefaultLifecycleExecutor.java:556)
	at org.apache.maven.lifecycle.DefaultLifecycleExecutor.executeGoal(DefaultLifecycleExecutor.java:535)
	at org.apache.maven.lifecycle.DefaultLifecycleExecutor.executeGoalAndHandleFailures(DefaultLifecycleExecutor.java:387)
	at org.apache.maven.lifecycle.DefaultLifecycleExecutor.executeTaskSegments(DefaultLifecycleExecutor.java:348)
	at org.apache.maven.lifecycle.DefaultLifecycleExecutor.execute(DefaultLifecycleExecutor.java:180)
	at org.apache.maven.lifecycle.LifecycleExecutorInterceptor.execute(LifecycleExecutorInterceptor.java:65)
	at org.apache.maven.DefaultMaven.doExecute(DefaultMaven.java:328)
	at org.apache.maven.DefaultMaven.execute(DefaultMaven.java:138)
	at org.apache.maven.cli.MavenCli.main(MavenCli.java:362)
	at sun.reflect.NativeMethodAccessorImpl.invoke0(Native Method)
	at sun.reflect.NativeMethodAccessorImpl.invoke(NativeMethodAccessorImpl.java:39)
	at sun.reflect.DelegatingMethodAccessorImpl.invoke(DelegatingMethodAccessorImpl.java:25)
	at java.lang.reflect.Method.invoke(Method.java:597)
	at org.codehaus.classworlds.Launcher.launchEnhanced(Launcher.java:315)
	at org.codehaus.classworlds.Launcher.launch(Launcher.java:255)
	at hudson.maven.agent.Main.launch(Main.java:165)
	at hudson.maven.MavenBuilder.call(MavenBuilder.java:165)
	at hudson.maven.MavenModuleSetBuild$Builder.call(MavenModuleSetBuild.java:708)
	at hudson.maven.MavenModuleSetBuild$Builder.call(MavenModuleSetBuild.java:652)
	at hudson.remoting.UserRequest.perform(UserRequest.java:114)
	at hudson.remoting.UserRequest.perform(UserRequest.java:48)
	at hudson.remoting.Request$2.run(Request.java:270)
	at java.util.concurrent.Executors$RunnableAdapter.call(Executors.java:441)
	at java.util.concurrent.FutureTask$Sync.innerRun(FutureTask.java:303)
	at java.util.concurrent.FutureTask.run(FutureTask.java:138)
	at java.util.concurrent.ThreadPoolExecutor$Worker.runTask(ThreadPoolExecutor.java:886)
	at java.util.concurrent.ThreadPoolExecutor$Worker.run(ThreadPoolExecutor.java:908)
	at java.lang.Thread.run(Thread.java:619)
Caused by: org.apache.maven.plugin.CompilationFailureException: Compilation failure
	at org.apache.maven.plugin.AbstractCompilerMojo.execute(AbstractCompilerMojo.java:516)
	at org.apache.maven.plugin.TestCompilerMojo.execute(TestCompilerMojo.java:102)
	at org.apache.maven.plugin.DefaultPluginManager.executeMojo(DefaultPluginManager.java:490)
	at hudson.maven.agent.PluginManagerInterceptor.executeMojo(PluginManagerInterceptor.java:182)
	at org.apache.maven.lifecycle.DefaultLifecycleExecutor.executeGoals(DefaultLifecycleExecutor.java:694)
	... 28 more
[INFO] ------------------------------------------------------------------------
[INFO] Total time: 7 minutes 35 seconds
[INFO] Finished at: Tue Aug 10 15:59:35 UTC 2010
[INFO] Final Memory: 137M/961M
[INFO] ------------------------------------------------------------------------


Mime
View raw message