aries-dev mailing list archives

Site index · List index
Message view « Date » · « Thread »
Top « Date » · « Thread »
From Apache Hudson Server <hud...@hudson.apache.org>
Subject Build failed in Hudson: Aries #835
Date Tue, 18 Jan 2011 21:06:36 GMT
See <https://hudson.apache.org/hudson/job/Aries/835/changes>

Changes:

[mnuttall] ARIES-527: Tidy up

[mnuttall] ARIES-527: Fix intermittent failures in jndi-url-itest

------------------------------------------
[...truncated 5989 lines...]
-------------------------------------------------------
 T E S T S
-------------------------------------------------------
There are no tests to run.

Results :

Tests run: 0, Failures: 0, Errors: 0, Skipped: 0

[HUDSON] Recording test results[INFO] [bundle:bundle {execution: default-bundle}]

[INFO] [ianal:verify-legal-files {execution: default}]
[INFO] Checking legal files in: org.apache.aries.application.noop.postresolve.process-0.3-SNAPSHOT.jar
[INFO] [install:install {execution: default-install}]
[INFO] Installing <https://hudson.apache.org/hudson/job/Aries/ws/aries/application/application-noop-postresolve-process/target/org.apache.aries.application.noop.postresolve.process-0.3-SNAPSHOT.jar>
to /home/hudson/.m2/repository/org/apache/aries/application/org.apache.aries.application.noop.postresolve.process/0.3-SNAPSHOT/org.apache.aries.application.noop.postresolve.process-0.3-SNAPSHOT.jar
[INFO] [bundle:install {execution: default-install}]
[WARNING] Exception while updating local OBR: Unable to read repository xml: file:/home/hudson/.m2/repository/repository.xml
org.apache.maven.plugin.MojoExecutionException: Unable to read repository xml: file:/home/hudson/.m2/repository/repository.xml
	at org.apache.felix.obrplugin.ObrUpdate.parseRepositoryXml(ObrUpdate.java:295)
	at org.apache.felix.obrplugin.ObrInstall.execute(ObrInstall.java:140)
	at org.apache.maven.plugin.DefaultPluginManager.executeMojo(DefaultPluginManager.java:490)
	at hudson.maven.agent.PluginManagerInterceptor.executeMojo(PluginManagerInterceptor.java:182)
	at org.apache.maven.lifecycle.DefaultLifecycleExecutor.executeGoals(DefaultLifecycleExecutor.java:694)
	at org.apache.maven.lifecycle.DefaultLifecycleExecutor.executeGoalWithLifecycle(DefaultLifecycleExecutor.java:556)
	at org.apache.maven.lifecycle.DefaultLifecycleExecutor.executeGoal(DefaultLifecycleExecutor.java:535)
	at org.apache.maven.lifecycle.DefaultLifecycleExecutor.executeGoalAndHandleFailures(DefaultLifecycleExecutor.java:387)
	at org.apache.maven.lifecycle.DefaultLifecycleExecutor.executeTaskSegments(DefaultLifecycleExecutor.java:348)
	at org.apache.maven.lifecycle.DefaultLifecycleExecutor.execute(DefaultLifecycleExecutor.java:180)
	at org.apache.maven.lifecycle.LifecycleExecutorInterceptor.execute(LifecycleExecutorInterceptor.java:65)
	at org.apache.maven.DefaultMaven.doExecute(DefaultMaven.java:328)
	at org.apache.maven.DefaultMaven.execute(DefaultMaven.java:138)
	at org.apache.maven.cli.MavenCli.main(MavenCli.java:362)
	at sun.reflect.NativeMethodAccessorImpl.invoke0(Native Method)
	at sun.reflect.NativeMethodAccessorImpl.invoke(NativeMethodAccessorImpl.java:39)
	at sun.reflect.DelegatingMethodAccessorImpl.invoke(DelegatingMethodAccessorImpl.java:25)
	at java.lang.reflect.Method.invoke(Method.java:597)
	at org.codehaus.classworlds.Launcher.launchEnhanced(Launcher.java:315)
	at org.codehaus.classworlds.Launcher.launch(Launcher.java:255)
	at hudson.maven.agent.Main.launch(Main.java:165)
	at hudson.maven.MavenBuilder.call(MavenBuilder.java:165)
	at hudson.maven.MavenModuleSetBuild$Builder.call(MavenModuleSetBuild.java:750)
	at hudson.maven.MavenModuleSetBuild$Builder.call(MavenModuleSetBuild.java:694)
	at hudson.remoting.UserRequest.perform(UserRequest.java:114)
	at hudson.remoting.UserRequest.perform(UserRequest.java:48)
	at hudson.remoting.Request$2.run(Request.java:270)
	at java.util.concurrent.Executors$RunnableAdapter.call(Executors.java:441)
	at java.util.concurrent.FutureTask$Sync.innerRun(FutureTask.java:303)
	at java.util.concurrent.FutureTask.run(FutureTask.java:138)
	at java.util.concurrent.ThreadPoolExecutor$Worker.runTask(ThreadPoolExecutor.java:886)
	at java.util.concurrent.ThreadPoolExecutor$Worker.run(ThreadPoolExecutor.java:908)
	at java.lang.Thread.run(Thread.java:619)
Caused by: org.xmlpull.v1.XmlPullParserException: unexpected type (position:END_DOCUMENT null@3:1
in java.io.InputStreamReader@cdbbb3) 
	at org.kxml2.io.KXmlParser.exception(Unknown Source)
	at org.kxml2.io.KXmlParser.nextTag(Unknown Source)
	at org.apache.felix.bundlerepository.impl.PullParser.parseRepository(PullParser.java:43)
	at org.apache.felix.bundlerepository.impl.DataModelHelperImpl.repository(DataModelHelperImpl.java:147)
	at org.apache.felix.bundlerepository.impl.DataModelHelperImpl.repository(DataModelHelperImpl.java:118)
	at org.apache.felix.obrplugin.ObrUpdate.parseRepositoryXml(ObrUpdate.java:291)
	... 32 more
[HUDSON] Archiving <https://hudson.apache.org/hudson/job/Aries/ws/aries/application/application-noop-postresolve-process/pom.xml>
to /home/hudson/hudson/jobs/Aries/modules/org.apache.aries.application$org.apache.aries.application.noop.postresolve.process/builds/2011-01-18_20-56-08/archive/org.apache.aries.application/org.apache.aries.application.noop.postresolve.process/0.3-SNAPSHOT/pom.xml
[HUDSON] Archiving <https://hudson.apache.org/hudson/job/Aries/ws/aries/application/application-noop-postresolve-process/target/org.apache.aries.application.noop.postresolve.process-0.3-SNAPSHOT.jar>
to /home/hudson/hudson/jobs/Aries/modules/org.apache.aries.application$org.apache.aries.application.noop.postresolve.process/builds/2011-01-18_20-56-08/archive/org.apache.aries.application/org.apache.aries.application.noop.postresolve.process/0.3-SNAPSHOT/org.apache.aries.application.noop.postresolve.process-0.3-SNAPSHOT.jar
[INFO] ------------------------------------------------------------------------
[INFO] Building Apache Aries Application Default local platform
[INFO]    task-segment: [clean, install]
[INFO] ------------------------------------------------------------------------
[INFO] [clean:clean {execution: default-clean}]
[INFO] Deleting file set: <https://hudson.apache.org/hudson/job/Aries/ws/aries/application/application-default-local-platform/target>
(included: [**], excluded: [])
[INFO] [enforcer:enforce {execution: default}]
[INFO] [antrun:run {execution: create-prop}]
[INFO] Executing tasks
     [echo] Maven version: 0.3-SNAPSHOT
     [echo] OSGi version: 0.3.0.SNAPSHOT
    [mkdir] Created dir: <https://hudson.apache.org/hudson/job/Aries/ws/aries/application/application-default-local-platform/target>
[INFO] Executed tasks
[INFO] [properties:read-project-properties {execution: default}]
[INFO] [remote-resources:process {execution: default}]
[INFO] [resources:resources {execution: default-resources}]
[INFO] Using 'UTF-8' encoding to copy filtered resources.
[INFO] Copying 1 resource
[INFO] skip non existing resourceDirectory <https://hudson.apache.org/hudson/job/Aries/ws/aries/application/application-default-local-platform/src/main/filtered-resources>
[INFO] Copying 4 resources
[INFO] [compiler:compile {execution: default-compile}]
[INFO] Compiling 1 source file to <https://hudson.apache.org/hudson/job/Aries/ws/aries/application/application-default-local-platform/target/classes>
[INFO] [resources:testResources {execution: default-testResources}]
[INFO] Using 'UTF-8' encoding to copy filtered resources.
[INFO] skip non existing resourceDirectory <https://hudson.apache.org/hudson/job/Aries/ws/aries/application/application-default-local-platform/src/test/resources>
[INFO] skip non existing resourceDirectory <https://hudson.apache.org/hudson/job/Aries/ws/aries/application/application-default-local-platform/src/test/filtered-resources>
[INFO] Copying 4 resources
[INFO] [compiler:testCompile {execution: default-testCompile}]
[INFO] No sources to compile
[INFO] [surefire:test {execution: default-test}]
[INFO] Surefire report directory: <https://hudson.apache.org/hudson/job/Aries/ws/aries/application/application-default-local-platform/target/surefire-reports>

-------------------------------------------------------
 T E S T S
-------------------------------------------------------
There are no tests to run.

Results :

Tests run: 0, Failures: 0, Errors: 0, Skipped: 0

[INFO] [bundle:bundle {execution: default-bundle}]
[HUDSON] Recording test results[INFO] [ianal:verify-legal-files {execution: default}]
[INFO] Checking legal files in: org.apache.aries.application.default.local.platform-0.3-SNAPSHOT.jar

[INFO] [install:install {execution: default-install}]
[INFO] Installing <https://hudson.apache.org/hudson/job/Aries/ws/aries/application/application-default-local-platform/target/org.apache.aries.application.default.local.platform-0.3-SNAPSHOT.jar>
to /home/hudson/.m2/repository/org/apache/aries/application/org.apache.aries.application.default.local.platform/0.3-SNAPSHOT/org.apache.aries.application.default.local.platform-0.3-SNAPSHOT.jar
[INFO] [bundle:install {execution: default-install}]
[WARNING] Exception while updating local OBR: Unable to read repository xml: file:/home/hudson/.m2/repository/repository.xml
org.apache.maven.plugin.MojoExecutionException: Unable to read repository xml: file:/home/hudson/.m2/repository/repository.xml
	at org.apache.felix.obrplugin.ObrUpdate.parseRepositoryXml(ObrUpdate.java:295)
	at org.apache.felix.obrplugin.ObrInstall.execute(ObrInstall.java:140)
	at org.apache.maven.plugin.DefaultPluginManager.executeMojo(DefaultPluginManager.java:490)
	at hudson.maven.agent.PluginManagerInterceptor.executeMojo(PluginManagerInterceptor.java:182)
	at org.apache.maven.lifecycle.DefaultLifecycleExecutor.executeGoals(DefaultLifecycleExecutor.java:694)
	at org.apache.maven.lifecycle.DefaultLifecycleExecutor.executeGoalWithLifecycle(DefaultLifecycleExecutor.java:556)
	at org.apache.maven.lifecycle.DefaultLifecycleExecutor.executeGoal(DefaultLifecycleExecutor.java:535)
	at org.apache.maven.lifecycle.DefaultLifecycleExecutor.executeGoalAndHandleFailures(DefaultLifecycleExecutor.java:387)
	at org.apache.maven.lifecycle.DefaultLifecycleExecutor.executeTaskSegments(DefaultLifecycleExecutor.java:348)
	at org.apache.maven.lifecycle.DefaultLifecycleExecutor.execute(DefaultLifecycleExecutor.java:180)
	at org.apache.maven.lifecycle.LifecycleExecutorInterceptor.execute(LifecycleExecutorInterceptor.java:65)
	at org.apache.maven.DefaultMaven.doExecute(DefaultMaven.java:328)
	at org.apache.maven.DefaultMaven.execute(DefaultMaven.java:138)
	at org.apache.maven.cli.MavenCli.main(MavenCli.java:362)
	at sun.reflect.NativeMethodAccessorImpl.invoke0(Native Method)
	at sun.reflect.NativeMethodAccessorImpl.invoke(NativeMethodAccessorImpl.java:39)
	at sun.reflect.DelegatingMethodAccessorImpl.invoke(DelegatingMethodAccessorImpl.java:25)
	at java.lang.reflect.Method.invoke(Method.java:597)
	at org.codehaus.classworlds.Launcher.launchEnhanced(Launcher.java:315)
	at org.codehaus.classworlds.Launcher.launch(Launcher.java:255)
	at hudson.maven.agent.Main.launch(Main.java:165)
	at hudson.maven.MavenBuilder.call(MavenBuilder.java:165)
	at hudson.maven.MavenModuleSetBuild$Builder.call(MavenModuleSetBuild.java:750)
	at hudson.maven.MavenModuleSetBuild$Builder.call(MavenModuleSetBuild.java:694)
	at hudson.remoting.UserRequest.perform(UserRequest.java:114)
	at hudson.remoting.UserRequest.perform(UserRequest.java:48)
	at hudson.remoting.Request$2.run(Request.java:270)
	at java.util.concurrent.Executors$RunnableAdapter.call(Executors.java:441)
	at java.util.concurrent.FutureTask$Sync.innerRun(FutureTask.java:303)
	at java.util.concurrent.FutureTask.run(FutureTask.java:138)
	at java.util.concurrent.ThreadPoolExecutor$Worker.runTask(ThreadPoolExecutor.java:886)
	at java.util.concurrent.ThreadPoolExecutor$Worker.run(ThreadPoolExecutor.java:908)
	at java.lang.Thread.run(Thread.java:619)
Caused by: org.xmlpull.v1.XmlPullParserException: unexpected type (position:END_DOCUMENT null@3:1
in java.io.InputStreamReader@4bf9da) 
	at org.kxml2.io.KXmlParser.exception(Unknown Source)
	at org.kxml2.io.KXmlParser.nextTag(Unknown Source)
	at org.apache.felix.bundlerepository.impl.PullParser.parseRepository(PullParser.java:43)
	at org.apache.felix.bundlerepository.impl.DataModelHelperImpl.repository(DataModelHelperImpl.java:147)
	at org.apache.felix.bundlerepository.impl.DataModelHelperImpl.repository(DataModelHelperImpl.java:118)
	at org.apache.felix.obrplugin.ObrUpdate.parseRepositoryXml(ObrUpdate.java:291)
	... 32 more
[HUDSON] Archiving <https://hudson.apache.org/hudson/job/Aries/ws/aries/application/application-default-local-platform/pom.xml>
to /home/hudson/hudson/jobs/Aries/modules/org.apache.aries.application$org.apache.aries.application.default.local.platform/builds/2011-01-18_20-56-08/archive/org.apache.aries.application/org.apache.aries.application.default.local.platform/0.3-SNAPSHOT/pom.xml
[HUDSON] Archiving <https://hudson.apache.org/hudson/job/Aries/ws/aries/application/application-default-local-platform/target/org.apache.aries.application.default.local.platform-0.3-SNAPSHOT.jar>
to /home/hudson/hudson/jobs/Aries/modules/org.apache.aries.application$org.apache.aries.application.default.local.platform/builds/2011-01-18_20-56-08/archive/org.apache.aries.application/org.apache.aries.application.default.local.platform/0.3-SNAPSHOT/org.apache.aries.application.default.local.platform-0.3-SNAPSHOT.jar
[INFO] ------------------------------------------------------------------------
[INFO] Building Apache Aries Application integration tests
[INFO]    task-segment: [clean, install]
[INFO] ------------------------------------------------------------------------
[INFO] [clean:clean {execution: default-clean}]
[INFO] Deleting file set: <https://hudson.apache.org/hudson/job/Aries/ws/aries/application/application-itests/target>
(included: [**], excluded: [])
[INFO] snapshot org.apache.aries.application:org.apache.aries.application.runtime.itest.interfaces:0.3-SNAPSHOT:
checking for updates from codehaus.snapshots
[INFO] snapshot org.apache.aries.application:org.apache.aries.application.runtime.itest.interfaces:0.3-SNAPSHOT:
checking for updates from apache.snapshots
[INFO] snapshot org.apache.aries.application:org.apache.aries.application.runtime.framework.management:0.3-SNAPSHOT:
checking for updates from codehaus.snapshots
[INFO] snapshot org.apache.aries.application:org.apache.aries.application.runtime.framework.management:0.3-SNAPSHOT:
checking for updates from apache.snapshots
[INFO] snapshot org.apache.aries.application:org.apache.aries.application.runtime.repository:0.3-SNAPSHOT:
checking for updates from codehaus.snapshots
[INFO] snapshot org.apache.aries.application:org.apache.aries.application.runtime.repository:0.3-SNAPSHOT:
checking for updates from apache.snapshots
[INFO] snapshot org.apache.aries.application:org.apache.aries.application.runtime.isolated:0.3-SNAPSHOT:
checking for updates from codehaus.snapshots
[INFO] snapshot org.apache.aries.application:org.apache.aries.application.runtime.isolated:0.3-SNAPSHOT:
checking for updates from apache.snapshots
[INFO] snapshot org.apache.aries.application:org.apache.aries.application.runtime:0.3-SNAPSHOT:
checking for updates from codehaus.snapshots
[INFO] snapshot org.apache.aries.application:org.apache.aries.application.runtime:0.3-SNAPSHOT:
checking for updates from apache.snapshots
[INFO] snapshot org.apache.aries.application:org.apache.aries.application.resolver.obr:0.3-SNAPSHOT:
checking for updates from codehaus.snapshots
[INFO] snapshot org.apache.aries.application:org.apache.aries.application.resolver.obr:0.3-SNAPSHOT:
checking for updates from apache.snapshots
[INFO] snapshot org.apache.aries.application:org.apache.aries.application.resolver.noop:0.3-SNAPSHOT:
checking for updates from codehaus.snapshots
[INFO] snapshot org.apache.aries.application:org.apache.aries.application.resolver.noop:0.3-SNAPSHOT:
checking for updates from apache.snapshots
[INFO] snapshot org.apache.aries.application:org.apache.aries.application.noop.platform.repo:0.3-SNAPSHOT:
checking for updates from codehaus.snapshots
[INFO] snapshot org.apache.aries.application:org.apache.aries.application.noop.platform.repo:0.3-SNAPSHOT:
checking for updates from apache.snapshots
[INFO] snapshot org.apache.aries.application:org.apache.aries.application.noop.postresolve.process:0.3-SNAPSHOT:
checking for updates from codehaus.snapshots
[INFO] snapshot org.apache.aries.application:org.apache.aries.application.noop.postresolve.process:0.3-SNAPSHOT:
checking for updates from apache.snapshots
[INFO] snapshot org.apache.aries.application:org.apache.aries.application.default.local.platform:0.3-SNAPSHOT:
checking for updates from codehaus.snapshots
[INFO] snapshot org.apache.aries.application:org.apache.aries.application.default.local.platform:0.3-SNAPSHOT:
checking for updates from apache.snapshots
[INFO] [enforcer:enforce {execution: default}]
[INFO] [antrun:run {execution: create-prop}]
[INFO] Executing tasks
     [echo] Maven version: 0.3-SNAPSHOT
     [echo] OSGi version: 0.3.0.SNAPSHOT
    [mkdir] Created dir: <https://hudson.apache.org/hudson/job/Aries/ws/aries/application/application-itests/target>
[INFO] Executed tasks
[INFO] [properties:read-project-properties {execution: default}]
[INFO] [remote-resources:process {execution: default}]
[INFO] [depends:generate-depends-file {execution: generate-depends-file}]
[INFO] Created: <https://hudson.apache.org/hudson/job/Aries/ws/aries/application/application-itests/target/test-classes/META-INF/maven/dependencies.properties>
[INFO] [resources:resources {execution: default-resources}]
[INFO] Using 'UTF-8' encoding to copy filtered resources.
[INFO] skip non existing resourceDirectory <https://hudson.apache.org/hudson/job/Aries/ws/aries/application/application-itests/src/main/resources>
[INFO] skip non existing resourceDirectory <https://hudson.apache.org/hudson/job/Aries/ws/aries/application/application-itests/src/main/filtered-resources>
[INFO] Copying 4 resources
[INFO] [compiler:compile {execution: default-compile}]
[INFO] No sources to compile
[INFO] [resources:testResources {execution: default-testResources}]
[INFO] Using 'UTF-8' encoding to copy filtered resources.
[INFO] Copying 14 resources
[INFO] skip non existing resourceDirectory <https://hudson.apache.org/hudson/job/Aries/ws/aries/application/application-itests/src/test/filtered-resources>
[INFO] Copying 4 resources
[INFO] [compiler:testCompile {execution: default-testCompile}]
[INFO] Compiling 15 source files to <https://hudson.apache.org/hudson/job/Aries/ws/aries/application/application-itests/target/test-classes>
[WARNING] <https://hudson.apache.org/hudson/job/Aries/ws/aries/application/application-itests/src/test/java/org/apache/aries/application/runtime/itests/util/IsolationTestUtils.java>:[48,33]
[deprecation] org.osgi.service.framework.CompositeBundle in org.osgi.service.framework has
been deprecated

[WARNING] <https://hudson.apache.org/hudson/job/Aries/ws/aries/application/application-itests/src/test/java/org/apache/aries/application/runtime/itests/util/IsolationTestUtils.java>:[63,40]
[deprecation] org.osgi.service.framework.CompositeBundle in org.osgi.service.framework has
been deprecated

[WARNING] <https://hudson.apache.org/hudson/job/Aries/ws/aries/application/application-itests/src/test/java/org/apache/aries/application/runtime/itests/util/IsolationTestUtils.java>:[68,21]
[deprecation] org.osgi.service.framework.CompositeBundle in org.osgi.service.framework has
been deprecated

[WARNING] <https://hudson.apache.org/hudson/job/Aries/ws/aries/application/application-itests/src/test/java/org/apache/aries/application/runtime/itests/util/IsolationTestUtils.java>:[101,75]
[deprecation] toURL() in java.io.File has been deprecated

[INFO] [surefire:test {execution: default-test}]
[INFO] Surefire report directory: <https://hudson.apache.org/hudson/job/Aries/ws/aries/application/application-itests/target/surefire-reports>

-------------------------------------------------------
 T E S T S
-------------------------------------------------------
Running org.apache.aries.application.runtime.itests.IsolatedRuntimeTest
Build timed out. Aborting
killed.
[HUDSON] Recording test results
Sending e-mails to: dev@aries.apache.org
[INFO] ------------------------------------------------------------------------
[ERROR] FATAL ERROR
[INFO] ------------------------------------------------------------------------
[INFO] Unable to call isArchivingDisabled. Invalid object ID 21
[INFO] ------------------------------------------------------------------------
[INFO] Trace
java.lang.IllegalStateException: Unable to call isArchivingDisabled. Invalid object ID 21
	at hudson.remoting.RemoteInvocationHandler$RPCRequest.perform(RemoteInvocationHandler.java:268)
	at hudson.remoting.RemoteInvocationHandler$RPCRequest.call(RemoteInvocationHandler.java:255)
	at hudson.remoting.RemoteInvocationHandler$RPCRequest.call(RemoteInvocationHandler.java:215)
	at hudson.remoting.UserRequest.perform(UserRequest.java:114)
	at hudson.remoting.UserRequest.perform(UserRequest.java:48)
	at hudson.remoting.Request$2.run(Request.java:270)
	at java.util.concurrent.Executors$RunnableAdapter.call(Executors.java:441)
	at java.util.concurrent.FutureTask$Sync.innerRun(FutureTask.java:303)
	at java.util.concurrent.FutureTask.run(FutureTask.java:138)
	at java.util.concurrent.ThreadPoolExecutor$Worker.runTask(ThreadPoolExecutor.java:886)
	at java.util.concurrent.ThreadPoolExecutor$Worker.run(ThreadPoolExecutor.java:908)
	at java.lang.Thread.run(Thread.java:662)
[INFO] ------------------------------------------------------------------------
[INFO] Total time: 10 minutes 2 seconds
[INFO] Finished at: Tue Jan 18 21:06:27 UTC 2011
[INFO] Final Memory: 151M/961M
[INFO] ------------------------------------------------------------------------
channel stopped


Mime
View raw message