aries-dev mailing list archives

Site index · List index
Message view « Date » · « Thread »
Top « Date » · « Thread »
From Apache Jenkins Server <jenk...@builds.apache.org>
Subject Build failed in Jenkins: Aries #1166
Date Mon, 10 Oct 2011 15:53:02 GMT
See <https://builds.apache.org/job/Aries/1166/changes>

Changes:

[hughesj] [maven-release-plugin] prepare release org.apache.aries.testsupport.unit-0.4

[hughesj] Use 0.5 parent

------------------------------------------
[...truncated 600 lines...]
-------------------------------------------------------
There are no tests to run.

Results :

Tests run: 0, Failures: 0, Errors: 0, Skipped: 0

[JENKINS] Recording test results
[INFO] [enforcer:enforce {execution: check-java15}]
[INFO] Checking unresolved references to org.codehaus.mojo.signature:java15:1.0
[INFO] [bundle:bundle {execution: default-bundle}]
java.lang.NullPointerException
	at java.util.regex.Matcher.getTextLength(Matcher.java:1140)
	at java.util.regex.Matcher.reset(Matcher.java:291)
	at java.util.regex.Matcher.<init>(Matcher.java:211)
	at java.util.regex.Pattern.matcher(Pattern.java:888)
	at aQute.libg.version.Version.<init>(Version.java:43)
	at aQute.lib.osgi.Macro.version(Macro.java:633)
	at aQute.lib.osgi.Macro._range(Macro.java:713)
	at sun.reflect.NativeMethodAccessorImpl.invoke0(Native Method)
	at sun.reflect.NativeMethodAccessorImpl.invoke(NativeMethodAccessorImpl.java:39)
	at sun.reflect.DelegatingMethodAccessorImpl.invoke(DelegatingMethodAccessorImpl.java:25)
	at java.lang.reflect.Method.invoke(Method.java:597)
	at aQute.lib.osgi.Macro.doCommand(Macro.java:180)
	at aQute.lib.osgi.Macro.doCommands(Macro.java:169)
	at aQute.lib.osgi.Macro.replace(Macro.java:116)
	at aQute.lib.osgi.Macro.process(Macro.java:62)
	at aQute.lib.osgi.Macro.process(Macro.java:77)
	at aQute.lib.osgi.Macro.process(Macro.java:49)
	at aQute.lib.osgi.Macro.process(Macro.java:44)
	at aQute.lib.osgi.Processor.getProperty(Processor.java:622)
	at aQute.lib.osgi.Processor.getProperty(Processor.java:395)
	at aQute.lib.osgi.Analyzer.getImportPackages(Analyzer.java:258)
	at aQute.lib.osgi.Builder.getImportPackages(Builder.java:249)
	at aQute.lib.osgi.Analyzer.analyze(Analyzer.java:154)
	at aQute.lib.osgi.Builder.analyze(Builder.java:296)
	at aQute.lib.osgi.Analyzer.calcManifest(Analyzer.java:292)
	at aQute.lib.osgi.Builder.build(Builder.java:68)
	at org.apache.felix.bundleplugin.BundlePlugin.buildOSGiBundle(BundlePlugin.java:375)
	at org.apache.felix.bundleplugin.BundlePlugin.execute(BundlePlugin.java:270)
	at org.apache.felix.bundleplugin.BundlePlugin.execute(BundlePlugin.java:224)
	at org.apache.felix.bundleplugin.BundlePlugin.execute(BundlePlugin.java:215)
	at org.apache.maven.plugin.DefaultPluginManager.executeMojo(DefaultPluginManager.java:490)
	at hudson.maven.agent.PluginManagerInterceptor.executeMojo(PluginManagerInterceptor.java:182)
	at org.apache.maven.lifecycle.DefaultLifecycleExecutor.executeGoals(DefaultLifecycleExecutor.java:694)
	at org.apache.maven.lifecycle.DefaultLifecycleExecutor.executeGoalWithLifecycle(DefaultLifecycleExecutor.java:556)
	at org.apache.maven.lifecycle.DefaultLifecycleExecutor.executeGoal(DefaultLifecycleExecutor.java:535)
	at org.apache.maven.lifecycle.DefaultLifecycleExecutor.executeGoalAndHandleFailures(DefaultLifecycleExecutor.java:387)
	at org.apache.maven.lifecycle.DefaultLifecycleExecutor.executeTaskSegments(DefaultLifecycleExecutor.java:348)
	at org.apache.maven.lifecycle.DefaultLifecycleExecutor.execute(DefaultLifecycleExecutor.java:180)
	at org.apache.maven.lifecycle.LifecycleExecutorInterceptor.execute(LifecycleExecutorInterceptor.java:65)
	at org.apache.maven.DefaultMaven.doExecute(DefaultMaven.java:328)
	at org.apache.maven.DefaultMaven.execute(DefaultMaven.java:138)
	at org.apache.maven.cli.MavenCli.main(MavenCli.java:362)
	at sun.reflect.NativeMethodAccessorImpl.invoke0(Native Method)
	at sun.reflect.NativeMethodAccessorImpl.invoke(NativeMethodAccessorImpl.java:39)
	at sun.reflect.DelegatingMethodAccessorImpl.invoke(DelegatingMethodAccessorImpl.java:25)
	at java.lang.reflect.Method.invoke(Method.java:597)
	at org.codehaus.classworlds.Launcher.launchEnhanced(Launcher.java:315)
	at org.codehaus.classworlds.Launcher.launch(Launcher.java:255)
	at hudson.maven.agent.Main.launch(Main.java:185)
	at hudson.maven.MavenBuilder.call(MavenBuilder.java:160)
	at hudson.maven.MavenModuleSetBuild$Builder.call(MavenModuleSetBuild.java:1059)
	at hudson.maven.MavenModuleSetBuild$Builder.call(MavenModuleSetBuild.java:990)
	at hudson.remoting.UserRequest.perform(UserRequest.java:118)
	at hudson.remoting.UserRequest.perform(UserRequest.java:48)
	at hudson.remoting.Request$2.run(Request.java:287)
	at java.util.concurrent.Executors$RunnableAdapter.call(Executors.java:441)
	at java.util.concurrent.FutureTask$Sync.innerRun(FutureTask.java:303)
	at java.util.concurrent.FutureTask.run(FutureTask.java:138)
	at java.util.concurrent.ThreadPoolExecutor$Worker.runTask(ThreadPoolExecutor.java:886)
	at java.util.concurrent.ThreadPoolExecutor$Worker.run(ThreadPoolExecutor.java:908)
	at java.lang.Thread.run(Thread.java:619)
[WARNING] Warning building bundle org.apache.aries.proxy:org.apache.aries.proxy.api:bundle:0.4-SNAPSHOT
: Exception in replace: java.lang.NullPointerException
[WARNING] Warning building bundle org.apache.aries.proxy:org.apache.aries.proxy.api:bundle:0.4-SNAPSHOT
: No translation found for macro: range;[==,=+)
[INFO] [ianal:verify-legal-files {execution: default}]
[INFO] Checking legal files in: org.apache.aries.proxy.api-0.4-SNAPSHOT.jar
[INFO] [install:install {execution: default-install}]
[INFO] Installing <https://builds.apache.org/job/Aries/ws/aries/proxy/proxy-api/target/org.apache.aries.proxy.api-0.4-SNAPSHOT.jar>
to /home/jenkins/.m2/repository/org/apache/aries/proxy/org.apache.aries.proxy.api/0.4-SNAPSHOT/org.apache.aries.proxy.api-0.4-SNAPSHOT.jar
[INFO] [bundle:install {execution: default-install}]
[INFO] Installing org/apache/aries/proxy/org.apache.aries.proxy.api/0.4-SNAPSHOT/org.apache.aries.proxy.api-0.4-SNAPSHOT.jar
[INFO] Writing OBR metadata
[JENKINS] Archiving <https://builds.apache.org/job/Aries/ws/aries/proxy/proxy-api/pom.xml>
to /home/hudson/hudson/jobs/Aries/modules/org.apache.aries.proxy$org.apache.aries.proxy.api/builds/2011-10-10_15-52-14/archive/org.apache.aries.proxy/org.apache.aries.proxy.api/0.4-SNAPSHOT/org.apache.aries.proxy.api-0.4-SNAPSHOT.pom
[JENKINS] Archiving <https://builds.apache.org/job/Aries/ws/aries/proxy/proxy-api/target/org.apache.aries.proxy.api-0.4-SNAPSHOT.jar>
to /home/hudson/hudson/jobs/Aries/modules/org.apache.aries.proxy$org.apache.aries.proxy.api/builds/2011-10-10_15-52-14/archive/org.apache.aries.proxy/org.apache.aries.proxy.api/0.4-SNAPSHOT/org.apache.aries.proxy.api-0.4-SNAPSHOT.jar
[INFO] ------------------------------------------------------------------------
[INFO] Building Apache Aries Proxy Service
[INFO]    task-segment: [clean, install]
[INFO] ------------------------------------------------------------------------
[INFO] [clean:clean {execution: default-clean}]
[INFO] Deleting file set: <https://builds.apache.org/job/Aries/ws/aries/proxy/proxy-impl/target>
(included: [**], excluded: [])
[WARNING] POM for 'org.osgi:org.osgi.core:pom:4.3.0:provided' is invalid.

Its dependencies (if any) will NOT be available to the current build.
[INFO] snapshot org.apache.aries.testsupport:org.apache.aries.testsupport.unit:0.4-SNAPSHOT:
checking for updates from codehaus.snapshots
[INFO] snapshot org.apache.aries.testsupport:org.apache.aries.testsupport.unit:0.4-SNAPSHOT:
checking for updates from EclipseLink Repo
[INFO] snapshot org.apache.aries.testsupport:org.apache.aries.testsupport.unit:0.4-SNAPSHOT:
checking for updates from apache.snapshots
Downloading: http://snapshots.repository.codehaus.org/org/apache/aries/testsupport/org.apache.aries.testsupport.unit/0.4-SNAPSHOT/org.apache.aries.testsupport.unit-0.4-SNAPSHOT.pom
[INFO] Unable to find resource 'org.apache.aries.testsupport:org.apache.aries.testsupport.unit:pom:0.4-SNAPSHOT'
in repository codehaus.snapshots (http://snapshots.repository.codehaus.org)
Downloading: http://www.mirrorservice.org/sites/download.eclipse.org/eclipseMirror/rt/eclipselink/maven.repo//org/apache/aries/testsupport/org.apache.aries.testsupport.unit/0.4-SNAPSHOT/org.apache.aries.testsupport.unit-0.4-SNAPSHOT.pom
[INFO] Unable to find resource 'org.apache.aries.testsupport:org.apache.aries.testsupport.unit:pom:0.4-SNAPSHOT'
in repository EclipseLink Repo (http://www.mirrorservice.org/sites/download.eclipse.org/eclipseMirror/rt/eclipselink/maven.repo/)
Downloading: http://repository.apache.org/snapshots/org/apache/aries/testsupport/org.apache.aries.testsupport.unit/0.4-SNAPSHOT/org.apache.aries.testsupport.unit-0.4-SNAPSHOT.pom
[INFO] Unable to find resource 'org.apache.aries.testsupport:org.apache.aries.testsupport.unit:pom:0.4-SNAPSHOT'
in repository apache.snapshots (http://repository.apache.org/snapshots)
[INFO] snapshot org.apache.aries.proxy:org.apache.aries.proxy.api:0.4-SNAPSHOT: checking for
updates from codehaus.snapshots
Downloading: http://snapshots.repository.codehaus.org/org/apache/aries/testsupport/org.apache.aries.testsupport.unit/0.4-SNAPSHOT/org.apache.aries.testsupport.unit-0.4-SNAPSHOT.jar
[INFO] snapshot org.apache.aries.proxy:org.apache.aries.proxy.api:0.4-SNAPSHOT: checking for
updates from EclipseLink Repo
[INFO] Unable to find resource 'org.apache.aries.testsupport:org.apache.aries.testsupport.unit:jar:0.4-SNAPSHOT'
in repository codehaus.snapshots (http://snapshots.repository.codehaus.org)
Downloading: http://www.mirrorservice.org/sites/download.eclipse.org/eclipseMirror/rt/eclipselink/maven.repo//org/apache/aries/testsupport/org.apache.aries.testsupport.unit/0.4-SNAPSHOT/org.apache.aries.testsupport.unit-0.4-SNAPSHOT.jar
[INFO] snapshot org.apache.aries.proxy:org.apache.aries.proxy.api:0.4-SNAPSHOT: checking for
updates from apache.snapshots
[INFO] Unable to find resource 'org.apache.aries.testsupport:org.apache.aries.testsupport.unit:jar:0.4-SNAPSHOT'
in repository EclipseLink Repo (http://www.mirrorservice.org/sites/download.eclipse.org/eclipseMirror/rt/eclipselink/maven.repo/)
Downloading: http://repository.apache.org/snapshots/org/apache/aries/testsupport/org.apache.aries.testsupport.unit/0.4-SNAPSHOT/org.apache.aries.testsupport.unit-0.4-SNAPSHOT.jar
[INFO] Unable to find resource 'org.apache.aries.testsupport:org.apache.aries.testsupport.unit:jar:0.4-SNAPSHOT'
in repository apache.snapshots (http://repository.apache.org/snapshots)
[JENKINS] Archiving <https://builds.apache.org/job/Aries/ws/aries/proxy/proxy-impl/pom.xml>
to /home/hudson/hudson/jobs/Aries/modules/org.apache.aries.proxy$org.apache.aries.proxy.impl/builds/2011-10-10_15-52-14/archive/org.apache.aries.proxy/org.apache.aries.proxy.impl/0.4-SNAPSHOT/org.apache.aries.proxy.impl-0.4-SNAPSHOT.pom
[INFO] ------------------------------------------------------------------------
[ERROR] BUILD ERROR
[INFO] ------------------------------------------------------------------------
[INFO] Failed to resolve artifact.

Missing:
----------
1) org.apache.aries.testsupport:org.apache.aries.testsupport.unit:jar:0.4-SNAPSHOT

  Try downloading the file manually from the project website.

  Then, install it using the command: 
      mvn install:install-file -DgroupId=org.apache.aries.testsupport -DartifactId=org.apache.aries.testsupport.unit
-Dversion=0.4-SNAPSHOT -Dpackaging=jar -Dfile=/path/to/file

  Alternatively, if you host your own repository you can deploy the file there: 
      mvn deploy:deploy-file -DgroupId=org.apache.aries.testsupport -DartifactId=org.apache.aries.testsupport.unit
-Dversion=0.4-SNAPSHOT -Dpackaging=jar -Dfile=/path/to/file -Durl=[url] -DrepositoryId=[id]

  Path to dependency: 
  	1) org.apache.aries.proxy:org.apache.aries.proxy.impl:bundle:0.4-SNAPSHOT
  	2) org.apache.aries.testsupport:org.apache.aries.testsupport.unit:jar:0.4-SNAPSHOT

----------
1 required artifact is missing.

for artifact: 
  org.apache.aries.proxy:org.apache.aries.proxy.impl:bundle:0.4-SNAPSHOT

from the specified remote repositories:
  codehaus.snapshots (http://snapshots.repository.codehaus.org),
  central (http://repo1.maven.org/maven2),
  Nexus (http://repository.apache.org/snapshots),
  EclipseLink Repo (http://www.mirrorservice.org/sites/download.eclipse.org/eclipseMirror/rt/eclipselink/maven.repo/)



[INFO] ------------------------------------------------------------------------
[INFO] Trace
org.apache.maven.lifecycle.LifecycleExecutionException: Missing:
----------
1) org.apache.aries.testsupport:org.apache.aries.testsupport.unit:jar:0.4-SNAPSHOT

  Try downloading the file manually from the project website.

  Then, install it using the command: 
      mvn install:install-file -DgroupId=org.apache.aries.testsupport -DartifactId=org.apache.aries.testsupport.unit
-Dversion=0.4-SNAPSHOT -Dpackaging=jar -Dfile=/path/to/file

  Alternatively, if you host your own repository you can deploy the file there: 
      mvn deploy:deploy-file -DgroupId=org.apache.aries.testsupport -DartifactId=org.apache.aries.testsupport.unit
-Dversion=0.4-SNAPSHOT -Dpackaging=jar -Dfile=/path/to/file -Durl=[url] -DrepositoryId=[id]

  Path to dependency: 
  	1) org.apache.aries.proxy:org.apache.aries.proxy.impl:bundle:0.4-SNAPSHOT
  	2) org.apache.aries.testsupport:org.apache.aries.testsupport.unit:jar:0.4-SNAPSHOT

----------
1 required artifact is missing.

for artifact: 
  org.apache.aries.proxy:org.apache.aries.proxy.impl:bundle:0.4-SNAPSHOT

from the specified remote repositories:
  codehaus.snapshots (http://snapshots.repository.codehaus.org),
  central (http://repo1.maven.org/maven2),
  Nexus (http://repository.apache.org/snapshots),
  EclipseLink Repo (http://www.mirrorservice.org/sites/download.eclipse.org/eclipseMirror/rt/eclipselink/maven.repo/)


	at org.apache.maven.lifecycle.DefaultLifecycleExecutor.executeGoals(DefaultLifecycleExecutor.java:711)
	at org.apache.maven.lifecycle.DefaultLifecycleExecutor.executeGoalWithLifecycle(DefaultLifecycleExecutor.java:556)
	at org.apache.maven.lifecycle.DefaultLifecycleExecutor.executeGoal(DefaultLifecycleExecutor.java:535)
	at org.apache.maven.lifecycle.DefaultLifecycleExecutor.executeGoalAndHandleFailures(DefaultLifecycleExecutor.java:387)
	at org.apache.maven.lifecycle.DefaultLifecycleExecutor.executeTaskSegments(DefaultLifecycleExecutor.java:348)
	at org.apache.maven.lifecycle.DefaultLifecycleExecutor.execute(DefaultLifecycleExecutor.java:180)
	at org.apache.maven.lifecycle.LifecycleExecutorInterceptor.execute(LifecycleExecutorInterceptor.java:65)
	at org.apache.maven.DefaultMaven.doExecute(DefaultMaven.java:328)
	at org.apache.maven.DefaultMaven.execute(DefaultMaven.java:138)
	at org.apache.maven.cli.MavenCli.main(MavenCli.java:362)
	at sun.reflect.NativeMethodAccessorImpl.invoke0(Native Method)
	at sun.reflect.NativeMethodAccessorImpl.invoke(NativeMethodAccessorImpl.java:39)
	at sun.reflect.DelegatingMethodAccessorImpl.invoke(DelegatingMethodAccessorImpl.java:25)
	at java.lang.reflect.Method.invoke(Method.java:597)
	at org.codehaus.classworlds.Launcher.launchEnhanced(Launcher.java:315)
	at org.codehaus.classworlds.Launcher.launch(Launcher.java:255)
	at hudson.maven.agent.Main.launch(Main.java:185)
	at hudson.maven.MavenBuilder.call(MavenBuilder.java:160)
	at hudson.maven.MavenModuleSetBuild$Builder.call(MavenModuleSetBuild.java:1059)
	at hudson.maven.MavenModuleSetBuild$Builder.call(MavenModuleSetBuild.java:990)
	at hudson.remoting.UserRequest.perform(UserRequest.java:118)
	at hudson.remoting.UserRequest.perform(UserRequest.java:48)
	at hudson.remoting.Request$2.run(Request.java:287)
	at java.util.concurrent.Executors$RunnableAdapter.call(Executors.java:441)
	at java.util.concurrent.FutureTask$Sync.innerRun(FutureTask.java:303)
	at java.util.concurrent.FutureTask.run(FutureTask.java:138)
	at java.util.concurrent.ThreadPoolExecutor$Worker.runTask(ThreadPoolExecutor.java:886)
	at java.util.concurrent.ThreadPoolExecutor$Worker.run(ThreadPoolExecutor.java:908)
	at java.lang.Thread.run(Thread.java:619)
Caused by: org.apache.maven.artifact.resolver.MultipleArtifactsNotFoundException: Missing:
----------
1) org.apache.aries.testsupport:org.apache.aries.testsupport.unit:jar:0.4-SNAPSHOT

  Try downloading the file manually from the project website.

  Then, install it using the command: 
      mvn install:install-file -DgroupId=org.apache.aries.testsupport -DartifactId=org.apache.aries.testsupport.unit
-Dversion=0.4-SNAPSHOT -Dpackaging=jar -Dfile=/path/to/file

  Alternatively, if you host your own repository you can deploy the file there: 
      mvn deploy:deploy-file -DgroupId=org.apache.aries.testsupport -DartifactId=org.apache.aries.testsupport.unit
-Dversion=0.4-SNAPSHOT -Dpackaging=jar -Dfile=/path/to/file -Durl=[url] -DrepositoryId=[id]

  Path to dependency: 
  	1) org.apache.aries.proxy:org.apache.aries.proxy.impl:bundle:0.4-SNAPSHOT
  	2) org.apache.aries.testsupport:org.apache.aries.testsupport.unit:jar:0.4-SNAPSHOT

----------
1 required artifact is missing.

for artifact: 
  org.apache.aries.proxy:org.apache.aries.proxy.impl:bundle:0.4-SNAPSHOT

from the specified remote repositories:
  codehaus.snapshots (http://snapshots.repository.codehaus.org),
  central (http://repo1.maven.org/maven2),
  Nexus (http://repository.apache.org/snapshots),
  EclipseLink Repo (http://www.mirrorservice.org/sites/download.eclipse.org/eclipseMirror/rt/eclipselink/maven.repo/)


	at org.apache.maven.artifact.resolver.DefaultArtifactResolver.resolveTransitively(DefaultArtifactResolver.java:360)
	at org.apache.maven.artifact.resolver.DefaultArtifactResolver.resolveTransitively(DefaultArtifactResolver.java:304)
	at org.apache.maven.plugin.DefaultPluginManager.resolveTransitiveDependencies(DefaultPluginManager.java:1499)
	at org.apache.maven.plugin.DefaultPluginManager.executeMojo(DefaultPluginManager.java:442)
	at hudson.maven.agent.PluginManagerInterceptor.executeMojo(PluginManagerInterceptor.java:182)
	at org.apache.maven.lifecycle.DefaultLifecycleExecutor.executeGoals(DefaultLifecycleExecutor.java:694)
	... 28 more
[INFO] ------------------------------------------------------------------------
[INFO] Total time: 37 seconds
[INFO] Finished at: Mon Oct 10 15:52:59 UTC 2011
[INFO] Final Memory: 112M/428M
[INFO] ------------------------------------------------------------------------
channel stopped


Mime
View raw message