aries-dev mailing list archives

Site index · List index
Message view « Date » · « Thread »
Top « Date » · « Thread »
From Apache Jenkins Server <jenk...@builds.apache.org>
Subject Build failed in Jenkins: Aries #1175
Date Wed, 12 Oct 2011 15:53:49 GMT
See <https://builds.apache.org/job/Aries/1175/changes>

Changes:

[hughesj] [maven-release-plugin] prepare for next development iteration

[hughesj] [maven-release-plugin] prepare release org.apache.aries.quiesce.manager.itest-0.3.1

[hughesj] Inserted missing scm elementwq

[hughesj] mvn release:prepare failure, reverting back to pre-prapre state

------------------------------------------
[...truncated 2553 lines...]
[INFO] ------------------------------------------------------------------------
[INFO] [clean:clean {execution: default-clean}]
[INFO] Deleting file set: <https://builds.apache.org/job/Aries/ws/aries/blueprint/blueprint-testbundleb/target>
(included: [**], excluded: [])
[INFO] snapshot org.apache.aries.blueprint:org.apache.aries.blueprint.testbundlea:0.3.2-SNAPSHOT:
checking for updates from codehaus.snapshots
[INFO] snapshot org.apache.aries.blueprint:org.apache.aries.blueprint.testbundlea:0.3.2-SNAPSHOT:
checking for updates from apache.snapshots
[INFO] [enforcer:enforce {execution: default}]
[INFO] [remote-resources:process {execution: default}]
[INFO] [resources:resources {execution: default-resources}]
[INFO] Using 'UTF-8' encoding to copy filtered resources.
[INFO] Copying 1 resource
[INFO] skip non existing resourceDirectory <https://builds.apache.org/job/Aries/ws/aries/blueprint/blueprint-testbundleb/src/main/filtered-resources>
[INFO] Copying 0 resource
[INFO] Copying 3 resources
[INFO] [compiler:compile {execution: default-compile}]
[INFO] Compiling 4 source files to <https://builds.apache.org/job/Aries/ws/aries/blueprint/blueprint-testbundleb/target/classes>
[INFO] [resources:testResources {execution: default-testResources}]
[INFO] Using 'UTF-8' encoding to copy filtered resources.
[INFO] skip non existing resourceDirectory <https://builds.apache.org/job/Aries/ws/aries/blueprint/blueprint-testbundleb/src/test/resources>
[INFO] skip non existing resourceDirectory <https://builds.apache.org/job/Aries/ws/aries/blueprint/blueprint-testbundleb/src/test/filtered-resources>
[INFO] Copying 3 resources
[INFO] [compiler:testCompile {execution: default-testCompile}]
[INFO] No sources to compile
[INFO] [surefire:test {execution: default-test}]
[INFO] Surefire report directory: <https://builds.apache.org/job/Aries/ws/aries/blueprint/blueprint-testbundleb/target/surefire-reports>

-------------------------------------------------------
 T E S T S
-------------------------------------------------------
There are no tests to run.

Results :

Tests run: 0, Failures: 0, Errors: 0, Skipped: 0

[JENKINS] Recording test results[INFO] [bundle:bundle {execution: default-bundle}]

[INFO] [ianal:verify-legal-files {execution: default}]
[INFO] Checking legal files in: org.apache.aries.blueprint.testbundleb-0.3.2-SNAPSHOT.jar
[INFO] [install:install {execution: default-install}]
[INFO] Installing <https://builds.apache.org/job/Aries/ws/aries/blueprint/blueprint-testbundleb/target/org.apache.aries.blueprint.testbundleb-0.3.2-SNAPSHOT.jar>
to /home/jenkins/.m2/repository/org/apache/aries/blueprint/org.apache.aries.blueprint.testbundleb/0.3.2-SNAPSHOT/org.apache.aries.blueprint.testbundleb-0.3.2-SNAPSHOT.jar
[INFO] [bundle:install {execution: default-install}]
[INFO] Installing org/apache/aries/blueprint/org.apache.aries.blueprint.testbundleb/0.3.2-SNAPSHOT/org.apache.aries.blueprint.testbundleb-0.3.2-SNAPSHOT.jar
[INFO] Writing OBR metadata
[JENKINS] Archiving <https://builds.apache.org/job/Aries/ws/aries/blueprint/blueprint-testbundleb/pom.xml>
to /home/hudson/hudson/jobs/Aries/modules/org.apache.aries.blueprint$org.apache.aries.blueprint.testbundleb/builds/2011-10-12_15-51-02/archive/org.apache.aries.blueprint/org.apache.aries.blueprint.testbundleb/0.3.2-SNAPSHOT/org.apache.aries.blueprint.testbundleb-0.3.2-SNAPSHOT.pom
[JENKINS] Archiving <https://builds.apache.org/job/Aries/ws/aries/blueprint/blueprint-testbundleb/target/org.apache.aries.blueprint.testbundleb-0.3.2-SNAPSHOT.jar>
to /home/hudson/hudson/jobs/Aries/modules/org.apache.aries.blueprint$org.apache.aries.blueprint.testbundleb/builds/2011-10-12_15-51-02/archive/org.apache.aries.blueprint/org.apache.aries.blueprint.testbundleb/0.3.2-SNAPSHOT/org.apache.aries.blueprint.testbundleb-0.3.2-SNAPSHOT.jar
[INFO] ------------------------------------------------------------------------
[INFO] Building Apache Aries Blueprint Test Quiesce Bundle
[INFO]    task-segment: [clean, install]
[INFO] ------------------------------------------------------------------------
[INFO] [clean:clean {execution: default-clean}]
[INFO] Deleting file set: <https://builds.apache.org/job/Aries/ws/aries/blueprint/blueprint-testquiescebundle/target>
(included: [**], excluded: [])
[INFO] [enforcer:enforce {execution: default}]
[INFO] [remote-resources:process {execution: default}]
[INFO] [resources:resources {execution: default-resources}]
[INFO] Using 'UTF-8' encoding to copy filtered resources.
[INFO] Copying 1 resource
[INFO] skip non existing resourceDirectory <https://builds.apache.org/job/Aries/ws/aries/blueprint/blueprint-testquiescebundle/src/main/filtered-resources>
[INFO] Copying 0 resource
[INFO] Copying 3 resources
[INFO] [compiler:compile {execution: default-compile}]
[INFO] Compiling 2 source files to <https://builds.apache.org/job/Aries/ws/aries/blueprint/blueprint-testquiescebundle/target/classes>
[INFO] [resources:testResources {execution: default-testResources}]
[INFO] Using 'UTF-8' encoding to copy filtered resources.
[INFO] skip non existing resourceDirectory <https://builds.apache.org/job/Aries/ws/aries/blueprint/blueprint-testquiescebundle/src/test/resources>
[INFO] skip non existing resourceDirectory <https://builds.apache.org/job/Aries/ws/aries/blueprint/blueprint-testquiescebundle/src/test/filtered-resources>
[INFO] Copying 3 resources
[INFO] [compiler:testCompile {execution: default-testCompile}]
[INFO] No sources to compile
[INFO] [surefire:test {execution: default-test}]
[INFO] Surefire report directory: <https://builds.apache.org/job/Aries/ws/aries/blueprint/blueprint-testquiescebundle/target/surefire-reports>

-------------------------------------------------------
 T E S T S
-------------------------------------------------------
There are no tests to run.

Results :

Tests run: 0, Failures: 0, Errors: 0, Skipped: 0

[JENKINS] Recording test results
[INFO] [bundle:bundle {execution: default-bundle}]
[INFO] [ianal:verify-legal-files {execution: default}]
[INFO] Checking legal files in: org.apache.aries.blueprint.testquiescebundle-0.3.2-SNAPSHOT.jar
[INFO] [install:install {execution: default-install}]
[INFO] Installing <https://builds.apache.org/job/Aries/ws/aries/blueprint/blueprint-testquiescebundle/target/org.apache.aries.blueprint.testquiescebundle-0.3.2-SNAPSHOT.jar>
to /home/jenkins/.m2/repository/org/apache/aries/blueprint/org.apache.aries.blueprint.testquiescebundle/0.3.2-SNAPSHOT/org.apache.aries.blueprint.testquiescebundle-0.3.2-SNAPSHOT.jar
[INFO] [bundle:install {execution: default-install}]
[INFO] Installing org/apache/aries/blueprint/org.apache.aries.blueprint.testquiescebundle/0.3.2-SNAPSHOT/org.apache.aries.blueprint.testquiescebundle-0.3.2-SNAPSHOT.jar
[INFO] Writing OBR metadata
[JENKINS] Archiving <https://builds.apache.org/job/Aries/ws/aries/blueprint/blueprint-testquiescebundle/pom.xml>
to /home/hudson/hudson/jobs/Aries/modules/org.apache.aries.blueprint$org.apache.aries.blueprint.testquiescebundle/builds/2011-10-12_15-51-02/archive/org.apache.aries.blueprint/org.apache.aries.blueprint.testquiescebundle/0.3.2-SNAPSHOT/org.apache.aries.blueprint.testquiescebundle-0.3.2-SNAPSHOT.pom
[JENKINS] Archiving <https://builds.apache.org/job/Aries/ws/aries/blueprint/blueprint-testquiescebundle/target/org.apache.aries.blueprint.testquiescebundle-0.3.2-SNAPSHOT.jar>
to /home/hudson/hudson/jobs/Aries/modules/org.apache.aries.blueprint$org.apache.aries.blueprint.testquiescebundle/builds/2011-10-12_15-51-02/archive/org.apache.aries.blueprint/org.apache.aries.blueprint.testquiescebundle/0.3.2-SNAPSHOT/org.apache.aries.blueprint.testquiescebundle-0.3.2-SNAPSHOT.jar
[INFO] ------------------------------------------------------------------------
[INFO] Building Apache Aries Blueprint iTests
[INFO]    task-segment: [clean, install]
[INFO] ------------------------------------------------------------------------
[INFO] [clean:clean {execution: default-clean}]
[INFO] snapshot org.apache.aries.testsupport:org.apache.aries.testsupport.unit:0.4-SNAPSHOT:
checking for updates from codehaus.snapshots
[INFO] snapshot org.apache.aries.testsupport:org.apache.aries.testsupport.unit:0.4-SNAPSHOT:
checking for updates from apache.snapshots
Downloading: http://snapshots.repository.codehaus.org/org/apache/aries/testsupport/org.apache.aries.testsupport.unit/0.4-SNAPSHOT/org.apache.aries.testsupport.unit-0.4-SNAPSHOT.pom
[INFO] Unable to find resource 'org.apache.aries.testsupport:org.apache.aries.testsupport.unit:pom:0.4-SNAPSHOT'
in repository codehaus.snapshots (http://snapshots.repository.codehaus.org)
Downloading: http://repository.apache.org/snapshots/org/apache/aries/testsupport/org.apache.aries.testsupport.unit/0.4-SNAPSHOT/org.apache.aries.testsupport.unit-0.4-SNAPSHOT.pom
[INFO] Unable to find resource 'org.apache.aries.testsupport:org.apache.aries.testsupport.unit:pom:0.4-SNAPSHOT'
in repository apache.snapshots (http://repository.apache.org/snapshots)
[INFO] snapshot org.apache.aries.blueprint:org.apache.aries.blueprint:0.3.2-SNAPSHOT: checking
for updates from codehaus.snapshots
Downloading: http://snapshots.repository.codehaus.org/org/apache/aries/testsupport/org.apache.aries.testsupport.unit/0.4-SNAPSHOT/org.apache.aries.testsupport.unit-0.4-SNAPSHOT.jar
[INFO] Unable to find resource 'org.apache.aries.testsupport:org.apache.aries.testsupport.unit:jar:0.4-SNAPSHOT'
in repository codehaus.snapshots (http://snapshots.repository.codehaus.org)
Downloading: http://repository.apache.org/snapshots/org/apache/aries/testsupport/org.apache.aries.testsupport.unit/0.4-SNAPSHOT/org.apache.aries.testsupport.unit-0.4-SNAPSHOT.jar
[INFO] snapshot org.apache.aries.blueprint:org.apache.aries.blueprint:0.3.2-SNAPSHOT: checking
for updates from apache.snapshots
[INFO] Unable to find resource 'org.apache.aries.testsupport:org.apache.aries.testsupport.unit:jar:0.4-SNAPSHOT'
in repository apache.snapshots (http://repository.apache.org/snapshots)
[INFO] snapshot org.apache.aries.blueprint:org.apache.aries.blueprint.jexl.evaluator:0.1.0-SNAPSHOT:
checking for updates from codehaus.snapshots
[INFO] snapshot org.apache.aries.blueprint:org.apache.aries.blueprint.jexl.evaluator:0.1.0-SNAPSHOT:
checking for updates from apache.snapshots
[INFO] snapshot org.apache.aries.blueprint:org.apache.aries.blueprint.sample:0.3.2-SNAPSHOT:
checking for updates from codehaus.snapshots
[INFO] snapshot org.apache.aries.blueprint:org.apache.aries.blueprint.sample:0.3.2-SNAPSHOT:
checking for updates from apache.snapshots
[INFO] snapshot org.apache.aries.blueprint:org.apache.aries.blueprint.testbundleb:0.3.2-SNAPSHOT:
checking for updates from codehaus.snapshots
[INFO] snapshot org.apache.aries.blueprint:org.apache.aries.blueprint.testbundleb:0.3.2-SNAPSHOT:
checking for updates from apache.snapshots
[JENKINS] Archiving <https://builds.apache.org/job/Aries/ws/aries/blueprint/blueprint-itests/pom.xml>
to /home/hudson/hudson/jobs/Aries/modules/org.apache.aries.blueprint$org.apache.aries.blueprint.itests/builds/2011-10-12_15-51-02/archive/org.apache.aries.blueprint/org.apache.aries.blueprint.itests/0.3.2-SNAPSHOT/org.apache.aries.blueprint.itests-0.3.2-SNAPSHOT.pom
[INFO] ------------------------------------------------------------------------
[ERROR] BUILD ERROR
[INFO] ------------------------------------------------------------------------
[INFO] Failed to resolve artifact.

Missing:
----------
1) org.apache.aries.testsupport:org.apache.aries.testsupport.unit:jar:0.4-SNAPSHOT

  Try downloading the file manually from the project website.

  Then, install it using the command: 
      mvn install:install-file -DgroupId=org.apache.aries.testsupport -DartifactId=org.apache.aries.testsupport.unit
-Dversion=0.4-SNAPSHOT -Dpackaging=jar -Dfile=/path/to/file

  Alternatively, if you host your own repository you can deploy the file there: 
      mvn deploy:deploy-file -DgroupId=org.apache.aries.testsupport -DartifactId=org.apache.aries.testsupport.unit
-Dversion=0.4-SNAPSHOT -Dpackaging=jar -Dfile=/path/to/file -Durl=[url] -DrepositoryId=[id]

  Path to dependency: 
  	1) org.apache.aries.blueprint:org.apache.aries.blueprint.itests:jar:0.3.2-SNAPSHOT
  	2) org.apache.aries.testsupport:org.apache.aries.testsupport.unit:jar:0.4-SNAPSHOT

----------
1 required artifact is missing.

for artifact: 
  org.apache.aries.blueprint:org.apache.aries.blueprint.itests:jar:0.3.2-SNAPSHOT

from the specified remote repositories:
  codehaus.snapshots (http://snapshots.repository.codehaus.org),
  central (http://repo1.maven.org/maven2),
  Nexus (http://repository.apache.org/snapshots)



[INFO] ------------------------------------------------------------------------
[INFO] Trace
org.apache.maven.lifecycle.LifecycleExecutionException: Missing:
----------
1) org.apache.aries.testsupport:org.apache.aries.testsupport.unit:jar:0.4-SNAPSHOT

  Try downloading the file manually from the project website.

  Then, install it using the command: 
      mvn install:install-file -DgroupId=org.apache.aries.testsupport -DartifactId=org.apache.aries.testsupport.unit
-Dversion=0.4-SNAPSHOT -Dpackaging=jar -Dfile=/path/to/file

  Alternatively, if you host your own repository you can deploy the file there: 
      mvn deploy:deploy-file -DgroupId=org.apache.aries.testsupport -DartifactId=org.apache.aries.testsupport.unit
-Dversion=0.4-SNAPSHOT -Dpackaging=jar -Dfile=/path/to/file -Durl=[url] -DrepositoryId=[id]

  Path to dependency: 
  	1) org.apache.aries.blueprint:org.apache.aries.blueprint.itests:jar:0.3.2-SNAPSHOT
  	2) org.apache.aries.testsupport:org.apache.aries.testsupport.unit:jar:0.4-SNAPSHOT

----------
1 required artifact is missing.

for artifact: 
  org.apache.aries.blueprint:org.apache.aries.blueprint.itests:jar:0.3.2-SNAPSHOT

from the specified remote repositories:
  codehaus.snapshots (http://snapshots.repository.codehaus.org),
  central (http://repo1.maven.org/maven2),
  Nexus (http://repository.apache.org/snapshots)


	at org.apache.maven.lifecycle.DefaultLifecycleExecutor.executeGoals(DefaultLifecycleExecutor.java:711)
	at org.apache.maven.lifecycle.DefaultLifecycleExecutor.executeGoalWithLifecycle(DefaultLifecycleExecutor.java:556)
	at org.apache.maven.lifecycle.DefaultLifecycleExecutor.executeGoal(DefaultLifecycleExecutor.java:535)
	at org.apache.maven.lifecycle.DefaultLifecycleExecutor.executeGoalAndHandleFailures(DefaultLifecycleExecutor.java:387)
	at org.apache.maven.lifecycle.DefaultLifecycleExecutor.executeTaskSegments(DefaultLifecycleExecutor.java:348)
	at org.apache.maven.lifecycle.DefaultLifecycleExecutor.execute(DefaultLifecycleExecutor.java:180)
	at org.apache.maven.lifecycle.LifecycleExecutorInterceptor.execute(LifecycleExecutorInterceptor.java:65)
	at org.apache.maven.DefaultMaven.doExecute(DefaultMaven.java:328)
	at org.apache.maven.DefaultMaven.execute(DefaultMaven.java:138)
	at org.apache.maven.cli.MavenCli.main(MavenCli.java:362)
	at sun.reflect.NativeMethodAccessorImpl.invoke0(Native Method)
	at sun.reflect.NativeMethodAccessorImpl.invoke(NativeMethodAccessorImpl.java:39)
	at sun.reflect.DelegatingMethodAccessorImpl.invoke(DelegatingMethodAccessorImpl.java:25)
	at java.lang.reflect.Method.invoke(Method.java:597)
	at org.codehaus.classworlds.Launcher.launchEnhanced(Launcher.java:315)
	at org.codehaus.classworlds.Launcher.launch(Launcher.java:255)
	at hudson.maven.agent.Main.launch(Main.java:185)
	at hudson.maven.MavenBuilder.call(MavenBuilder.java:160)
	at hudson.maven.MavenModuleSetBuild$Builder.call(MavenModuleSetBuild.java:1059)
	at hudson.maven.MavenModuleSetBuild$Builder.call(MavenModuleSetBuild.java:990)
	at hudson.remoting.UserRequest.perform(UserRequest.java:118)
	at hudson.remoting.UserRequest.perform(UserRequest.java:48)
	at hudson.remoting.Request$2.run(Request.java:287)
	at java.util.concurrent.Executors$RunnableAdapter.call(Executors.java:441)
	at java.util.concurrent.FutureTask$Sync.innerRun(FutureTask.java:303)
	at java.util.concurrent.FutureTask.run(FutureTask.java:138)
	at java.util.concurrent.ThreadPoolExecutor$Worker.runTask(ThreadPoolExecutor.java:886)
	at java.util.concurrent.ThreadPoolExecutor$Worker.run(ThreadPoolExecutor.java:908)
	at java.lang.Thread.run(Thread.java:619)
Caused by: org.apache.maven.artifact.resolver.MultipleArtifactsNotFoundException: Missing:
----------
1) org.apache.aries.testsupport:org.apache.aries.testsupport.unit:jar:0.4-SNAPSHOT

  Try downloading the file manually from the project website.

  Then, install it using the command: 
      mvn install:install-file -DgroupId=org.apache.aries.testsupport -DartifactId=org.apache.aries.testsupport.unit
-Dversion=0.4-SNAPSHOT -Dpackaging=jar -Dfile=/path/to/file

  Alternatively, if you host your own repository you can deploy the file there: 
      mvn deploy:deploy-file -DgroupId=org.apache.aries.testsupport -DartifactId=org.apache.aries.testsupport.unit
-Dversion=0.4-SNAPSHOT -Dpackaging=jar -Dfile=/path/to/file -Durl=[url] -DrepositoryId=[id]

  Path to dependency: 
  	1) org.apache.aries.blueprint:org.apache.aries.blueprint.itests:jar:0.3.2-SNAPSHOT
  	2) org.apache.aries.testsupport:org.apache.aries.testsupport.unit:jar:0.4-SNAPSHOT

----------
1 required artifact is missing.

for artifact: 
  org.apache.aries.blueprint:org.apache.aries.blueprint.itests:jar:0.3.2-SNAPSHOT

from the specified remote repositories:
  codehaus.snapshots (http://snapshots.repository.codehaus.org),
  central (http://repo1.maven.org/maven2),
  Nexus (http://repository.apache.org/snapshots)


	at org.apache.maven.artifact.resolver.DefaultArtifactResolver.resolveTransitively(DefaultArtifactResolver.java:360)
	at org.apache.maven.artifact.resolver.DefaultArtifactResolver.resolveTransitively(DefaultArtifactResolver.java:304)
	at org.apache.maven.plugin.DefaultPluginManager.resolveTransitiveDependencies(DefaultPluginManager.java:1499)
	at org.apache.maven.plugin.DefaultPluginManager.executeMojo(DefaultPluginManager.java:442)
	at hudson.maven.agent.PluginManagerInterceptor.executeMojo(PluginManagerInterceptor.java:182)
	at org.apache.maven.lifecycle.DefaultLifecycleExecutor.executeGoals(DefaultLifecycleExecutor.java:694)
	... 28 more
[INFO] ------------------------------------------------------------------------
[INFO] Total time: 2 minutes 38 seconds
[INFO] Finished at: Wed Oct 12 15:53:47 UTC 2011
[INFO] Final Memory: 120M/513M
[INFO] ------------------------------------------------------------------------
channel stopped


Mime
View raw message