aries-dev mailing list archives

Site index · List index
Message view « Date » · « Thread »
Top « Date » · « Thread »
From Apache Jenkins Server <jenk...@builds.apache.org>
Subject Build failed in Jenkins: Aries #1160
Date Thu, 06 Oct 2011 14:05:54 GMT
See <https://builds.apache.org/job/Aries/1160/changes>

Changes:

[timothyjward] ARIES-754: Update testsupport package versions ready for release

------------------------------------------
[...truncated 4178 lines...]
[INFO] Deleting file set: <https://builds.apache.org/job/Aries/ws/aries/application/application-distro/target>
(included: [**], excluded: [])
[INFO] snapshot org.apache.aries.application:org.apache.aries.application.install:0.3.1-SNAPSHOT:
checking for updates from codehaus.snapshots
[INFO] snapshot org.apache.aries.application:org.apache.aries.application.install:0.3.1-SNAPSHOT:
checking for updates from apache.snapshots
[INFO] [enforcer:enforce {execution: default}]
[INFO] [remote-resources:process {execution: default}]
[INFO] [site:attach-descriptor {execution: default-attach-descriptor}]
[INFO] [assembly:single {execution: default}]
[INFO] Reading assembly descriptor: src/main/assemblies/application-distro.xml
[WARNING] Cannot include project artifact: org.apache.aries.application:org.apache.aries.application-distro:pom:0.1-SNAPSHOT;
it doesn't have an associated file or directory.
[INFO] Building zip: <https://builds.apache.org/job/Aries/ws/aries/application/application-distro/target/org.apache.aries.application-distro-0.1-SNAPSHOT.zip>
[INFO] [ianal:verify-legal-files {execution: default}]
[INFO] Checking legal files in: org.apache.aries.application-distro-0.1-SNAPSHOT.zip
[INFO] [install:install {execution: default-install}]
[INFO] Installing <https://builds.apache.org/job/Aries/ws/aries/application/application-distro/pom.xml>
to /home/jenkins/.m2/repository/org/apache/aries/application/org.apache.aries.application-distro/0.1-SNAPSHOT/org.apache.aries.application-distro-0.1-SNAPSHOT.pom
[INFO] Installing <https://builds.apache.org/job/Aries/ws/aries/application/application-distro/target/org.apache.aries.application-distro-0.1-SNAPSHOT.zip>
to /home/jenkins/.m2/repository/org/apache/aries/application/org.apache.aries.application-distro/0.1-SNAPSHOT/org.apache.aries.application-distro-0.1-SNAPSHOT.zip
[JENKINS] Archiving <https://builds.apache.org/job/Aries/ws/aries/application/application-distro/pom.xml>
to /home/hudson/hudson/jobs/Aries/modules/org.apache.aries.application$org.apache.aries.application-distro/builds/2011-10-06_13-52-29/archive/org.apache.aries.application/org.apache.aries.application-distro/0.1-SNAPSHOT/org.apache.aries.application-distro-0.1-SNAPSHOT.pom
[JENKINS] Archiving <https://builds.apache.org/job/Aries/ws/aries/application/application-distro/target/org.apache.aries.application-distro-0.1-SNAPSHOT.zip>
to /home/hudson/hudson/jobs/Aries/modules/org.apache.aries.application$org.apache.aries.application-distro/builds/2011-10-06_13-52-29/archive/org.apache.aries.application/org.apache.aries.application-distro/0.1-SNAPSHOT/org.apache.aries.application-distro-0.1-SNAPSHOT.zip
[INFO] ------------------------------------------------------------------------
[INFO] Building Application distribution for isolated application support
[INFO]    task-segment: [clean, install]
[INFO] ------------------------------------------------------------------------
[INFO] [clean:clean {execution: default-clean}]
[INFO] Deleting file set: <https://builds.apache.org/job/Aries/ws/aries/application/application-isolated-distro/target>
(included: [**], excluded: [])
[INFO] [enforcer:enforce {execution: default}]
[INFO] [remote-resources:process {execution: default}]
[INFO] [site:attach-descriptor {execution: default-attach-descriptor}]
[INFO] [assembly:single {execution: default}]
[INFO] Reading assembly descriptor: src/main/assemblies/application-isolated-distro.xml
[WARNING] Cannot include project artifact: org.apache.aries.application:org.apache.aries.application-isolated-distro:pom:0.1-SNAPSHOT;
it doesn't have an associated file or directory.
[INFO] Building zip: <https://builds.apache.org/job/Aries/ws/aries/application/application-isolated-distro/target/org.apache.aries.application-isolated-distro-0.1-SNAPSHOT.zip>
[INFO] [ianal:verify-legal-files {execution: default}]
[INFO] Checking legal files in: org.apache.aries.application-isolated-distro-0.1-SNAPSHOT.zip
[INFO] [install:install {execution: default-install}]
[INFO] Installing <https://builds.apache.org/job/Aries/ws/aries/application/application-isolated-distro/pom.xml>
to /home/jenkins/.m2/repository/org/apache/aries/application/org.apache.aries.application-isolated-distro/0.1-SNAPSHOT/org.apache.aries.application-isolated-distro-0.1-SNAPSHOT.pom
[INFO] Installing <https://builds.apache.org/job/Aries/ws/aries/application/application-isolated-distro/target/org.apache.aries.application-isolated-distro-0.1-SNAPSHOT.zip>
to /home/jenkins/.m2/repository/org/apache/aries/application/org.apache.aries.application-isolated-distro/0.1-SNAPSHOT/org.apache.aries.application-isolated-distro-0.1-SNAPSHOT.zip
[JENKINS] Archiving <https://builds.apache.org/job/Aries/ws/aries/application/application-isolated-distro/pom.xml>
to /home/hudson/hudson/jobs/Aries/modules/org.apache.aries.application$org.apache.aries.application-isolated-distro/builds/2011-10-06_13-52-29/archive/org.apache.aries.application/org.apache.aries.application-isolated-distro/0.1-SNAPSHOT/org.apache.aries.application-isolated-distro-0.1-SNAPSHOT.pom
[JENKINS] Archiving <https://builds.apache.org/job/Aries/ws/aries/application/application-isolated-distro/target/org.apache.aries.application-isolated-distro-0.1-SNAPSHOT.zip>
to /home/hudson/hudson/jobs/Aries/modules/org.apache.aries.application$org.apache.aries.application-isolated-distro/builds/2011-10-06_13-52-29/archive/org.apache.aries.application/org.apache.aries.application-isolated-distro/0.1-SNAPSHOT/org.apache.aries.application-isolated-distro-0.1-SNAPSHOT.zip
[INFO] ------------------------------------------------------------------------
[INFO] Building Apache Aries Application
[INFO]    task-segment: [clean, install]
[INFO] ------------------------------------------------------------------------
[INFO] [clean:clean {execution: default-clean}]
[INFO] Deleting file set: <https://builds.apache.org/job/Aries/ws/aries/application/target>
(included: [**], excluded: [])
[INFO] [enforcer:enforce {execution: default}]
[INFO] [remote-resources:process {execution: default}]
[INFO] [site:attach-descriptor {execution: default-attach-descriptor}]
[INFO] [ianal:verify-legal-files {execution: default}]
[INFO] [install:install {execution: default-install}]
[INFO] Installing <https://builds.apache.org/job/Aries/ws/aries/application/pom.xml>
to /home/jenkins/.m2/repository/org/apache/aries/application/application/0.4/application-0.4.pom
[JENKINS] Archiving <https://builds.apache.org/job/Aries/ws/aries/application/pom.xml>
to /home/hudson/hudson/jobs/Aries/modules/org.apache.aries.application$application/builds/2011-10-06_13-52-29/archive/org.apache.aries.application/application/0.4/application-0.4.pom
[INFO] ------------------------------------------------------------------------
[INFO] Building Aries EJB Modelling Integration
[INFO]    task-segment: [clean, install]
[INFO] ------------------------------------------------------------------------
[INFO] [clean:clean {execution: default-clean}]
[INFO] snapshot org.apache.openejb:openejb-core:4.0.0-SNAPSHOT: checking for updates from
codehaus.snapshots
[INFO] snapshot org.apache.openejb:openejb-core:4.0.0-SNAPSHOT: checking for updates from
EclipseLink Repo
[INFO] snapshot org.apache.openejb:openejb-core:4.0.0-SNAPSHOT: checking for updates from
apache.snapshots
[INFO] snapshot org.apache.openejb:container:4.0.0-SNAPSHOT: checking for updates from codehaus.snapshots
[INFO] snapshot org.apache.openejb:container:4.0.0-SNAPSHOT: checking for updates from EclipseLink
Repo
[INFO] snapshot org.apache.openejb:container:4.0.0-SNAPSHOT: checking for updates from apache.snapshots
[INFO] snapshot org.apache.openejb:openejb:4.0.0-SNAPSHOT: checking for updates from codehaus.snapshots
[INFO] snapshot org.apache.openejb:openejb:4.0.0-SNAPSHOT: checking for updates from EclipseLink
Repo
[INFO] snapshot org.apache.openejb:openejb:4.0.0-SNAPSHOT: checking for updates from apache.snapshots
[INFO] snapshot org.apache.openejb:mbean-annotation-api:4.0.0-SNAPSHOT: checking for updates
from codehaus.snapshots
[INFO] snapshot org.apache.openejb:mbean-annotation-api:4.0.0-SNAPSHOT: checking for updates
from EclipseLink Repo
[INFO] snapshot org.apache.openejb:mbean-annotation-api:4.0.0-SNAPSHOT: checking for updates
from apache.snapshots
[INFO] snapshot org.apache.openejb:mbean-annotation-api:4.0.0-SNAPSHOT: checking for updates
from apache-m2-snapshot
[INFO] snapshot org.apache.openejb:deps:4.0.0-SNAPSHOT: checking for updates from codehaus.snapshots
[INFO] snapshot org.apache.openejb:deps:4.0.0-SNAPSHOT: checking for updates from EclipseLink
Repo
[INFO] snapshot org.apache.openejb:deps:4.0.0-SNAPSHOT: checking for updates from apache.snapshots
[INFO] snapshot org.apache.openejb:deps:4.0.0-SNAPSHOT: checking for updates from apache-m2-snapshot
[INFO] snapshot org.apache.openejb:openejb-api:4.0.0-SNAPSHOT: checking for updates from codehaus.snapshots
[INFO] snapshot org.apache.openejb:openejb-api:4.0.0-SNAPSHOT: checking for updates from EclipseLink
Repo
[INFO] snapshot org.apache.openejb:openejb-api:4.0.0-SNAPSHOT: checking for updates from apache.snapshots
[INFO] snapshot org.apache.openejb:openejb-api:4.0.0-SNAPSHOT: checking for updates from apache-m2-snapshot
[INFO] snapshot org.apache.openejb:openejb-loader:4.0.0-SNAPSHOT: checking for updates from
codehaus.snapshots
[INFO] snapshot org.apache.openejb:openejb-loader:4.0.0-SNAPSHOT: checking for updates from
EclipseLink Repo
[INFO] snapshot org.apache.openejb:openejb-loader:4.0.0-SNAPSHOT: checking for updates from
apache.snapshots
[INFO] snapshot org.apache.openejb:openejb-loader:4.0.0-SNAPSHOT: checking for updates from
apache-m2-snapshot
[INFO] snapshot org.apache.openejb:openejb-javaagent:4.0.0-SNAPSHOT: checking for updates
from codehaus.snapshots
[INFO] snapshot org.apache.openejb:openejb-javaagent:4.0.0-SNAPSHOT: checking for updates
from EclipseLink Repo
[INFO] snapshot org.apache.openejb:openejb-javaagent:4.0.0-SNAPSHOT: checking for updates
from apache.snapshots
[INFO] snapshot org.apache.openejb:openejb-javaagent:4.0.0-SNAPSHOT: checking for updates
from apache-m2-snapshot
[INFO] snapshot org.apache.openejb:openejb-jee:4.0.0-SNAPSHOT: checking for updates from codehaus.snapshots
[INFO] snapshot org.apache.openejb:openejb-jee:4.0.0-SNAPSHOT: checking for updates from EclipseLink
Repo
[INFO] snapshot org.apache.openejb:openejb-jee:4.0.0-SNAPSHOT: checking for updates from apache.snapshots
[INFO] snapshot org.apache.openejb:openejb-jee:4.0.0-SNAPSHOT: checking for updates from apache-m2-snapshot
[INFO] snapshot org.apache.openejb.patch:openejb-bval:0.3-SNAPSHOT: checking for updates from
codehaus.snapshots
[INFO] snapshot org.apache.openejb.patch:openejb-bval:0.3-SNAPSHOT: checking for updates from
EclipseLink Repo
[INFO] snapshot org.apache.openejb.patch:openejb-bval:0.3-SNAPSHOT: checking for updates from
apache.snapshots
[INFO] snapshot org.apache.openejb.patch:openejb-bval:0.3-SNAPSHOT: checking for updates from
apache-m2-snapshot
Downloading: http://snapshots.repository.codehaus.org/org/apache/openejb/patch/openejb-bval/0.3-SNAPSHOT/openejb-bval-0.3-SNAPSHOT.pom
[INFO] Unable to find resource 'org.apache.openejb.patch:openejb-bval:pom:0.3-SNAPSHOT' in
repository codehaus.snapshots (http://snapshots.repository.codehaus.org)
Downloading: http://www.mirrorservice.org/sites/download.eclipse.org/eclipseMirror/rt/eclipselink/maven.repo//org/apache/openejb/patch/openejb-bval/0.3-SNAPSHOT/openejb-bval-0.3-SNAPSHOT.pom
[INFO] Unable to find resource 'org.apache.openejb.patch:openejb-bval:pom:0.3-SNAPSHOT' in
repository EclipseLink Repo (http://www.mirrorservice.org/sites/download.eclipse.org/eclipseMirror/rt/eclipselink/maven.repo/)
Downloading: http://repository.apache.org/snapshots/org/apache/openejb/patch/openejb-bval/0.3-SNAPSHOT/openejb-bval-0.3-SNAPSHOT.pom
[INFO] Unable to find resource 'org.apache.openejb.patch:openejb-bval:pom:0.3-SNAPSHOT' in
repository apache.snapshots (http://repository.apache.org/snapshots)
Downloading: http://repository.apache.org/snapshots//org/apache/openejb/patch/openejb-bval/0.3-SNAPSHOT/openejb-bval-0.3-SNAPSHOT.pom
[INFO] Unable to find resource 'org.apache.openejb.patch:openejb-bval:pom:0.3-SNAPSHOT' in
repository apache-m2-snapshot (http://repository.apache.org/snapshots/)
Downloading: http://snapshots.repository.codehaus.org/org/apache/openejb/patch/openejb-bval/0.3-SNAPSHOT/openejb-bval-0.3-SNAPSHOT.jar
[INFO] Unable to find resource 'org.apache.openejb.patch:openejb-bval:jar:0.3-SNAPSHOT' in
repository codehaus.snapshots (http://snapshots.repository.codehaus.org)
Downloading: http://www.mirrorservice.org/sites/download.eclipse.org/eclipseMirror/rt/eclipselink/maven.repo//org/apache/openejb/patch/openejb-bval/0.3-SNAPSHOT/openejb-bval-0.3-SNAPSHOT.jar
[INFO] Unable to find resource 'org.apache.openejb.patch:openejb-bval:jar:0.3-SNAPSHOT' in
repository EclipseLink Repo (http://www.mirrorservice.org/sites/download.eclipse.org/eclipseMirror/rt/eclipselink/maven.repo/)
Downloading: http://repository.apache.org/snapshots/org/apache/openejb/patch/openejb-bval/0.3-SNAPSHOT/openejb-bval-0.3-SNAPSHOT.jar
[INFO] Unable to find resource 'org.apache.openejb.patch:openejb-bval:jar:0.3-SNAPSHOT' in
repository apache.snapshots (http://repository.apache.org/snapshots)
Downloading: http://repository.apache.org/snapshots//org/apache/openejb/patch/openejb-bval/0.3-SNAPSHOT/openejb-bval-0.3-SNAPSHOT.jar
[INFO] Unable to find resource 'org.apache.openejb.patch:openejb-bval:jar:0.3-SNAPSHOT' in
repository apache-m2-snapshot (http://repository.apache.org/snapshots/)
[JENKINS] Archiving <https://builds.apache.org/job/Aries/ws/aries/ejb/ejb-modeller/pom.xml>
to /home/hudson/hudson/jobs/Aries/modules/org.apache.aries.ejb$org.apache.aries.ejb.modeller/builds/2011-10-06_13-52-29/archive/org.apache.aries.ejb/org.apache.aries.ejb.modeller/0.1-SNAPSHOT/org.apache.aries.ejb.modeller-0.1-SNAPSHOT.pom
[INFO] ------------------------------------------------------------------------
[ERROR] BUILD ERROR
[INFO] ------------------------------------------------------------------------
[INFO] Failed to resolve artifact.

Missing:
----------
1) org.apache.openejb.patch:openejb-bval:jar:0.3-SNAPSHOT

  Try downloading the file manually from the project website.

  Then, install it using the command: 
      mvn install:install-file -DgroupId=org.apache.openejb.patch -DartifactId=openejb-bval
-Dversion=0.3-SNAPSHOT -Dpackaging=jar -Dfile=/path/to/file

  Alternatively, if you host your own repository you can deploy the file there: 
      mvn deploy:deploy-file -DgroupId=org.apache.openejb.patch -DartifactId=openejb-bval
-Dversion=0.3-SNAPSHOT -Dpackaging=jar -Dfile=/path/to/file -Durl=[url] -DrepositoryId=[id]

  Path to dependency: 
  	1) org.apache.aries.ejb:org.apache.aries.ejb.modeller:bundle:0.1-SNAPSHOT
  	2) org.apache.openejb:openejb-core:jar:4.0.0-SNAPSHOT
  	3) org.apache.openejb.patch:openejb-bval:jar:0.3-SNAPSHOT

----------
1 required artifact is missing.

for artifact: 
  org.apache.aries.ejb:org.apache.aries.ejb.modeller:bundle:0.1-SNAPSHOT

from the specified remote repositories:
  codehaus.snapshots (http://snapshots.repository.codehaus.org),
  central (http://repo1.maven.org/maven2),
  Nexus (http://repository.apache.org/snapshots),
  EclipseLink Repo (http://www.mirrorservice.org/sites/download.eclipse.org/eclipseMirror/rt/eclipselink/maven.repo/)



[INFO] ------------------------------------------------------------------------
[INFO] Trace
org.apache.maven.lifecycle.LifecycleExecutionException: Missing:
----------
1) org.apache.openejb.patch:openejb-bval:jar:0.3-SNAPSHOT

  Try downloading the file manually from the project website.

  Then, install it using the command: 
      mvn install:install-file -DgroupId=org.apache.openejb.patch -DartifactId=openejb-bval
-Dversion=0.3-SNAPSHOT -Dpackaging=jar -Dfile=/path/to/file

  Alternatively, if you host your own repository you can deploy the file there: 
      mvn deploy:deploy-file -DgroupId=org.apache.openejb.patch -DartifactId=openejb-bval
-Dversion=0.3-SNAPSHOT -Dpackaging=jar -Dfile=/path/to/file -Durl=[url] -DrepositoryId=[id]

  Path to dependency: 
  	1) org.apache.aries.ejb:org.apache.aries.ejb.modeller:bundle:0.1-SNAPSHOT
  	2) org.apache.openejb:openejb-core:jar:4.0.0-SNAPSHOT
  	3) org.apache.openejb.patch:openejb-bval:jar:0.3-SNAPSHOT

----------
1 required artifact is missing.

for artifact: 
  org.apache.aries.ejb:org.apache.aries.ejb.modeller:bundle:0.1-SNAPSHOT

from the specified remote repositories:
  codehaus.snapshots (http://snapshots.repository.codehaus.org),
  central (http://repo1.maven.org/maven2),
  Nexus (http://repository.apache.org/snapshots),
  EclipseLink Repo (http://www.mirrorservice.org/sites/download.eclipse.org/eclipseMirror/rt/eclipselink/maven.repo/)


	at org.apache.maven.lifecycle.DefaultLifecycleExecutor.executeGoals(DefaultLifecycleExecutor.java:711)
	at org.apache.maven.lifecycle.DefaultLifecycleExecutor.executeGoalWithLifecycle(DefaultLifecycleExecutor.java:556)
	at org.apache.maven.lifecycle.DefaultLifecycleExecutor.executeGoal(DefaultLifecycleExecutor.java:535)
	at org.apache.maven.lifecycle.DefaultLifecycleExecutor.executeGoalAndHandleFailures(DefaultLifecycleExecutor.java:387)
	at org.apache.maven.lifecycle.DefaultLifecycleExecutor.executeTaskSegments(DefaultLifecycleExecutor.java:348)
	at org.apache.maven.lifecycle.DefaultLifecycleExecutor.execute(DefaultLifecycleExecutor.java:180)
	at org.apache.maven.lifecycle.LifecycleExecutorInterceptor.execute(LifecycleExecutorInterceptor.java:65)
	at org.apache.maven.DefaultMaven.doExecute(DefaultMaven.java:328)
	at org.apache.maven.DefaultMaven.execute(DefaultMaven.java:138)
	at org.apache.maven.cli.MavenCli.main(MavenCli.java:362)
	at sun.reflect.NativeMethodAccessorImpl.invoke0(Native Method)
	at sun.reflect.NativeMethodAccessorImpl.invoke(NativeMethodAccessorImpl.java:39)
	at sun.reflect.DelegatingMethodAccessorImpl.invoke(DelegatingMethodAccessorImpl.java:25)
	at java.lang.reflect.Method.invoke(Method.java:597)
	at org.codehaus.classworlds.Launcher.launchEnhanced(Launcher.java:315)
	at org.codehaus.classworlds.Launcher.launch(Launcher.java:255)
	at hudson.maven.agent.Main.launch(Main.java:185)
	at hudson.maven.MavenBuilder.call(MavenBuilder.java:160)
	at hudson.maven.MavenModuleSetBuild$Builder.call(MavenModuleSetBuild.java:1059)
	at hudson.maven.MavenModuleSetBuild$Builder.call(MavenModuleSetBuild.java:990)
	at hudson.remoting.UserRequest.perform(UserRequest.java:118)
	at hudson.remoting.UserRequest.perform(UserRequest.java:48)
	at hudson.remoting.Request$2.run(Request.java:287)
	at java.util.concurrent.Executors$RunnableAdapter.call(Executors.java:441)
	at java.util.concurrent.FutureTask$Sync.innerRun(FutureTask.java:303)
	at java.util.concurrent.FutureTask.run(FutureTask.java:138)
	at java.util.concurrent.ThreadPoolExecutor$Worker.runTask(ThreadPoolExecutor.java:886)
	at java.util.concurrent.ThreadPoolExecutor$Worker.run(ThreadPoolExecutor.java:908)
	at java.lang.Thread.run(Thread.java:619)
Caused by: org.apache.maven.artifact.resolver.MultipleArtifactsNotFoundException: Missing:
----------
1) org.apache.openejb.patch:openejb-bval:jar:0.3-SNAPSHOT

  Try downloading the file manually from the project website.

  Then, install it using the command: 
      mvn install:install-file -DgroupId=org.apache.openejb.patch -DartifactId=openejb-bval
-Dversion=0.3-SNAPSHOT -Dpackaging=jar -Dfile=/path/to/file

  Alternatively, if you host your own repository you can deploy the file there: 
      mvn deploy:deploy-file -DgroupId=org.apache.openejb.patch -DartifactId=openejb-bval
-Dversion=0.3-SNAPSHOT -Dpackaging=jar -Dfile=/path/to/file -Durl=[url] -DrepositoryId=[id]

  Path to dependency: 
  	1) org.apache.aries.ejb:org.apache.aries.ejb.modeller:bundle:0.1-SNAPSHOT
  	2) org.apache.openejb:openejb-core:jar:4.0.0-SNAPSHOT
  	3) org.apache.openejb.patch:openejb-bval:jar:0.3-SNAPSHOT

----------
1 required artifact is missing.

for artifact: 
  org.apache.aries.ejb:org.apache.aries.ejb.modeller:bundle:0.1-SNAPSHOT

from the specified remote repositories:
  codehaus.snapshots (http://snapshots.repository.codehaus.org),
  central (http://repo1.maven.org/maven2),
  Nexus (http://repository.apache.org/snapshots),
  EclipseLink Repo (http://www.mirrorservice.org/sites/download.eclipse.org/eclipseMirror/rt/eclipselink/maven.repo/)


	at org.apache.maven.artifact.resolver.DefaultArtifactResolver.resolveTransitively(DefaultArtifactResolver.java:360)
	at org.apache.maven.artifact.resolver.DefaultArtifactResolver.resolveTransitively(DefaultArtifactResolver.java:304)
	at org.apache.maven.plugin.DefaultPluginManager.resolveTransitiveDependencies(DefaultPluginManager.java:1499)
	at org.apache.maven.plugin.DefaultPluginManager.executeMojo(DefaultPluginManager.java:442)
	at hudson.maven.agent.PluginManagerInterceptor.executeMojo(PluginManagerInterceptor.java:182)
	at org.apache.maven.lifecycle.DefaultLifecycleExecutor.executeGoals(DefaultLifecycleExecutor.java:694)
	... 28 more
[INFO] ------------------------------------------------------------------------
[INFO] Total time: 12 minutes 54 seconds
[INFO] Finished at: Thu Oct 06 14:05:50 UTC 2011
[INFO] Final Memory: 162M/970M
[INFO] ------------------------------------------------------------------------
channel stopped


Mime
View raw message