aries-dev mailing list archives

Site index · List index
Message view « Date » · « Thread »
Top « Date » · « Thread »
From Apache Jenkins Server <jenk...@builds.apache.org>
Subject Build failed in Jenkins: Aries #1178
Date Thu, 13 Oct 2011 17:24:44 GMT
See <https://builds.apache.org/job/Aries/1178/changes>

Changes:

[hughesj] [maven-release-plugin] prepare for next development iteration

[hughesj] [maven-release-plugin] prepare release org.apache.aries.blueprint.annotation.api-0.3.2

[hughesj] Use soon to be released 0.5 parent poms

[timothyjward] ARIES-754: Add missing blueprint export

[hughesj] No releasable changes in blueprint-api .. undo-ing

[hughesj] [maven-release-plugin] prepare for next development iteration

[hughesj] [maven-release-plugin] prepare release org.apache.aries.blueprint.api-0.3.2

[hughesj] Use soon to be released 0.5 parent poms

------------------------------------------
[...truncated 5636 lines...]
[INFO] ------------------------------------------------------------------------
[INFO] Building Aries JPA Container blueprint integration for Aries blueprint
[INFO]    task-segment: [clean, install]
[INFO] ------------------------------------------------------------------------
[INFO] [clean:clean {execution: default-clean}]
[INFO] Deleting file set: <https://builds.apache.org/job/Aries/ws/aries/jpa/jpa-blueprint-aries/target>
(included: [**], excluded: [])
[INFO] snapshot org.apache.aries.jpa:org.apache.aries.jpa.api:0.3.1-SNAPSHOT: checking for
updates from codehaus.snapshots
[INFO] snapshot org.apache.aries.jpa:org.apache.aries.jpa.api:0.3.1-SNAPSHOT: checking for
updates from apache.snapshots
[INFO] [enforcer:enforce {execution: default}]
[INFO] [remote-resources:process {execution: default}]
[INFO] [resources:resources {execution: default-resources}]
[INFO] Using 'UTF-8' encoding to copy filtered resources.
[INFO] Copying 4 resources
[INFO] skip non existing resourceDirectory <https://builds.apache.org/job/Aries/ws/aries/jpa/jpa-blueprint-aries/src/main/filtered-resources>
[INFO] Copying 0 resource
[INFO] Copying 3 resources
[INFO] [compiler:compile {execution: default-compile}]
[INFO] Compiling 1 source file to <https://builds.apache.org/job/Aries/ws/aries/jpa/jpa-blueprint-aries/target/classes>
[INFO] [resources:testResources {execution: default-testResources}]
[INFO] Using 'UTF-8' encoding to copy filtered resources.
[INFO] Copying 2 resources
[INFO] skip non existing resourceDirectory <https://builds.apache.org/job/Aries/ws/aries/jpa/jpa-blueprint-aries/src/test/filtered-resources>
[INFO] Copying 3 resources
[INFO] [compiler:testCompile {execution: default-testCompile}]
[INFO] Compiling 1 source file to <https://builds.apache.org/job/Aries/ws/aries/jpa/jpa-blueprint-aries/target/test-classes>
[INFO] [surefire:test {execution: default-test}]
[INFO] Surefire report directory: <https://builds.apache.org/job/Aries/ws/aries/jpa/jpa-blueprint-aries/target/surefire-reports>

-------------------------------------------------------
 T E S T S
-------------------------------------------------------
Running org.apache.aries.jpa.blueprint.aries.test.NSHandlerTest
Tests run: 20, Failures: 0, Errors: 0, Skipped: 0, Time elapsed: 0.249 sec

Results :

Tests run: 20, Failures: 0, Errors: 0, Skipped: 0

[JENKINS] Recording test results
[INFO] [bundle:bundle {execution: default-bundle}]
java.lang.NullPointerException
	at java.util.regex.Matcher.getTextLength(Matcher.java:1140)
	at java.util.regex.Matcher.reset(Matcher.java:291)
	at java.util.regex.Matcher.<init>(Matcher.java:211)
	at java.util.regex.Pattern.matcher(Pattern.java:888)
	at aQute.libg.version.Version.<init>(Version.java:43)
	at aQute.lib.osgi.Macro.version(Macro.java:633)
	at aQute.lib.osgi.Macro._range(Macro.java:713)
	at sun.reflect.NativeMethodAccessorImpl.invoke0(Native Method)
	at sun.reflect.NativeMethodAccessorImpl.invoke(NativeMethodAccessorImpl.java:39)
	at sun.reflect.DelegatingMethodAccessorImpl.invoke(DelegatingMethodAccessorImpl.java:25)
	at java.lang.reflect.Method.invoke(Method.java:597)
	at aQute.lib.osgi.Macro.doCommand(Macro.java:180)
	at aQute.lib.osgi.Macro.doCommands(Macro.java:169)
	at aQute.lib.osgi.Macro.replace(Macro.java:116)
	at aQute.lib.osgi.Macro.process(Macro.java:62)
	at aQute.lib.osgi.Macro.process(Macro.java:77)
	at aQute.lib.osgi.Macro.process(Macro.java:49)
	at aQute.lib.osgi.Macro.process(Macro.java:44)
	at aQute.lib.osgi.Processor.getProperty(Processor.java:622)
	at aQute.lib.osgi.Processor.getProperty(Processor.java:395)
	at aQute.lib.osgi.Analyzer.getImportPackages(Analyzer.java:258)
	at aQute.lib.osgi.Builder.getImportPackages(Builder.java:249)
	at aQute.lib.osgi.Analyzer.analyze(Analyzer.java:154)
	at aQute.lib.osgi.Builder.analyze(Builder.java:296)
	at aQute.lib.osgi.Analyzer.calcManifest(Analyzer.java:292)
	at aQute.lib.osgi.Builder.build(Builder.java:68)
	at org.apache.felix.bundleplugin.BundlePlugin.buildOSGiBundle(BundlePlugin.java:375)
	at org.apache.felix.bundleplugin.BundlePlugin.execute(BundlePlugin.java:270)
	at org.apache.felix.bundleplugin.BundlePlugin.execute(BundlePlugin.java:224)
	at org.apache.felix.bundleplugin.BundlePlugin.execute(BundlePlugin.java:215)
	at org.apache.maven.plugin.DefaultPluginManager.executeMojo(DefaultPluginManager.java:490)
	at hudson.maven.agent.PluginManagerInterceptor.executeMojo(PluginManagerInterceptor.java:182)
	at org.apache.maven.lifecycle.DefaultLifecycleExecutor.executeGoals(DefaultLifecycleExecutor.java:694)
	at org.apache.maven.lifecycle.DefaultLifecycleExecutor.executeGoalWithLifecycle(DefaultLifecycleExecutor.java:556)
	at org.apache.maven.lifecycle.DefaultLifecycleExecutor.executeGoal(DefaultLifecycleExecutor.java:535)
	at org.apache.maven.lifecycle.DefaultLifecycleExecutor.executeGoalAndHandleFailures(DefaultLifecycleExecutor.java:387)
	at org.apache.maven.lifecycle.DefaultLifecycleExecutor.executeTaskSegments(DefaultLifecycleExecutor.java:348)
	at org.apache.maven.lifecycle.DefaultLifecycleExecutor.execute(DefaultLifecycleExecutor.java:180)
	at org.apache.maven.lifecycle.LifecycleExecutorInterceptor.execute(LifecycleExecutorInterceptor.java:65)
	at org.apache.maven.DefaultMaven.doExecute(DefaultMaven.java:328)
	at org.apache.maven.DefaultMaven.execute(DefaultMaven.java:138)
	at org.apache.maven.cli.MavenCli.main(MavenCli.java:362)
	at sun.reflect.NativeMethodAccessorImpl.invoke0(Native Method)
	at sun.reflect.NativeMethodAccessorImpl.invoke(NativeMethodAccessorImpl.java:39)
	at sun.reflect.DelegatingMethodAccessorImpl.invoke(DelegatingMethodAccessorImpl.java:25)
	at java.lang.reflect.Method.invoke(Method.java:597)
	at org.codehaus.classworlds.Launcher.launchEnhanced(Launcher.java:315)
	at org.codehaus.classworlds.Launcher.launch(Launcher.java:255)
	at hudson.maven.agent.Main.launch(Main.java:185)
	at hudson.maven.MavenBuilder.call(MavenBuilder.java:160)
	at hudson.maven.MavenModuleSetBuild$Builder.call(MavenModuleSetBuild.java:1059)
	at hudson.maven.MavenModuleSetBuild$Builder.call(MavenModuleSetBuild.java:990)
	at hudson.remoting.UserRequest.perform(UserRequest.java:118)
	at hudson.remoting.UserRequest.perform(UserRequest.java:48)
	at hudson.remoting.Request$2.run(Request.java:287)
	at java.util.concurrent.Executors$RunnableAdapter.call(Executors.java:441)
	at java.util.concurrent.FutureTask$Sync.innerRun(FutureTask.java:303)
	at java.util.concurrent.FutureTask.run(FutureTask.java:138)
	at java.util.concurrent.ThreadPoolExecutor$Worker.runTask(ThreadPoolExecutor.java:886)
	at java.util.concurrent.ThreadPoolExecutor$Worker.run(ThreadPoolExecutor.java:908)
	at java.lang.Thread.run(Thread.java:619)
[WARNING] Warning building bundle org.apache.aries.jpa:org.apache.aries.jpa.blueprint.aries:bundle:0.3.1-SNAPSHOT
: Exception in replace: java.lang.NullPointerException
[WARNING] Warning building bundle org.apache.aries.jpa:org.apache.aries.jpa.blueprint.aries:bundle:0.3.1-SNAPSHOT
: No translation found for macro: range;[==,=+)
[INFO] [ianal:verify-legal-files {execution: default}]
[INFO] Checking legal files in: org.apache.aries.jpa.blueprint.aries-0.3.1-SNAPSHOT.jar
[INFO] [install:install {execution: default-install}]
[INFO] Installing <https://builds.apache.org/job/Aries/ws/aries/jpa/jpa-blueprint-aries/target/org.apache.aries.jpa.blueprint.aries-0.3.1-SNAPSHOT.jar>
to /home/jenkins/.m2/repository/org/apache/aries/jpa/org.apache.aries.jpa.blueprint.aries/0.3.1-SNAPSHOT/org.apache.aries.jpa.blueprint.aries-0.3.1-SNAPSHOT.jar
[INFO] [bundle:install {execution: default-install}]
[INFO] Installing org/apache/aries/jpa/org.apache.aries.jpa.blueprint.aries/0.3.1-SNAPSHOT/org.apache.aries.jpa.blueprint.aries-0.3.1-SNAPSHOT.jar
[INFO] Writing OBR metadata
[JENKINS] Archiving <https://builds.apache.org/job/Aries/ws/aries/jpa/jpa-blueprint-aries/pom.xml>
to /home/hudson/hudson/jobs/Aries/modules/org.apache.aries.jpa$org.apache.aries.jpa.blueprint.aries/builds/2011-10-13_16-51-36/archive/org.apache.aries.jpa/org.apache.aries.jpa.blueprint.aries/0.3.1-SNAPSHOT/org.apache.aries.jpa.blueprint.aries-0.3.1-SNAPSHOT.pom
[JENKINS] Archiving <https://builds.apache.org/job/Aries/ws/aries/jpa/jpa-blueprint-aries/target/org.apache.aries.jpa.blueprint.aries-0.3.1-SNAPSHOT.jar>
to /home/hudson/hudson/jobs/Aries/modules/org.apache.aries.jpa$org.apache.aries.jpa.blueprint.aries/builds/2011-10-13_16-51-36/archive/org.apache.aries.jpa/org.apache.aries.jpa.blueprint.aries/0.3.1-SNAPSHOT/org.apache.aries.jpa.blueprint.aries-0.3.1-SNAPSHOT.jar
[INFO] ------------------------------------------------------------------------
[INFO] Building Apache Aries repository generator tool
[INFO]    task-segment: [clean, install]
[INFO] ------------------------------------------------------------------------
[INFO] [clean:clean {execution: default-clean}]
[INFO] Deleting file set: <https://builds.apache.org/job/Aries/ws/aries/application/application-tooling-repository-generator/target>
(included: [**], excluded: [])
[INFO] snapshot org.apache.aries.jpa:org.apache.aries.jpa.blueprint.aries:0.3.1-SNAPSHOT:
checking for updates from codehaus.snapshots
[INFO] snapshot org.apache.aries.jpa:org.apache.aries.jpa.blueprint.aries:0.3.1-SNAPSHOT:
checking for updates from apache.snapshots
[INFO] [enforcer:enforce {execution: default}]
[INFO] [remote-resources:process {execution: default}]
[INFO] [resources:resources {execution: default-resources}]
[INFO] Using 'UTF-8' encoding to copy filtered resources.
[INFO] skip non existing resourceDirectory <https://builds.apache.org/job/Aries/ws/aries/application/application-tooling-repository-generator/src/main/resources>
[INFO] skip non existing resourceDirectory <https://builds.apache.org/job/Aries/ws/aries/application/application-tooling-repository-generator/src/main/filtered-resources>
[INFO] Copying 0 resource
[INFO] Copying 3 resources
[INFO] [compiler:compile {execution: default-compile}]
[INFO] Compiling 1 source file to <https://builds.apache.org/job/Aries/ws/aries/application/application-tooling-repository-generator/target/classes>
[INFO] [resources:testResources {execution: default-testResources}]
[INFO] Using 'UTF-8' encoding to copy filtered resources.
[INFO] skip non existing resourceDirectory <https://builds.apache.org/job/Aries/ws/aries/application/application-tooling-repository-generator/src/test/resources>
[INFO] skip non existing resourceDirectory <https://builds.apache.org/job/Aries/ws/aries/application/application-tooling-repository-generator/src/test/filtered-resources>
[INFO] Copying 3 resources
[INFO] [compiler:testCompile {execution: default-testCompile}]
[INFO] No sources to compile
[INFO] [surefire:test {execution: default-test}]
[INFO] Surefire report directory: <https://builds.apache.org/job/Aries/ws/aries/application/application-tooling-repository-generator/target/surefire-reports>

-------------------------------------------------------
 T E S T S
-------------------------------------------------------
There are no tests to run.

Results :

Tests run: 0, Failures: 0, Errors: 0, Skipped: 0

[JENKINS] Recording test results[INFO] [bundle:bundle {execution: default-bundle}]

[INFO] [dependency:copy-dependencies {execution: copy}]
[INFO] Copying asm-all-3.2.jar to <https://builds.apache.org/job/Aries/ws/aries/application/application-tooling-repository-generator/target/asm-all-3.2.jar>
[INFO] Copying org.apache.aries.util-0.4-SNAPSHOT.jar to <https://builds.apache.org/job/Aries/ws/aries/application/application-tooling-repository-generator/target/org.apache.aries.util-0.4-SNAPSHOT.jar>
[INFO] Copying org.apache.aries.application.api-0.3.1-SNAPSHOT.jar to <https://builds.apache.org/job/Aries/ws/aries/application/application-tooling-repository-generator/target/org.apache.aries.application.api-0.3.1-SNAPSHOT.jar>
[INFO] Copying org.apache.aries.application.default.local.platform-0.3.1-SNAPSHOT.jar to <https://builds.apache.org/job/Aries/ws/aries/application/application-tooling-repository-generator/target/org.apache.aries.application.default.local.platform-0.3.1-SNAPSHOT.jar>
[INFO] Copying org.apache.aries.application.modeller-0.3.1-SNAPSHOT.jar to <https://builds.apache.org/job/Aries/ws/aries/application/application-tooling-repository-generator/target/org.apache.aries.application.modeller-0.3.1-SNAPSHOT.jar>
[INFO] Copying org.apache.aries.application.resolver.obr-0.3.1-SNAPSHOT.jar to <https://builds.apache.org/job/Aries/ws/aries/application/application-tooling-repository-generator/target/org.apache.aries.application.resolver.obr-0.3.1-SNAPSHOT.jar>
[INFO] Copying org.apache.aries.application.utils-0.3.1-SNAPSHOT.jar to <https://builds.apache.org/job/Aries/ws/aries/application/application-tooling-repository-generator/target/org.apache.aries.application.utils-0.3.1-SNAPSHOT.jar>
[INFO] Copying org.apache.aries.blueprint-0.3.2-SNAPSHOT.jar to <https://builds.apache.org/job/Aries/ws/aries/application/application-tooling-repository-generator/target/org.apache.aries.blueprint-0.3.2-SNAPSHOT.jar>
[INFO] Copying org.apache.aries.jpa.api-0.3.1-SNAPSHOT.jar to <https://builds.apache.org/job/Aries/ws/aries/application/application-tooling-repository-generator/target/org.apache.aries.jpa.api-0.3.1-SNAPSHOT.jar>
[INFO] Copying org.apache.aries.jpa.blueprint.aries-0.3.1-SNAPSHOT.jar to <https://builds.apache.org/job/Aries/ws/aries/application/application-tooling-repository-generator/target/org.apache.aries.jpa.blueprint.aries-0.3.1-SNAPSHOT.jar>
[INFO] Copying org.apache.aries.proxy-0.4-SNAPSHOT.jar to <https://builds.apache.org/job/Aries/ws/aries/application/application-tooling-repository-generator/target/org.apache.aries.proxy-0.4-SNAPSHOT.jar>
[INFO] Copying org.apache.aries.transaction.blueprint-0.3.1-SNAPSHOT.jar to <https://builds.apache.org/job/Aries/ws/aries/application/application-tooling-repository-generator/target/org.apache.aries.transaction.blueprint-0.3.1-SNAPSHOT.jar>
[INFO] Copying org.apache.aries.transaction.manager-0.3.1-SNAPSHOT.jar to <https://builds.apache.org/job/Aries/ws/aries/application/application-tooling-repository-generator/target/org.apache.aries.transaction.manager-0.3.1-SNAPSHOT.jar>
[INFO] Copying org.apache.aries.transaction.wrappers-0.3.1-SNAPSHOT.jar to <https://builds.apache.org/job/Aries/ws/aries/application/application-tooling-repository-generator/target/org.apache.aries.transaction.wrappers-0.3.1-SNAPSHOT.jar>
[INFO] Copying org.apache.felix.bundlerepository-1.6.4.jar to <https://builds.apache.org/job/Aries/ws/aries/application/application-tooling-repository-generator/target/org.apache.felix.bundlerepository-1.6.4.jar>
[INFO] Copying geronimo-jpa_2.0_spec-1.1.jar to <https://builds.apache.org/job/Aries/ws/aries/application/application-tooling-repository-generator/target/geronimo-jpa_2.0_spec-1.1.jar>
[INFO] Copying geronimo-jta_1.1_spec-1.1.1.jar to <https://builds.apache.org/job/Aries/ws/aries/application/application-tooling-repository-generator/target/geronimo-jta_1.1_spec-1.1.1.jar>
[INFO] Copying osgi-3.5.0.v20090520.jar to <https://builds.apache.org/job/Aries/ws/aries/application/application-tooling-repository-generator/target/osgi-3.5.0.v20090520.jar>
[INFO] Copying cm-3.2.0-v20070116.jar to <https://builds.apache.org/job/Aries/ws/aries/application/application-tooling-repository-generator/target/cm-3.2.0-v20070116.jar>
[INFO] Copying services-3.1.200-v20070605.jar to <https://builds.apache.org/job/Aries/ws/aries/application/application-tooling-repository-generator/target/services-3.1.200-v20070605.jar>
[INFO] Copying pax-logging-api-1.4.jar to <https://builds.apache.org/job/Aries/ws/aries/application/application-tooling-repository-generator/target/pax-logging-api-1.4.jar>
[INFO] Copying pax-logging-service-1.4.jar to <https://builds.apache.org/job/Aries/ws/aries/application/application-tooling-repository-generator/target/pax-logging-service-1.4.jar>
[INFO] [assembly:single {execution: make-assembly}]
[INFO] Reading assembly descriptor: src/main/assembly/createzip.xml
[JENKINS] Archiving <https://builds.apache.org/job/Aries/ws/aries/application/application-tooling-repository-generator/pom.xml>
to /home/hudson/hudson/jobs/Aries/modules/org.apache.aries.application$org.apache.aries.application.tooling.repository.generator/builds/2011-10-13_16-51-36/archive/org.apache.aries.application/org.apache.aries.application.tooling.repository.generator/0.1.0-SNAPSHOT/org.apache.aries.application.tooling.repository.generator-0.1.0-SNAPSHOT.pom
[JENKINS] Archiving <https://builds.apache.org/job/Aries/ws/aries/application/application-tooling-repository-generator/target/org.apache.aries.application.tooling.repository.generator-0.1.0-SNAPSHOT.jar>
to /home/hudson/hudson/jobs/Aries/modules/org.apache.aries.application$org.apache.aries.application.tooling.repository.generator/builds/2011-10-13_16-51-36/archive/org.apache.aries.application/org.apache.aries.application.tooling.repository.generator/0.1.0-SNAPSHOT/org.apache.aries.application.tooling.repository.generator-0.1.0-SNAPSHOT.jar
[INFO] ------------------------------------------------------------------------
[ERROR] BUILD ERROR
[INFO] ------------------------------------------------------------------------
[INFO] Failed to create assembly: Error creating assembly archive bin: Failed to retrieve
numeric file attributes using: '/bin/sh -c ls -1nlaR /'

[INFO] ------------------------------------------------------------------------
[INFO] Trace
org.apache.maven.lifecycle.LifecycleExecutionException: Failed to create assembly: Error creating
assembly archive bin: Failed to retrieve numeric file attributes using: '/bin/sh -c ls -1nlaR
/'
	at org.apache.maven.lifecycle.DefaultLifecycleExecutor.executeGoals(DefaultLifecycleExecutor.java:719)
	at org.apache.maven.lifecycle.DefaultLifecycleExecutor.executeGoalWithLifecycle(DefaultLifecycleExecutor.java:556)
	at org.apache.maven.lifecycle.DefaultLifecycleExecutor.executeGoal(DefaultLifecycleExecutor.java:535)
	at org.apache.maven.lifecycle.DefaultLifecycleExecutor.executeGoalAndHandleFailures(DefaultLifecycleExecutor.java:387)
	at org.apache.maven.lifecycle.DefaultLifecycleExecutor.executeTaskSegments(DefaultLifecycleExecutor.java:348)
	at org.apache.maven.lifecycle.DefaultLifecycleExecutor.execute(DefaultLifecycleExecutor.java:180)
	at org.apache.maven.lifecycle.LifecycleExecutorInterceptor.execute(LifecycleExecutorInterceptor.java:65)
	at org.apache.maven.DefaultMaven.doExecute(DefaultMaven.java:328)
	at org.apache.maven.DefaultMaven.execute(DefaultMaven.java:138)
	at org.apache.maven.cli.MavenCli.main(MavenCli.java:362)
	at sun.reflect.NativeMethodAccessorImpl.invoke0(Native Method)
	at sun.reflect.NativeMethodAccessorImpl.invoke(NativeMethodAccessorImpl.java:39)
	at sun.reflect.DelegatingMethodAccessorImpl.invoke(DelegatingMethodAccessorImpl.java:25)
	at java.lang.reflect.Method.invoke(Method.java:597)
	at org.codehaus.classworlds.Launcher.launchEnhanced(Launcher.java:315)
	at org.codehaus.classworlds.Launcher.launch(Launcher.java:255)
	at hudson.maven.agent.Main.launch(Main.java:185)
	at hudson.maven.MavenBuilder.call(MavenBuilder.java:160)
	at hudson.maven.MavenModuleSetBuild$Builder.call(MavenModuleSetBuild.java:1059)
	at hudson.maven.MavenModuleSetBuild$Builder.call(MavenModuleSetBuild.java:990)
	at hudson.remoting.UserRequest.perform(UserRequest.java:118)
	at hudson.remoting.UserRequest.perform(UserRequest.java:48)
	at hudson.remoting.Request$2.run(Request.java:287)
	at java.util.concurrent.Executors$RunnableAdapter.call(Executors.java:441)
	at java.util.concurrent.FutureTask$Sync.innerRun(FutureTask.java:303)
	at java.util.concurrent.FutureTask.run(FutureTask.java:138)
	at java.util.concurrent.ThreadPoolExecutor$Worker.runTask(ThreadPoolExecutor.java:886)
	at java.util.concurrent.ThreadPoolExecutor$Worker.run(ThreadPoolExecutor.java:908)
	at java.lang.Thread.run(Thread.java:619)
Caused by: org.apache.maven.plugin.MojoExecutionException: Failed to create assembly: Error
creating assembly archive bin: Failed to retrieve numeric file attributes using: '/bin/sh
-c ls -1nlaR /'
	at org.apache.maven.plugin.assembly.mojos.AbstractAssemblyMojo.execute(AbstractAssemblyMojo.java:429)
	at org.apache.maven.plugin.DefaultPluginManager.executeMojo(DefaultPluginManager.java:490)
	at hudson.maven.agent.PluginManagerInterceptor.executeMojo(PluginManagerInterceptor.java:182)
	at org.apache.maven.lifecycle.DefaultLifecycleExecutor.executeGoals(DefaultLifecycleExecutor.java:694)
	... 28 more
Caused by: org.apache.maven.plugin.assembly.archive.ArchiveCreationException: Error creating
assembly archive bin: Failed to retrieve numeric file attributes using: '/bin/sh -c ls -1nlaR
/'
	at org.apache.maven.plugin.assembly.archive.DefaultAssemblyArchiver.createArchive(DefaultAssemblyArchiver.java:197)
	at org.apache.maven.plugin.assembly.mojos.AbstractAssemblyMojo.execute(AbstractAssemblyMojo.java:378)
	... 31 more
Caused by: org.codehaus.plexus.archiver.ArchiverException: Failed to retrieve numeric file
attributes using: '/bin/sh -c ls -1nlaR /'
	at org.codehaus.plexus.archiver.AbstractArchiver$1.hasNext(AbstractArchiver.java:427)
	at org.apache.maven.plugin.assembly.filter.ComponentsXmlArchiverFileFilter.finalizeArchiveCreation(ComponentsXmlArchiverFileFilter.java:166)
	at org.codehaus.plexus.archiver.AbstractArchiver.runArchiveFinalizers(AbstractArchiver.java:826)
	at org.codehaus.plexus.archiver.AbstractArchiver.createArchive(AbstractArchiver.java:850)
	at org.apache.maven.plugin.assembly.archive.archiver.AssemblyProxyArchiver.createArchive(AssemblyProxyArchiver.java:496)
	at org.apache.maven.plugin.assembly.archive.DefaultAssemblyArchiver.createArchive(DefaultAssemblyArchiver.java:193)
	... 32 more
Caused by: java.io.IOException: Failed to retrieve numeric file attributes using: '/bin/sh
-c ls -1nlaR /'
	at org.codehaus.plexus.components.io.attributes.PlexusIoResourceAttributeUtils.executeLs(PlexusIoResourceAttributeUtils.java:281)
	at org.codehaus.plexus.components.io.attributes.PlexusIoResourceAttributeUtils.getFileAttributesByPath(PlexusIoResourceAttributeUtils.java:222)
	at org.codehaus.plexus.components.io.attributes.PlexusIoResourceAttributeUtils.getFileAttributesByPath(PlexusIoResourceAttributeUtils.java:188)
	at org.codehaus.plexus.components.io.resources.PlexusIoFileResourceCollection.getResources(PlexusIoFileResourceCollection.java:175)
	at org.codehaus.plexus.archiver.AbstractArchiver$1.hasNext(AbstractArchiver.java:423)
	... 37 more
[INFO] ------------------------------------------------------------------------
[INFO] Total time: 32 minutes 39 seconds
[INFO] Finished at: Thu Oct 13 17:24:41 UTC 2011
[INFO] Final Memory: 148M/904M
[INFO] ------------------------------------------------------------------------
Sending e-mails to: dev@aries.apache.org
Sending e-mails to: dev@aries.apache.org
channel stopped


Mime
View raw message