aries-dev mailing list archives

Site index · List index
Message view « Date » · « Thread »
Top « Date » · « Thread »
From Apache Jenkins Server <jenk...@builds.apache.org>
Subject Build failed in Jenkins: Aries #1248
Date Tue, 22 Nov 2011 19:54:54 GMT
See <https://builds.apache.org/job/Aries/1248/changes>

Changes:

[davidb] Enabled more tests for the generic capability model

[davidb] First pass at support for Generic Capabilities and Generic Requirements to opt in
to SPI Fly support. This is consistent with the latest RFC 167. The following headers are
supported:
  Provide-Capability: osgi.spi.provider; effective:=active
this is identical to the old SPI-Provider: * header

  Require-Capability: osgi.spi.provider; effective:=active
this is identical to the old SPI-Consumer: * header.

The SPI-Provider and SPI-Consumer headers will continue to be supported by this component
but are not part of the OSGi Specification any more.

------------------------------------------
[...truncated 1203 lines...]
[INFO] Checking unresolved references to org.codehaus.mojo.signature:java15:1.0
[INFO] [jar:jar {execution: default-jar}]
[INFO] Building jar: <https://builds.apache.org/job/Aries/ws/aries/quiesce/quiesce-manager-itest/target/org.apache.aries.quiesce.manager.itest-0.3.2-SNAPSHOT.jar>
[INFO] [ianal:verify-legal-files {execution: default}]
[INFO] Checking legal files in: org.apache.aries.quiesce.manager.itest-0.3.2-SNAPSHOT.jar
[INFO] [install:install {execution: default-install}]
[INFO] Installing <https://builds.apache.org/job/Aries/ws/aries/quiesce/quiesce-manager-itest/target/org.apache.aries.quiesce.manager.itest-0.3.2-SNAPSHOT.jar>
to /home/jenkins/.m2/repository/org/apache/aries/quiesce/org.apache.aries.quiesce.manager.itest/0.3.2-SNAPSHOT/org.apache.aries.quiesce.manager.itest-0.3.2-SNAPSHOT.jar
[JENKINS] Archiving <https://builds.apache.org/job/Aries/ws/aries/quiesce/quiesce-manager-itest/pom.xml>
to /home/hudson/hudson/jobs/Aries/modules/org.apache.aries.quiesce$org.apache.aries.quiesce.manager.itest/builds/2011-11-22_19-51-24/archive/org.apache.aries.quiesce/org.apache.aries.quiesce.manager.itest/0.3.2-SNAPSHOT/org.apache.aries.quiesce.manager.itest-0.3.2-SNAPSHOT.pom
[JENKINS] Archiving <https://builds.apache.org/job/Aries/ws/aries/quiesce/quiesce-manager-itest/target/org.apache.aries.quiesce.manager.itest-0.3.2-SNAPSHOT.jar>
to /home/hudson/hudson/jobs/Aries/modules/org.apache.aries.quiesce$org.apache.aries.quiesce.manager.itest/builds/2011-11-22_19-51-24/archive/org.apache.aries.quiesce/org.apache.aries.quiesce.manager.itest/0.3.2-SNAPSHOT/org.apache.aries.quiesce.manager.itest-0.3.2-SNAPSHOT.jar
[INFO] ------------------------------------------------------------------------
[INFO] Building Apache Aries Quiesce
[INFO]    task-segment: [clean, install]
[INFO] ------------------------------------------------------------------------
[INFO] [clean:clean {execution: default-clean}]
[INFO] Deleting file set: <https://builds.apache.org/job/Aries/ws/aries/quiesce/target>
(included: [**], excluded: [])
[INFO] [enforcer:enforce {execution: default}]
[INFO] [remote-resources:process {execution: default}]
[INFO] [enforcer:enforce {execution: check-java15}]
[INFO] Checking unresolved references to org.codehaus.mojo.signature:java15:1.0
[INFO] [site:attach-descriptor {execution: default-attach-descriptor}]
[INFO] [ianal:verify-legal-files {execution: default}]
[INFO] [install:install {execution: default-install}]
[INFO] Installing <https://builds.apache.org/job/Aries/ws/aries/quiesce/pom.xml> to
/home/jenkins/.m2/repository/org/apache/aries/quiesce/quiesce/0.3.1-SNAPSHOT/quiesce-0.3.1-SNAPSHOT.pom
[JENKINS] Archiving <https://builds.apache.org/job/Aries/ws/aries/quiesce/pom.xml> to
/home/hudson/hudson/jobs/Aries/modules/org.apache.aries.quiesce$quiesce/builds/2011-11-22_19-51-24/archive/org.apache.aries.quiesce/quiesce/0.3.1-SNAPSHOT/quiesce-0.3.1-SNAPSHOT.pom
[INFO] ------------------------------------------------------------------------
[INFO] Building Apache Aries Blueprint API
[INFO]    task-segment: [clean, install]
[INFO] ------------------------------------------------------------------------
[INFO] [clean:clean {execution: default-clean}]
[INFO] Deleting file set: <https://builds.apache.org/job/Aries/ws/aries/blueprint/blueprint-api/target>
(included: [**], excluded: [])
[INFO] [enforcer:enforce {execution: default}]
[INFO] [remote-resources:process {execution: default}]
[INFO] [resources:resources {execution: default-resources}]
[INFO] Using 'UTF-8' encoding to copy filtered resources.
[INFO] Copying 1 resource
[INFO] skip non existing resourceDirectory <https://builds.apache.org/job/Aries/ws/aries/blueprint/blueprint-api/src/main/filtered-resources>
[INFO] Copying 2 resources
[INFO] Copying 3 resources
[INFO] [compiler:compile {execution: default-compile}]
[INFO] Compiling 30 source files to <https://builds.apache.org/job/Aries/ws/aries/blueprint/blueprint-api/target/classes>
[INFO] [resources:testResources {execution: default-testResources}]
[INFO] Using 'UTF-8' encoding to copy filtered resources.
[INFO] skip non existing resourceDirectory <https://builds.apache.org/job/Aries/ws/aries/blueprint/blueprint-api/src/test/resources>
[INFO] skip non existing resourceDirectory <https://builds.apache.org/job/Aries/ws/aries/blueprint/blueprint-api/src/test/filtered-resources>
[INFO] Copying 3 resources
[INFO] [compiler:testCompile {execution: default-testCompile}]
[INFO] No sources to compile
[INFO] [surefire:test {execution: default-test}]
[INFO] Surefire report directory: <https://builds.apache.org/job/Aries/ws/aries/blueprint/blueprint-api/target/surefire-reports>

-------------------------------------------------------
 T E S T S
-------------------------------------------------------
There are no tests to run.

Results :

Tests run: 0, Failures: 0, Errors: 0, Skipped: 0

[JENKINS] Recording test results[INFO] [enforcer:enforce {execution: check-java15}]
[INFO] Checking unresolved references to org.codehaus.mojo.signature:java15:1.0

[INFO] [bundle:bundle {execution: default-bundle}]
[INFO] [ianal:verify-legal-files {execution: default}]
[INFO] Checking legal files in: org.apache.aries.blueprint.api-0.3.2-SNAPSHOT.jar
[INFO] [install:install {execution: default-install}]
[INFO] Installing <https://builds.apache.org/job/Aries/ws/aries/blueprint/blueprint-api/target/org.apache.aries.blueprint.api-0.3.2-SNAPSHOT.jar>
to /home/jenkins/.m2/repository/org/apache/aries/blueprint/org.apache.aries.blueprint.api/0.3.2-SNAPSHOT/org.apache.aries.blueprint.api-0.3.2-SNAPSHOT.jar
[INFO] [bundle:install {execution: default-install}]
[INFO] Installing org/apache/aries/blueprint/org.apache.aries.blueprint.api/0.3.2-SNAPSHOT/org.apache.aries.blueprint.api-0.3.2-SNAPSHOT.jar
[INFO] Writing OBR metadata
[JENKINS] Archiving <https://builds.apache.org/job/Aries/ws/aries/blueprint/blueprint-api/pom.xml>
to /home/hudson/hudson/jobs/Aries/modules/org.apache.aries.blueprint$org.apache.aries.blueprint.api/builds/2011-11-22_19-51-24/archive/org.apache.aries.blueprint/org.apache.aries.blueprint.api/0.3.2-SNAPSHOT/org.apache.aries.blueprint.api-0.3.2-SNAPSHOT.pom
[JENKINS] Archiving <https://builds.apache.org/job/Aries/ws/aries/blueprint/blueprint-api/target/org.apache.aries.blueprint.api-0.3.2-SNAPSHOT.jar>
to /home/hudson/hudson/jobs/Aries/modules/org.apache.aries.blueprint$org.apache.aries.blueprint.api/builds/2011-11-22_19-51-24/archive/org.apache.aries.blueprint/org.apache.aries.blueprint.api/0.3.2-SNAPSHOT/org.apache.aries.blueprint.api-0.3.2-SNAPSHOT.jar
[INFO] ------------------------------------------------------------------------
[INFO] Building Apache Aries Blueprint Parser
[INFO]    task-segment: [clean, install]
[INFO] ------------------------------------------------------------------------
[INFO] [clean:clean {execution: default-clean}]
[INFO] Deleting file set: <https://builds.apache.org/job/Aries/ws/aries/blueprint/blueprint-parser/target>
(included: [**], excluded: [])
[INFO] [enforcer:enforce {execution: default}]
[INFO] [remote-resources:process {execution: default}]
[INFO] [resources:resources {execution: default-resources}]
[INFO] Using 'UTF-8' encoding to copy filtered resources.
[INFO] skip non existing resourceDirectory <https://builds.apache.org/job/Aries/ws/aries/blueprint/blueprint-parser/src/main/resources>
[INFO] skip non existing resourceDirectory <https://builds.apache.org/job/Aries/ws/aries/blueprint/blueprint-parser/src/main/filtered-resources>
[INFO] Copying 3 resources
[INFO] Copying 3 resources
[INFO] [compiler:compile {execution: default-compile}]
[INFO] Compiling 56 source files to <https://builds.apache.org/job/Aries/ws/aries/blueprint/blueprint-parser/target/classes>
[INFO] [resources:testResources {execution: default-testResources}]
[INFO] Using 'UTF-8' encoding to copy filtered resources.
[INFO] skip non existing resourceDirectory <https://builds.apache.org/job/Aries/ws/aries/blueprint/blueprint-parser/src/test/resources>
[INFO] skip non existing resourceDirectory <https://builds.apache.org/job/Aries/ws/aries/blueprint/blueprint-parser/src/test/filtered-resources>
[INFO] Copying 3 resources
[INFO] [compiler:testCompile {execution: default-testCompile}]
[INFO] No sources to compile
[INFO] [surefire:test {execution: default-test}]
[INFO] Surefire report directory: <https://builds.apache.org/job/Aries/ws/aries/blueprint/blueprint-parser/target/surefire-reports>

-------------------------------------------------------
 T E S T S
-------------------------------------------------------
There are no tests to run.

Results :

Tests run: 0, Failures: 0, Errors: 0, Skipped: 0

[JENKINS] Recording test results[INFO] [enforcer:enforce {execution: check-java15}]
[INFO] Checking unresolved references to org.codehaus.mojo.signature:java15:1.0

[INFO] [jar:jar {execution: default-jar}]
[INFO] Building jar: <https://builds.apache.org/job/Aries/ws/aries/blueprint/blueprint-parser/target/blueprint-parser-0.4.1-SNAPSHOT.jar>
[INFO] [ianal:verify-legal-files {execution: default}]
[INFO] Checking legal files in: blueprint-parser-0.4.1-SNAPSHOT.jar
[INFO] [install:install {execution: default-install}]
[INFO] Installing <https://builds.apache.org/job/Aries/ws/aries/blueprint/blueprint-parser/target/blueprint-parser-0.4.1-SNAPSHOT.jar>
to /home/jenkins/.m2/repository/org/apache/aries/blueprint/blueprint-parser/0.4.1-SNAPSHOT/blueprint-parser-0.4.1-SNAPSHOT.jar
[JENKINS] Archiving <https://builds.apache.org/job/Aries/ws/aries/blueprint/blueprint-parser/pom.xml>
to /home/hudson/hudson/jobs/Aries/modules/org.apache.aries.blueprint$blueprint-parser/builds/2011-11-22_19-51-24/archive/org.apache.aries.blueprint/blueprint-parser/0.4.1-SNAPSHOT/blueprint-parser-0.4.1-SNAPSHOT.pom
[JENKINS] Archiving <https://builds.apache.org/job/Aries/ws/aries/blueprint/blueprint-parser/target/blueprint-parser-0.4.1-SNAPSHOT.jar>
to /home/hudson/hudson/jobs/Aries/modules/org.apache.aries.blueprint$blueprint-parser/builds/2011-11-22_19-51-24/archive/org.apache.aries.blueprint/blueprint-parser/0.4.1-SNAPSHOT/blueprint-parser-0.4.1-SNAPSHOT.jar
[INFO] ------------------------------------------------------------------------
[INFO] Building Apache Aries Blueprint Annotation API
[INFO]    task-segment: [clean, install]
[INFO] ------------------------------------------------------------------------
[INFO] [clean:clean {execution: default-clean}]
[INFO] Deleting file set: <https://builds.apache.org/job/Aries/ws/aries/blueprint/blueprint-annotation-api/target>
(included: [**], excluded: [])
[INFO] [enforcer:enforce {execution: default}]
[INFO] [remote-resources:process {execution: default}]
[INFO] [resources:resources {execution: default-resources}]
[INFO] Using 'UTF-8' encoding to copy filtered resources.
[INFO] skip non existing resourceDirectory <https://builds.apache.org/job/Aries/ws/aries/blueprint/blueprint-annotation-api/src/main/resources>
[INFO] skip non existing resourceDirectory <https://builds.apache.org/job/Aries/ws/aries/blueprint/blueprint-annotation-api/src/main/filtered-resources>
[INFO] Copying 2 resources
[INFO] Copying 3 resources
[INFO] [compiler:compile {execution: default-compile}]
[INFO] Compiling 19 source files to <https://builds.apache.org/job/Aries/ws/aries/blueprint/blueprint-annotation-api/target/classes>
[INFO] [resources:testResources {execution: default-testResources}]
[INFO] Using 'UTF-8' encoding to copy filtered resources.
[INFO] skip non existing resourceDirectory <https://builds.apache.org/job/Aries/ws/aries/blueprint/blueprint-annotation-api/src/test/resources>
[INFO] skip non existing resourceDirectory <https://builds.apache.org/job/Aries/ws/aries/blueprint/blueprint-annotation-api/src/test/filtered-resources>
[INFO] Copying 3 resources
[INFO] [compiler:testCompile {execution: default-testCompile}]
[INFO] No sources to compile
[INFO] [surefire:test {execution: default-test}]
[INFO] Surefire report directory: <https://builds.apache.org/job/Aries/ws/aries/blueprint/blueprint-annotation-api/target/surefire-reports>

-------------------------------------------------------
 T E S T S
-------------------------------------------------------
There are no tests to run.

Results :

Tests run: 0, Failures: 0, Errors: 0, Skipped: 0

[JENKINS] Recording test results[INFO] [enforcer:enforce {execution: check-java15}]
[INFO] Checking unresolved references to org.codehaus.mojo.signature:java15:1.0

[INFO] [bundle:bundle {execution: default-bundle}]
[INFO] [ianal:verify-legal-files {execution: default}]
[INFO] Checking legal files in: org.apache.aries.blueprint.annotation.api-0.3.3-SNAPSHOT.jar
[INFO] [install:install {execution: default-install}]
[INFO] Installing <https://builds.apache.org/job/Aries/ws/aries/blueprint/blueprint-annotation-api/target/org.apache.aries.blueprint.annotation.api-0.3.3-SNAPSHOT.jar>
to /home/jenkins/.m2/repository/org/apache/aries/blueprint/org.apache.aries.blueprint.annotation.api/0.3.3-SNAPSHOT/org.apache.aries.blueprint.annotation.api-0.3.3-SNAPSHOT.jar
[INFO] [bundle:install {execution: default-install}]
[INFO] Installing org/apache/aries/blueprint/org.apache.aries.blueprint.annotation.api/0.3.3-SNAPSHOT/org.apache.aries.blueprint.annotation.api-0.3.3-SNAPSHOT.jar
[INFO] Writing OBR metadata
[JENKINS] Archiving <https://builds.apache.org/job/Aries/ws/aries/blueprint/blueprint-annotation-api/pom.xml>
to /home/hudson/hudson/jobs/Aries/modules/org.apache.aries.blueprint$org.apache.aries.blueprint.annotation.api/builds/2011-11-22_19-51-24/archive/org.apache.aries.blueprint/org.apache.aries.blueprint.annotation.api/0.3.3-SNAPSHOT/org.apache.aries.blueprint.annotation.api-0.3.3-SNAPSHOT.pom
[JENKINS] Archiving <https://builds.apache.org/job/Aries/ws/aries/blueprint/blueprint-annotation-api/target/org.apache.aries.blueprint.annotation.api-0.3.3-SNAPSHOT.jar>
to /home/hudson/hudson/jobs/Aries/modules/org.apache.aries.blueprint$org.apache.aries.blueprint.annotation.api/builds/2011-11-22_19-51-24/archive/org.apache.aries.blueprint/org.apache.aries.blueprint.annotation.api/0.3.3-SNAPSHOT/org.apache.aries.blueprint.annotation.api-0.3.3-SNAPSHOT.jar
[INFO] ------------------------------------------------------------------------
[INFO] Building Apache Aries Blueprint Core
[INFO]    task-segment: [clean, install]
[INFO] ------------------------------------------------------------------------
[INFO] [clean:clean {execution: default-clean}]
[INFO] Deleting file set: <https://builds.apache.org/job/Aries/ws/aries/blueprint/blueprint-core/target>
(included: [**], excluded: [])
[INFO] [enforcer:enforce {execution: default}]
[INFO] [dependency:unpack {execution: unpack-sources}]
[INFO] Configured Artifact: org.apache.aries.blueprint:org.apache.aries.blueprint.api:sources:?:jar
[INFO] Unpacking /home/jenkins/.m2/repository/org/apache/aries/blueprint/org.apache.aries.blueprint.api/0.3/org.apache.aries.blueprint.api-0.3-sources.jarto
 <https://builds.apache.org/job/Aries/ws/aries/blueprint/blueprint-core/target/sources>
with Includes **/blueprint.xsd and excludes:null
[INFO] [remote-resources:process {execution: default}]
[INFO] [resources:resources {execution: default-resources}]
[INFO] Using 'UTF-8' encoding to copy filtered resources.
[INFO] Copying 6 resources
[INFO] Copying 8 resources
[INFO] Copying 3 resources
[INFO] [compiler:compile {execution: default-compile}]
[INFO] Compiling 60 source files to <https://builds.apache.org/job/Aries/ws/aries/blueprint/blueprint-core/target/classes>
[JENKINS] Archiving <https://builds.apache.org/job/Aries/ws/aries/blueprint/blueprint-core/pom.xml>
to /home/hudson/hudson/jobs/Aries/modules/org.apache.aries.blueprint$org.apache.aries.blueprint.core/builds/2011-11-22_19-51-24/archive/org.apache.aries.blueprint/org.apache.aries.blueprint.core/0.4.1-SNAPSHOT/org.apache.aries.blueprint.core-0.4.1-SNAPSHOT.pom
[INFO] ------------------------------------------------------------------------
[ERROR] BUILD FAILURE
[INFO] ------------------------------------------------------------------------
[INFO] Compilation failure

<https://builds.apache.org/job/Aries/ws/aries/blueprint/blueprint-core/src/main/java/org/apache/aries/blueprint/container/BlueprintContainerImpl.java>:[107,30]
[deprecation] org.apache.aries.blueprint.ExtendedBlueprintContainer in org.apache.aries.blueprint
has been deprecated

<https://builds.apache.org/job/Aries/ws/aries/blueprint/blueprint-core/src/main/java/org/apache/aries/blueprint/container/ReferenceListRecipe.java>:[191,16]
cannot find symbol
symbol  : class Bundle
location: class org.apache.aries.blueprint.container.ReferenceListRecipe.ServiceDispatcher

<https://builds.apache.org/job/Aries/ws/aries/blueprint/blueprint-core/src/main/java/org/apache/aries/blueprint/container/ReferenceListRecipe.java>:[193,20]
cannot find symbol
symbol  : class BundleContext
location: class org.apache.aries.blueprint.container.ReferenceListRecipe.ServiceDispatcher


[INFO] ------------------------------------------------------------------------
[INFO] Trace
org.apache.maven.BuildFailureException: Compilation failure
	at org.apache.maven.lifecycle.DefaultLifecycleExecutor.executeGoals(DefaultLifecycleExecutor.java:715)
	at org.apache.maven.lifecycle.DefaultLifecycleExecutor.executeGoalWithLifecycle(DefaultLifecycleExecutor.java:556)
	at org.apache.maven.lifecycle.DefaultLifecycleExecutor.executeGoal(DefaultLifecycleExecutor.java:535)
	at org.apache.maven.lifecycle.DefaultLifecycleExecutor.executeGoalAndHandleFailures(DefaultLifecycleExecutor.java:387)
	at org.apache.maven.lifecycle.DefaultLifecycleExecutor.executeTaskSegments(DefaultLifecycleExecutor.java:348)
	at org.apache.maven.lifecycle.DefaultLifecycleExecutor.execute(DefaultLifecycleExecutor.java:180)
	at org.apache.maven.lifecycle.LifecycleExecutorInterceptor.execute(LifecycleExecutorInterceptor.java:65)
	at org.apache.maven.DefaultMaven.doExecute(DefaultMaven.java:328)
	at org.apache.maven.DefaultMaven.execute(DefaultMaven.java:138)
	at org.apache.maven.cli.MavenCli.main(MavenCli.java:362)
	at sun.reflect.NativeMethodAccessorImpl.invoke0(Native Method)
	at sun.reflect.NativeMethodAccessorImpl.invoke(NativeMethodAccessorImpl.java:39)
	at sun.reflect.DelegatingMethodAccessorImpl.invoke(DelegatingMethodAccessorImpl.java:25)
	at java.lang.reflect.Method.invoke(Method.java:597)
	at org.codehaus.classworlds.Launcher.launchEnhanced(Launcher.java:315)
	at org.codehaus.classworlds.Launcher.launch(Launcher.java:255)
	at hudson.maven.agent.Main.launch(Main.java:185)
	at hudson.maven.MavenBuilder.call(MavenBuilder.java:160)
	at hudson.maven.MavenModuleSetBuild$Builder.call(MavenModuleSetBuild.java:1059)
	at hudson.maven.MavenModuleSetBuild$Builder.call(MavenModuleSetBuild.java:990)
	at hudson.remoting.UserRequest.perform(UserRequest.java:118)
	at hudson.remoting.UserRequest.perform(UserRequest.java:48)
	at hudson.remoting.Request$2.run(Request.java:287)
	at java.util.concurrent.Executors$RunnableAdapter.call(Executors.java:441)
	at java.util.concurrent.FutureTask$Sync.innerRun(FutureTask.java:303)
	at java.util.concurrent.FutureTask.run(FutureTask.java:138)
	at java.util.concurrent.ThreadPoolExecutor$Worker.runTask(ThreadPoolExecutor.java:886)
	at java.util.concurrent.ThreadPoolExecutor$Worker.run(ThreadPoolExecutor.java:908)
	at java.lang.Thread.run(Thread.java:662)
Caused by: org.apache.maven.plugin.CompilationFailureException: Compilation failure
	at org.apache.maven.plugin.AbstractCompilerMojo.execute(AbstractCompilerMojo.java:516)
	at org.apache.maven.plugin.CompilerMojo.execute(CompilerMojo.java:114)
	at org.apache.maven.plugin.DefaultPluginManager.executeMojo(DefaultPluginManager.java:490)
	at hudson.maven.agent.PluginManagerInterceptor.executeMojo(PluginManagerInterceptor.java:182)
	at org.apache.maven.lifecycle.DefaultLifecycleExecutor.executeGoals(DefaultLifecycleExecutor.java:694)
	... 28 more
[INFO] ------------------------------------------------------------------------
[INFO] Total time: 2 minutes 58 seconds
[INFO] Finished at: Tue Nov 22 19:54:48 UTC 2011
[INFO] Final Memory: 152M/394M
[INFO] ------------------------------------------------------------------------
Sending e-mails to: dev@aries.apache.org
channel stopped


Mime
View raw message