aries-dev mailing list archives

Site index · List index
Message view « Date » · « Thread »
Top « Date » · « Thread »
From Apache Jenkins Server <jenk...@builds.apache.org>
Subject Build failed in Jenkins: Aries #1232
Date Wed, 16 Nov 2011 15:59:17 GMT
See <https://builds.apache.org/job/Aries/1232/changes>

Changes:

[dkulp] Update all parents to 0.5 version and reset relativePath elements

------------------------------------------
[...truncated 3924 lines...]
[INFO] Building jar: <https://builds.apache.org/job/Aries/ws/aries/transaction/transaction-manager/target/org.apache.aries.transaction.manager-0.3.1-SNAPSHOT-sources.jar>
[INFO] [shade:shade {execution: default}]
[INFO] Excluding org.springframework:spring-tx:jar:2.5.6 from the shaded jar.
[INFO] Excluding commons-logging:commons-logging:jar:1.1.1 from the shaded jar.
[INFO] Excluding org.springframework:spring-beans:jar:2.5.6 from the shaded jar.
[INFO] Excluding org.springframework:spring-core:jar:2.5.6 from the shaded jar.
[INFO] Excluding org.springframework:spring-context:jar:2.5.6 from the shaded jar.
[INFO] Excluding aopalliance:aopalliance:jar:1.0 from the shaded jar.
[INFO] No artifact matching filter org.apache.geronimo.components:geronimo-transaction
[INFO] No artifact matching filter org.objectweb.howl:howl
[INFO] Replacing original artifact with shaded artifact.
[INFO] Replacing <https://builds.apache.org/job/Aries/ws/aries/transaction/transaction-manager/target/org.apache.aries.transaction.manager-0.3.1-SNAPSHOT.jar>
with <https://builds.apache.org/job/Aries/ws/aries/transaction/transaction-manager/target/org.apache.aries.transaction.manager-0.3.1-SNAPSHOT-shaded.jar>
[INFO] Replacing <https://builds.apache.org/job/Aries/ws/aries/transaction/transaction-manager/target/org.apache.aries.transaction.manager-0.3.1-SNAPSHOT-sources.jar>
with <https://builds.apache.org/job/Aries/ws/aries/transaction/transaction-manager/target/org.apache.aries.transaction.manager-0.3.1-SNAPSHOT-shaded-sources.jar>
[INFO] [ianal:verify-legal-files {execution: default}]
[INFO] Checking legal files in: org.apache.aries.transaction.manager-0.3.1-SNAPSHOT.jar
[INFO] Checking legal files in: org.apache.aries.transaction.manager-0.3.1-SNAPSHOT-sources.jar
[INFO] Checking legal files in: org.apache.aries.transaction.manager-0.3.1-SNAPSHOT-sources.jar
[INFO] [install:install {execution: default-install}]
[INFO] Installing <https://builds.apache.org/job/Aries/ws/aries/transaction/transaction-manager/target/org.apache.aries.transaction.manager-0.3.1-SNAPSHOT.jar>
to /home/jenkins/.m2/repository/org/apache/aries/transaction/org.apache.aries.transaction.manager/0.3.1-SNAPSHOT/org.apache.aries.transaction.manager-0.3.1-SNAPSHOT.jar
[INFO] Installing <https://builds.apache.org/job/Aries/ws/aries/transaction/transaction-manager/target/org.apache.aries.transaction.manager-0.3.1-SNAPSHOT-sources.jar>
to /home/jenkins/.m2/repository/org/apache/aries/transaction/org.apache.aries.transaction.manager/0.3.1-SNAPSHOT/org.apache.aries.transaction.manager-0.3.1-SNAPSHOT-sources.jar
[INFO] Installing <https://builds.apache.org/job/Aries/ws/aries/transaction/transaction-manager/target/org.apache.aries.transaction.manager-0.3.1-SNAPSHOT-sources.jar>
to /home/jenkins/.m2/repository/org/apache/aries/transaction/org.apache.aries.transaction.manager/0.3.1-SNAPSHOT/org.apache.aries.transaction.manager-0.3.1-SNAPSHOT-sources.jar
[INFO] [bundle:install {execution: default-install}]
[INFO] Installing org/apache/aries/transaction/org.apache.aries.transaction.manager/0.3.1-SNAPSHOT/org.apache.aries.transaction.manager-0.3.1-SNAPSHOT.jar
[INFO] Installing org/apache/aries/transaction/org.apache.aries.transaction.manager/0.3.1-SNAPSHOT/org.apache.aries.transaction.manager-0.3.1-SNAPSHOT-sources.jar
[INFO] Writing OBR metadata
[JENKINS] Re-archiving <https://builds.apache.org/job/Aries/ws/aries/transaction/transaction-manager/target/org.apache.aries.transaction.manager-0.3.1-SNAPSHOT.jar>
[JENKINS] Archiving <https://builds.apache.org/job/Aries/ws/aries/transaction/transaction-manager/target/org.apache.aries.transaction.manager-0.3.1-SNAPSHOT-sources.jar>
to /home/hudson/hudson/jobs/Aries/modules/org.apache.aries.transaction$org.apache.aries.transaction.manager/builds/2011-11-16_15-51-13/archive/org.apache.aries.transaction/org.apache.aries.transaction.manager/0.3.1-SNAPSHOT/org.apache.aries.transaction.manager-0.3.1-SNAPSHOT-sources.jar
[INFO] ------------------------------------------------------------------------
[INFO] Building Apache Aries Transaction Blueprint
[INFO]    task-segment: [clean, install]
[INFO] ------------------------------------------------------------------------
[INFO] [clean:clean {execution: default-clean}]
[INFO] Deleting file set: <https://builds.apache.org/job/Aries/ws/aries/transaction/transaction-blueprint/target>
(included: [**], excluded: [])
[INFO] [enforcer:enforce {execution: default}]
[INFO] [remote-resources:process {execution: default}]
[INFO] [resources:resources {execution: default-resources}]
[INFO] Using 'UTF-8' encoding to copy filtered resources.
[INFO] Copying 4 resources
[INFO] skip non existing resourceDirectory <https://builds.apache.org/job/Aries/ws/aries/transaction/transaction-blueprint/src/main/filtered-resources>
[INFO] Copying 1 resource
[INFO] Copying 3 resources
[INFO] [compiler:compile {execution: default-compile}]
[INFO] Compiling 12 source files to <https://builds.apache.org/job/Aries/ws/aries/transaction/transaction-blueprint/target/classes>
[INFO] [resources:testResources {execution: default-testResources}]
[INFO] Using 'UTF-8' encoding to copy filtered resources.
[INFO] Copying 10 resources
[INFO] skip non existing resourceDirectory <https://builds.apache.org/job/Aries/ws/aries/transaction/transaction-blueprint/src/test/filtered-resources>
[INFO] Copying 3 resources
[INFO] [compiler:testCompile {execution: default-testCompile}]
[INFO] Compiling 5 source files to <https://builds.apache.org/job/Aries/ws/aries/transaction/transaction-blueprint/target/test-classes>
[INFO] [surefire:test {execution: default-test}]
[INFO] Surefire report directory: <https://builds.apache.org/job/Aries/ws/aries/transaction/transaction-blueprint/target/surefire-reports>

-------------------------------------------------------
 T E S T S
-------------------------------------------------------
Running org.apache.aries.transaction.TranStrategyTest
Tests run: 13, Failures: 0, Errors: 0, Skipped: 0, Time elapsed: 0.077 sec
Running org.apache.aries.transaction.NameSpaceHandlerTest
Tests run: 9, Failures: 0, Errors: 0, Skipped: 0, Time elapsed: 0.476 sec
Running org.apache.aries.transaction.BundleWideNameSpaceHandlerTest
Tests run: 3, Failures: 0, Errors: 0, Skipped: 0, Time elapsed: 0.082 sec
Running org.apache.aries.transaction.InterceptorTest
Tests run: 1, Failures: 0, Errors: 0, Skipped: 0, Time elapsed: 0.004 sec

Results :

Tests run: 26, Failures: 0, Errors: 0, Skipped: 0

[JENKINS] Recording test results
[INFO] [enforcer:enforce {execution: check-java15}]
[INFO] Checking unresolved references to org.codehaus.mojo.signature:java15:1.0
[INFO] [bundle:bundle {execution: default-bundle}]
java.lang.NullPointerException
	at java.util.regex.Matcher.getTextLength(Matcher.java:1140)
	at java.util.regex.Matcher.reset(Matcher.java:291)
	at java.util.regex.Matcher.<init>(Matcher.java:211)
	at java.util.regex.Pattern.matcher(Pattern.java:888)
	at aQute.libg.version.Version.<init>(Version.java:43)
	at aQute.lib.osgi.Macro.version(Macro.java:633)
	at aQute.lib.osgi.Macro._range(Macro.java:713)
	at sun.reflect.GeneratedMethodAccessor176.invoke(Unknown Source)
	at sun.reflect.DelegatingMethodAccessorImpl.invoke(DelegatingMethodAccessorImpl.java:25)
	at java.lang.reflect.Method.invoke(Method.java:597)
	at aQute.lib.osgi.Macro.doCommand(Macro.java:180)
	at aQute.lib.osgi.Macro.doCommands(Macro.java:169)
	at aQute.lib.osgi.Macro.replace(Macro.java:116)
	at aQute.lib.osgi.Macro.process(Macro.java:62)
	at aQute.lib.osgi.Macro.process(Macro.java:77)
	at aQute.lib.osgi.Macro.process(Macro.java:49)
	at aQute.lib.osgi.Macro.process(Macro.java:44)
	at aQute.lib.osgi.Processor.getProperty(Processor.java:622)
	at aQute.lib.osgi.Processor.getProperty(Processor.java:395)
	at aQute.lib.osgi.Analyzer.getImportPackages(Analyzer.java:258)
	at aQute.lib.osgi.Builder.getImportPackages(Builder.java:249)
	at aQute.lib.osgi.Analyzer.analyze(Analyzer.java:154)
	at aQute.lib.osgi.Builder.analyze(Builder.java:296)
	at aQute.lib.osgi.Analyzer.calcManifest(Analyzer.java:292)
	at aQute.lib.osgi.Builder.build(Builder.java:68)
	at org.apache.felix.bundleplugin.BundlePlugin.buildOSGiBundle(BundlePlugin.java:375)
	at org.apache.felix.bundleplugin.BundlePlugin.execute(BundlePlugin.java:270)
	at org.apache.felix.bundleplugin.BundlePlugin.execute(BundlePlugin.java:224)
	at org.apache.felix.bundleplugin.BundlePlugin.execute(BundlePlugin.java:215)
	at org.apache.maven.plugin.DefaultPluginManager.executeMojo(DefaultPluginManager.java:490)
	at hudson.maven.agent.PluginManagerInterceptor.executeMojo(PluginManagerInterceptor.java:182)
	at org.apache.maven.lifecycle.DefaultLifecycleExecutor.executeGoals(DefaultLifecycleExecutor.java:694)
	at org.apache.maven.lifecycle.DefaultLifecycleExecutor.executeGoalWithLifecycle(DefaultLifecycleExecutor.java:556)
	at org.apache.maven.lifecycle.DefaultLifecycleExecutor.executeGoal(DefaultLifecycleExecutor.java:535)
	at org.apache.maven.lifecycle.DefaultLifecycleExecutor.executeGoalAndHandleFailures(DefaultLifecycleExecutor.java:387)
	at org.apache.maven.lifecycle.DefaultLifecycleExecutor.executeTaskSegments(DefaultLifecycleExecutor.java:348)
	at org.apache.maven.lifecycle.DefaultLifecycleExecutor.execute(DefaultLifecycleExecutor.java:180)
	at org.apache.maven.lifecycle.LifecycleExecutorInterceptor.execute(LifecycleExecutorInterceptor.java:65)
	at org.apache.maven.DefaultMaven.doExecute(DefaultMaven.java:328)
	at org.apache.maven.DefaultMaven.execute(DefaultMaven.java:138)
	at org.apache.maven.cli.MavenCli.main(MavenCli.java:362)
	at sun.reflect.NativeMethodAccessorImpl.invoke0(Native Method)
	at sun.reflect.NativeMethodAccessorImpl.invoke(NativeMethodAccessorImpl.java:39)
	at sun.reflect.DelegatingMethodAccessorImpl.invoke(DelegatingMethodAccessorImpl.java:25)
	at java.lang.reflect.Method.invoke(Method.java:597)
	at org.codehaus.classworlds.Launcher.launchEnhanced(Launcher.java:315)
	at org.codehaus.classworlds.Launcher.launch(Launcher.java:255)
	at hudson.maven.agent.Main.launch(Main.java:185)
	at hudson.maven.MavenBuilder.call(MavenBuilder.java:160)
	at hudson.maven.MavenModuleSetBuild$Builder.call(MavenModuleSetBuild.java:1059)
	at hudson.maven.MavenModuleSetBuild$Builder.call(MavenModuleSetBuild.java:990)
	at hudson.remoting.UserRequest.perform(UserRequest.java:118)
	at hudson.remoting.UserRequest.perform(UserRequest.java:48)
	at hudson.remoting.Request$2.run(Request.java:287)
	at java.util.concurrent.Executors$RunnableAdapter.call(Executors.java:441)
	at java.util.concurrent.FutureTask$Sync.innerRun(FutureTask.java:303)
	at java.util.concurrent.FutureTask.run(FutureTask.java:138)
	at java.util.concurrent.ThreadPoolExecutor$Worker.runTask(ThreadPoolExecutor.java:886)
	at java.util.concurrent.ThreadPoolExecutor$Worker.run(ThreadPoolExecutor.java:908)
	at java.lang.Thread.run(Thread.java:662)
[WARNING] Warning building bundle org.apache.aries.transaction:org.apache.aries.transaction.blueprint:bundle:0.3.1-SNAPSHOT
: Exception in replace: java.lang.NullPointerException
[WARNING] Warning building bundle org.apache.aries.transaction:org.apache.aries.transaction.blueprint:bundle:0.3.1-SNAPSHOT
: No translation found for macro: range;[==,=+)
[INFO] [ianal:verify-legal-files {execution: default}]
[INFO] Checking legal files in: org.apache.aries.transaction.blueprint-0.3.1-SNAPSHOT.jar
[INFO] [install:install {execution: default-install}]
[INFO] Installing <https://builds.apache.org/job/Aries/ws/aries/transaction/transaction-blueprint/target/org.apache.aries.transaction.blueprint-0.3.1-SNAPSHOT.jar>
to /home/jenkins/.m2/repository/org/apache/aries/transaction/org.apache.aries.transaction.blueprint/0.3.1-SNAPSHOT/org.apache.aries.transaction.blueprint-0.3.1-SNAPSHOT.jar
[INFO] [bundle:install {execution: default-install}]
[INFO] Installing org/apache/aries/transaction/org.apache.aries.transaction.blueprint/0.3.1-SNAPSHOT/org.apache.aries.transaction.blueprint-0.3.1-SNAPSHOT.jar
[INFO] Writing OBR metadata
[JENKINS] Archiving <https://builds.apache.org/job/Aries/ws/aries/transaction/transaction-blueprint/pom.xml>
to /home/hudson/hudson/jobs/Aries/modules/org.apache.aries.transaction$org.apache.aries.transaction.blueprint/builds/2011-11-16_15-51-13/archive/org.apache.aries.transaction/org.apache.aries.transaction.blueprint/0.3.1-SNAPSHOT/org.apache.aries.transaction.blueprint-0.3.1-SNAPSHOT.pom
[JENKINS] Archiving <https://builds.apache.org/job/Aries/ws/aries/transaction/transaction-blueprint/target/org.apache.aries.transaction.blueprint-0.3.1-SNAPSHOT.jar>
to /home/hudson/hudson/jobs/Aries/modules/org.apache.aries.transaction$org.apache.aries.transaction.blueprint/builds/2011-11-16_15-51-13/archive/org.apache.aries.transaction/org.apache.aries.transaction.blueprint/0.3.1-SNAPSHOT/org.apache.aries.transaction.blueprint-0.3.1-SNAPSHOT.jar
[INFO] ------------------------------------------------------------------------
[INFO] Building Apache Aries Transaction Enlisting JDBC Datasource
[INFO]    task-segment: [clean, install]
[INFO] ------------------------------------------------------------------------
[INFO] [clean:clean {execution: default-clean}]
[INFO] Deleting file set: <https://builds.apache.org/job/Aries/ws/aries/transaction/transaction-wrappers/target>
(included: [**], excluded: [])
[INFO] [enforcer:enforce {execution: default}]
[INFO] [remote-resources:process {execution: default}]
[INFO] [resources:resources {execution: default-resources}]
[INFO] Using 'UTF-8' encoding to copy filtered resources.
[INFO] Copying 1 resource
[INFO] skip non existing resourceDirectory <https://builds.apache.org/job/Aries/ws/aries/transaction/transaction-wrappers/src/main/filtered-resources>
[INFO] Copying 0 resource
[INFO] Copying 3 resources
[INFO] [compiler:compile {execution: default-compile}]
[INFO] Compiling 5 source files to <https://builds.apache.org/job/Aries/ws/aries/transaction/transaction-wrappers/target/classes>
[INFO] [resources:testResources {execution: default-testResources}]
[INFO] Using 'UTF-8' encoding to copy filtered resources.
[INFO] skip non existing resourceDirectory <https://builds.apache.org/job/Aries/ws/aries/transaction/transaction-wrappers/src/test/resources>
[INFO] skip non existing resourceDirectory <https://builds.apache.org/job/Aries/ws/aries/transaction/transaction-wrappers/src/test/filtered-resources>
[INFO] Copying 3 resources
[INFO] [compiler:testCompile {execution: default-testCompile}]
[INFO] No sources to compile
[INFO] [surefire:test {execution: default-test}]
[INFO] Surefire report directory: <https://builds.apache.org/job/Aries/ws/aries/transaction/transaction-wrappers/target/surefire-reports>

-------------------------------------------------------
 T E S T S
-------------------------------------------------------
There are no tests to run.

Results :

Tests run: 0, Failures: 0, Errors: 0, Skipped: 0

[JENKINS] Recording test results[INFO] [enforcer:enforce {execution: check-java15}]
[INFO] Checking unresolved references to org.codehaus.mojo.signature:java15:1.0

[ERROR] Undefined reference: java/sql/Connection.createArrayOf(Ljava/lang/String;[Ljava/lang/Object;)Ljava/sql/Array;
in <https://builds.apache.org/job/Aries/ws/aries/transaction/transaction-wrappers/target/classes/org/apache/aries/transaction/jdbc/ConnectionWrapper.class>
[ERROR] Undefined reference: java/sql/Connection.createBlob()Ljava/sql/Blob; in <https://builds.apache.org/job/Aries/ws/aries/transaction/transaction-wrappers/target/classes/org/apache/aries/transaction/jdbc/ConnectionWrapper.class>
[ERROR] Undefined reference: java/sql/Connection.createClob()Ljava/sql/Clob; in <https://builds.apache.org/job/Aries/ws/aries/transaction/transaction-wrappers/target/classes/org/apache/aries/transaction/jdbc/ConnectionWrapper.class>
[ERROR] Undefined reference: java/sql/Connection.createNClob()Ljava/sql/NClob; in <https://builds.apache.org/job/Aries/ws/aries/transaction/transaction-wrappers/target/classes/org/apache/aries/transaction/jdbc/ConnectionWrapper.class>
[ERROR] Undefined reference: java/sql/Connection.createSQLXML()Ljava/sql/SQLXML; in <https://builds.apache.org/job/Aries/ws/aries/transaction/transaction-wrappers/target/classes/org/apache/aries/transaction/jdbc/ConnectionWrapper.class>
[ERROR] Undefined reference: java/sql/Connection.createStruct(Ljava/lang/String;[Ljava/lang/Object;)Ljava/sql/Struct;
in <https://builds.apache.org/job/Aries/ws/aries/transaction/transaction-wrappers/target/classes/org/apache/aries/transaction/jdbc/ConnectionWrapper.class>
[ERROR] Undefined reference: java/sql/Connection.getClientInfo()Ljava/util/Properties; in
<https://builds.apache.org/job/Aries/ws/aries/transaction/transaction-wrappers/target/classes/org/apache/aries/transaction/jdbc/ConnectionWrapper.class>
[ERROR] Undefined reference: java/sql/Connection.getClientInfo(Ljava/lang/String;)Ljava/lang/String;
in <https://builds.apache.org/job/Aries/ws/aries/transaction/transaction-wrappers/target/classes/org/apache/aries/transaction/jdbc/ConnectionWrapper.class>
[ERROR] Undefined reference: java/sql/Connection.isValid(I)Z in <https://builds.apache.org/job/Aries/ws/aries/transaction/transaction-wrappers/target/classes/org/apache/aries/transaction/jdbc/ConnectionWrapper.class>
[ERROR] Undefined reference: java/sql/Connection.isWrapperFor(Ljava/lang/Class;)Z in <https://builds.apache.org/job/Aries/ws/aries/transaction/transaction-wrappers/target/classes/org/apache/aries/transaction/jdbc/ConnectionWrapper.class>
[ERROR] Undefined reference: java/sql/Connection.setClientInfo(Ljava/util/Properties;)V in
<https://builds.apache.org/job/Aries/ws/aries/transaction/transaction-wrappers/target/classes/org/apache/aries/transaction/jdbc/ConnectionWrapper.class>
[ERROR] Undefined reference: java/sql/Connection.setClientInfo(Ljava/lang/String;Ljava/lang/String;)V
in <https://builds.apache.org/job/Aries/ws/aries/transaction/transaction-wrappers/target/classes/org/apache/aries/transaction/jdbc/ConnectionWrapper.class>
[ERROR] Undefined reference: java/sql/Connection.unwrap(Ljava/lang/Class;)Ljava/lang/Object;
in <https://builds.apache.org/job/Aries/ws/aries/transaction/transaction-wrappers/target/classes/org/apache/aries/transaction/jdbc/ConnectionWrapper.class>
[ERROR] Undefined reference: java/sql/SQLException.<init>(Ljava/lang/String;Ljava/lang/Throwable;)V
in <https://builds.apache.org/job/Aries/ws/aries/transaction/transaction-wrappers/target/classes/org/apache/aries/transaction/jdbc/XADatasourceEnlistingWrapper.class>
[WARNING] Rule 0: org.codehaus.mojo.animal_sniffer.enforcer.CheckSignatureRule failed with
message:
Signature errors found. Verify them and put @IgnoreJRERequirement on them.
[JENKINS] Archiving <https://builds.apache.org/job/Aries/ws/aries/transaction/transaction-wrappers/pom.xml>
to /home/hudson/hudson/jobs/Aries/modules/org.apache.aries.transaction$org.apache.aries.transaction.wrappers/builds/2011-11-16_15-51-13/archive/org.apache.aries.transaction/org.apache.aries.transaction.wrappers/0.3.1-SNAPSHOT/org.apache.aries.transaction.wrappers-0.3.1-SNAPSHOT.pom
[INFO] ------------------------------------------------------------------------
[ERROR] BUILD ERROR
[INFO] ------------------------------------------------------------------------
[INFO] Some Enforcer rules have failed. Look above for specific messages explaining why the
rule failed.
[INFO] ------------------------------------------------------------------------
[INFO] Trace
org.apache.maven.lifecycle.LifecycleExecutionException: Some Enforcer rules have failed. Look
above for specific messages explaining why the rule failed.
	at org.apache.maven.lifecycle.DefaultLifecycleExecutor.executeGoals(DefaultLifecycleExecutor.java:719)
	at org.apache.maven.lifecycle.DefaultLifecycleExecutor.executeGoalWithLifecycle(DefaultLifecycleExecutor.java:556)
	at org.apache.maven.lifecycle.DefaultLifecycleExecutor.executeGoal(DefaultLifecycleExecutor.java:535)
	at org.apache.maven.lifecycle.DefaultLifecycleExecutor.executeGoalAndHandleFailures(DefaultLifecycleExecutor.java:387)
	at org.apache.maven.lifecycle.DefaultLifecycleExecutor.executeTaskSegments(DefaultLifecycleExecutor.java:348)
	at org.apache.maven.lifecycle.DefaultLifecycleExecutor.execute(DefaultLifecycleExecutor.java:180)
	at org.apache.maven.lifecycle.LifecycleExecutorInterceptor.execute(LifecycleExecutorInterceptor.java:65)
	at org.apache.maven.DefaultMaven.doExecute(DefaultMaven.java:328)
	at org.apache.maven.DefaultMaven.execute(DefaultMaven.java:138)
	at org.apache.maven.cli.MavenCli.main(MavenCli.java:362)
	at sun.reflect.NativeMethodAccessorImpl.invoke0(Native Method)
	at sun.reflect.NativeMethodAccessorImpl.invoke(NativeMethodAccessorImpl.java:39)
	at sun.reflect.DelegatingMethodAccessorImpl.invoke(DelegatingMethodAccessorImpl.java:25)
	at java.lang.reflect.Method.invoke(Method.java:597)
	at org.codehaus.classworlds.Launcher.launchEnhanced(Launcher.java:315)
	at org.codehaus.classworlds.Launcher.launch(Launcher.java:255)
	at hudson.maven.agent.Main.launch(Main.java:185)
	at hudson.maven.MavenBuilder.call(MavenBuilder.java:160)
	at hudson.maven.MavenModuleSetBuild$Builder.call(MavenModuleSetBuild.java:1059)
	at hudson.maven.MavenModuleSetBuild$Builder.call(MavenModuleSetBuild.java:990)
	at hudson.remoting.UserRequest.perform(UserRequest.java:118)
	at hudson.remoting.UserRequest.perform(UserRequest.java:48)
	at hudson.remoting.Request$2.run(Request.java:287)
	at java.util.concurrent.Executors$RunnableAdapter.call(Executors.java:441)
	at java.util.concurrent.FutureTask$Sync.innerRun(FutureTask.java:303)
	at java.util.concurrent.FutureTask.run(FutureTask.java:138)
	at java.util.concurrent.ThreadPoolExecutor$Worker.runTask(ThreadPoolExecutor.java:886)
	at java.util.concurrent.ThreadPoolExecutor$Worker.run(ThreadPoolExecutor.java:908)
	at java.lang.Thread.run(Thread.java:662)
Caused by: org.apache.maven.plugin.MojoExecutionException: Some Enforcer rules have failed.
Look above for specific messages explaining why the rule failed.
	at org.apache.maven.plugins.enforcer.EnforceMojo.execute(EnforceMojo.java:218)
	at org.apache.maven.plugin.DefaultPluginManager.executeMojo(DefaultPluginManager.java:490)
	at hudson.maven.agent.PluginManagerInterceptor.executeMojo(PluginManagerInterceptor.java:182)
	at org.apache.maven.lifecycle.DefaultLifecycleExecutor.executeGoals(DefaultLifecycleExecutor.java:694)
	... 28 more
[INFO] ------------------------------------------------------------------------
[INFO] Total time: 7 minutes 33 seconds
[INFO] Finished at: Wed Nov 16 15:59:12 UTC 2011
[INFO] Final Memory: 125M/699M
[INFO] ------------------------------------------------------------------------
Sending e-mails to: dev@aries.apache.org
channel stopped


Mime
View raw message