aries-dev mailing list archives

Site index · List index
Message view « Date » · « Thread »
Top « Date » · « Thread »
From Apache Jenkins Server <jenk...@builds.apache.org>
Subject Build failed in Jenkins: Aries » Apache Aries Blueprint Core #1247
Date Tue, 22 Nov 2011 11:55:05 GMT
See <https://builds.apache.org/job/Aries/org.apache.aries.blueprint$org.apache.aries.blueprint.core/1247/>

------------------------------------------
[INFO] ------------------------------------------------------------------------
[INFO] Building Apache Aries Blueprint Core
[INFO]    task-segment: [clean, install]
[INFO] ------------------------------------------------------------------------
[INFO] [clean:clean {execution: default-clean}]
[INFO] Deleting file set: <https://builds.apache.org/job/Aries/org.apache.aries.blueprint$org.apache.aries.blueprint.core/ws/target>
(included: [**], excluded: [])
[INFO] [enforcer:enforce {execution: default}]
[INFO] [dependency:unpack {execution: unpack-sources}]
[INFO] Configured Artifact: org.apache.aries.blueprint:org.apache.aries.blueprint.api:sources:?:jar
[INFO] Unpacking /home/hudson/.m2/repository/org/apache/aries/blueprint/org.apache.aries.blueprint.api/0.3/org.apache.aries.blueprint.api-0.3-sources.jarto
 <https://builds.apache.org/job/Aries/org.apache.aries.blueprint$org.apache.aries.blueprint.core/ws/target/sources>
with Includes **/blueprint.xsd and excludes:null
[INFO] [remote-resources:process {execution: default}]
[INFO] [resources:resources {execution: default-resources}]
[INFO] Using 'UTF-8' encoding to copy filtered resources.
[INFO] Copying 6 resources
[INFO] Copying 8 resources
[INFO] Copying 3 resources
[INFO] [compiler:compile {execution: default-compile}]
[INFO] Compiling 60 source files to <https://builds.apache.org/job/Aries/org.apache.aries.blueprint$org.apache.aries.blueprint.core/ws/target/classes>
[JENKINS] Archiving <https://builds.apache.org/job/Aries/org.apache.aries.blueprint$org.apache.aries.blueprint.core/ws/pom.xml>
to /home/hudson/hudson/jobs/Aries/modules/org.apache.aries.blueprint$org.apache.aries.blueprint.core/builds/2011-11-22_11-51-35/archive/org.apache.aries.blueprint/org.apache.aries.blueprint.core/0.4.1-SNAPSHOT/org.apache.aries.blueprint.core-0.4.1-SNAPSHOT.pom
[INFO] ------------------------------------------------------------------------
[ERROR] BUILD FAILURE
[INFO] ------------------------------------------------------------------------
[INFO] Compilation failure

<https://builds.apache.org/job/Aries/org.apache.aries.blueprint$org.apache.aries.blueprint.core/ws/src/main/java/org/apache/aries/blueprint/container/BlueprintContainerImpl.java>:[107,30]
[deprecation] org.apache.aries.blueprint.ExtendedBlueprintContainer in org.apache.aries.blueprint
has been deprecated

<https://builds.apache.org/job/Aries/org.apache.aries.blueprint$org.apache.aries.blueprint.core/ws/src/main/java/org/apache/aries/blueprint/container/ReferenceListRecipe.java>:[191,16]
cannot find symbol
symbol  : class Bundle
location: class org.apache.aries.blueprint.container.ReferenceListRecipe.ServiceDispatcher

<https://builds.apache.org/job/Aries/org.apache.aries.blueprint$org.apache.aries.blueprint.core/ws/src/main/java/org/apache/aries/blueprint/container/ReferenceListRecipe.java>:[193,20]
cannot find symbol
symbol  : class BundleContext
location: class org.apache.aries.blueprint.container.ReferenceListRecipe.ServiceDispatcher


[INFO] ------------------------------------------------------------------------
[INFO] Trace
org.apache.maven.BuildFailureException: Compilation failure
	at org.apache.maven.lifecycle.DefaultLifecycleExecutor.executeGoals(DefaultLifecycleExecutor.java:715)
	at org.apache.maven.lifecycle.DefaultLifecycleExecutor.executeGoalWithLifecycle(DefaultLifecycleExecutor.java:556)
	at org.apache.maven.lifecycle.DefaultLifecycleExecutor.executeGoal(DefaultLifecycleExecutor.java:535)
	at org.apache.maven.lifecycle.DefaultLifecycleExecutor.executeGoalAndHandleFailures(DefaultLifecycleExecutor.java:387)
	at org.apache.maven.lifecycle.DefaultLifecycleExecutor.executeTaskSegments(DefaultLifecycleExecutor.java:348)
	at org.apache.maven.lifecycle.DefaultLifecycleExecutor.execute(DefaultLifecycleExecutor.java:180)
	at org.apache.maven.lifecycle.LifecycleExecutorInterceptor.execute(LifecycleExecutorInterceptor.java:65)
	at org.apache.maven.DefaultMaven.doExecute(DefaultMaven.java:328)
	at org.apache.maven.DefaultMaven.execute(DefaultMaven.java:138)
	at org.apache.maven.cli.MavenCli.main(MavenCli.java:362)
	at sun.reflect.NativeMethodAccessorImpl.invoke0(Native Method)
	at sun.reflect.NativeMethodAccessorImpl.invoke(NativeMethodAccessorImpl.java:39)
	at sun.reflect.DelegatingMethodAccessorImpl.invoke(DelegatingMethodAccessorImpl.java:25)
	at java.lang.reflect.Method.invoke(Method.java:597)
	at org.codehaus.classworlds.Launcher.launchEnhanced(Launcher.java:315)
	at org.codehaus.classworlds.Launcher.launch(Launcher.java:255)
	at hudson.maven.agent.Main.launch(Main.java:185)
	at hudson.maven.MavenBuilder.call(MavenBuilder.java:160)
	at hudson.maven.MavenModuleSetBuild$Builder.call(MavenModuleSetBuild.java:1059)
	at hudson.maven.MavenModuleSetBuild$Builder.call(MavenModuleSetBuild.java:990)
	at hudson.remoting.UserRequest.perform(UserRequest.java:118)
	at hudson.remoting.UserRequest.perform(UserRequest.java:48)
	at hudson.remoting.Request$2.run(Request.java:287)
	at java.util.concurrent.Executors$RunnableAdapter.call(Executors.java:441)
	at java.util.concurrent.FutureTask$Sync.innerRun(FutureTask.java:303)
	at java.util.concurrent.FutureTask.run(FutureTask.java:138)
	at java.util.concurrent.ThreadPoolExecutor$Worker.runTask(ThreadPoolExecutor.java:886)
	at java.util.concurrent.ThreadPoolExecutor$Worker.run(ThreadPoolExecutor.java:908)
	at java.lang.Thread.run(Thread.java:662)
Caused by: org.apache.maven.plugin.CompilationFailureException: Compilation failure
	at org.apache.maven.plugin.AbstractCompilerMojo.execute(AbstractCompilerMojo.java:516)
	at org.apache.maven.plugin.CompilerMojo.execute(CompilerMojo.java:114)
	at org.apache.maven.plugin.DefaultPluginManager.executeMojo(DefaultPluginManager.java:490)
	at hudson.maven.agent.PluginManagerInterceptor.executeMojo(PluginManagerInterceptor.java:182)
	at org.apache.maven.lifecycle.DefaultLifecycleExecutor.executeGoals(DefaultLifecycleExecutor.java:694)
	... 28 more
[INFO] ------------------------------------------------------------------------
[INFO] Total time: 2 minutes 59 seconds
[INFO] Finished at: Tue Nov 22 11:55:02 UTC 2011
[INFO] Final Memory: 153M/453M
[INFO] ------------------------------------------------------------------------


Mime
View raw message