aries-dev mailing list archives

Site index · List index
Message view « Date » · « Thread »
Top « Date » · « Thread »
From Apache Jenkins Server <jenk...@builds.apache.org>
Subject Build failed in Jenkins: Aries #1340
Date Fri, 27 Jan 2012 19:52:00 GMT
See <https://builds.apache.org/job/Aries/1340/changes>

Changes:

[ejiang] 

[ejiang] ARIES-817: Upgrade to ASM4

[ejiang] 

[ejiang] ARIES-817: Upgrade to ASM4

[ejiang] ARIES-817: Upgrade to ASM4

[ejiang] ARIES-817: Upgrade to ASM4

[ejiang] ARIES-817: Upgrade to ASM4

------------------------------------------
Started by an SCM change
Building remotely on ubuntu5
Updating http://svn.apache.org/repos/asf/aries/trunk
U         proxy/proxy-impl/src/test/java/org/apache/aries/blueprint/proxy/InterfaceProxyingTest.java
U         proxy/proxy-impl/src/main/java/org/apache/aries/proxy/impl/weaving/MethodCopyingClassAdapter.java
U         proxy/proxy-impl/src/main/java/org/apache/aries/proxy/impl/weaving/WovenProxyGenerator.java
U         proxy/proxy-impl/src/main/java/org/apache/aries/proxy/impl/weaving/SyntheticSerialVerUIDAdder.java
A         proxy/proxy-impl/src/main/java/org/apache/aries/proxy/impl/weaving/EmptyVisitor.java
U         proxy/proxy-impl/src/main/java/org/apache/aries/proxy/impl/interfaces/InterfaceProxyGenerator.java
U         proxy/proxy-impl/src/main/java/org/apache/aries/proxy/impl/interfaces/InterfaceCombiningClassAdapter.java
U         proxy/proxy-impl/src/main/java/org/apache/aries/proxy/impl/common/OSGiFriendlyClassWriter.java
A         proxy/proxy-impl/src/main/java/org/apache/aries/proxy/impl/common/OSGiFriendlyClassVisitor.java
U         proxy/proxy-impl/src/main/java/org/apache/aries/proxy/impl/common/AbstractWovenProxyAdapter.java
U         proxy/proxy-impl/src/main/java/org/apache/aries/proxy/impl/common/ConstructorFinder.java
U         proxy/proxy-impl/src/main/java/org/apache/aries/proxy/impl/gen/ProxySubclassHierarchyAdapter.java
U         proxy/proxy-impl/src/main/java/org/apache/aries/proxy/impl/gen/ProxySubclassAdapter.java
U         proxy/proxy-impl/src/main/java/org/apache/aries/proxy/impl/gen/Constants.java
U         proxy/proxy-impl/src/main/java/org/apache/aries/proxy/synthesizer/Synthesizer.java
U         proxy/proxy-impl/src/main/resources/org/apache/aries/proxy/nls/ProxyImplMessages.properties
U         proxy/proxy-impl/pom.xml
U         proxy/proxy-bundle/pom.xml
U         proxy/proxy-itests/src/test/java/org/apache/aries/proxy/itests/WeavingProxyTest.java
U         proxy/proxy-itests/src/test/java/org/apache/aries/proxy/itests/BasicProxyTest.java
U         proxy/proxy-itests/pom.xml
U         versioning/versioning-checker/src/main/java/org/apache/aries/versioning/utils/EmptyClassVisitor.java
U         versioning/versioning-checker/src/main/java/org/apache/aries/versioning/utils/SemanticVersioningUtils.java
U         versioning/versioning-checker/src/main/java/org/apache/aries/versioning/utils/SerialVersionClassVisitor.java
U         versioning/versioning-checker/src/main/java/org/apache/aries/versioning/utils/SemanticVersioningClassVisitor.java
U         versioning/versioning-checker/src/main/java/org/apache/aries/versioning/check/VersionChange.java
U         versioning/versioning-checker/pom.xml
U         versioning/org.apache.aries.versioning.plugin/src/main/java/org/apache/aries/versioning/mojo/VersionCheckerMojo.java
AU        versioning/org.apache.aries.versioning.plugin/src/main/java/org/apache/aries/versioning/mojo/CLVersionCheckerMojo.java
U         versioning/org.apache.aries.versioning.plugin/pom.xml
U         jndi/jndi-url-itest/src/test/java/org/apache/aries/jndi/itests/JndiUrlIntegrationTest.java
U         jndi/jndi-url-itest/pom.xml
U         transaction/transaction-blueprint/pom.xml
U         transaction/transaction-itests/src/test/java/org/apache/aries/transaction/itests/AbstractIntegrationTest.java
U         transaction/transaction-itests/pom.xml
U         sandbox/jmx-next/jmx-core/src/main/java/org/apache/aries/jmx/framework/wiring/BundleWiringState.java
U         sandbox/jmx-next/jmx-core/src/main/java/org/apache/aries/jmx/framework/Framework.java
U         sandbox/jmx-next/jmx-itests/src/test/java/org/apache/aries/jmx/framework/FrameworkMBeanTest.java
U         jmx/jmx-itests/src/test/java/org/apache/aries/jmx/test/blueprint/BlueprintMBeanTest.java
U         jmx/jmx-itests/pom.xml
U         ejb/openejb-extender-itest/src/test/java/org/apache/aries/ejb/openejb/extender/itest/AbstractOpenEJBTest.java
U         ejb/openejb-extender-itest/pom.xml
U         ejb/ejb-modeller-itest/src/test/java/org/apache/aries/ejb/container/itest/EJBModellingTest.java
U         ejb/ejb-modeller-itest/pom.xml
U         application/application-converters/pom.xml
U         application/application-resolve-transform-cm-itests/src/test/java/org/apache/aries/application/resolve/transform/cm/itest/ConfigurationPostResolverTest.java
U         application/application-resolve-transform-cm-itests/pom.xml
U         application/application-modeller/pom.xml
U         application/application-modeller-common-test/pom.xml
U         application/application-itests/src/test/java/org/apache/aries/application/runtime/itests/BasicNoOpResolverTest.java
U         application/application-itests/src/test/java/org/apache/aries/application/runtime/itests/IsolatedCfgAdminRuntimeTest.java
U         application/application-itests/src/test/java/org/apache/aries/application/runtime/itests/UpdateAppTest.java
U         application/application-itests/src/test/java/org/apache/aries/application/runtime/itests/OBRResolverTest.java
U         application/application-itests/src/test/java/org/apache/aries/application/runtime/itests/IsolatedRuntimeTest.java
U         application/application-itests/src/test/java/org/apache/aries/application/runtime/itests/MinimumImportsTest.java
U         application/application-itests/src/test/java/org/apache/aries/application/runtime/itests/OBRResolverAdvancedTest.java
U         application/application-itests/src/test/java/org/apache/aries/application/runtime/itests/BasicAppManagerTest.java
U         application/application-itests/src/test/java/org/apache/aries/application/runtime/itests/OBRAppManagerTest.java
U         application/application-itests/pom.xml
U         application/application-tooling-repository-generator/pom.xml
U         samples/twitter/twitter-itests/src/test/java/org/apache/aries/sample/twitter/itest/TwitterTest.java
U         samples/twitter/twitter-itests/pom.xml
U         samples/blog/blog-itests/src/test/java/org/apache/aries/samples/blog/itests/JpaBlogSampleWithEbaTest.java
U         samples/blog/blog-itests/src/test/java/org/apache/aries/samples/blog/itests/QuiesceBlogSampleWithEbaTest.java
U         samples/blog/blog-itests/src/test/java/org/apache/aries/samples/blog/itests/JdbcBlogSampleWithEbaTest.java
U         samples/blog/blog-itests/pom.xml
U         samples/blueprint/helloworld/helloworld-itests/src/test/java/org/apache/aries/samples/blueprint/helloworld/itests/HelloworldSampleTest.java
U         samples/blueprint/helloworld/helloworld-itests/pom.xml
U         blueprint/blueprint-core/pom.xml
U         blueprint/blueprint-bundle/pom.xml
U         blueprint/blueprint-itests/src/test/java/org/apache/aries/blueprint/itests/Helper.java
U         blueprint/blueprint-itests/pom.xml
U         jpa/jpa-container-itest/src/test/java/org/apache/aries/jpa/container/itest/JPAContainerDataSourceFactoryTest.java
U         jpa/jpa-container-itest/src/test/java/org/apache/aries/jpa/container/itest/JPAContainerTest.java
U         jpa/jpa-container-itest/src/test/java/org/apache/aries/jpa/blueprint/aries/itest/JPAInjectionTest.java
U         jpa/jpa-container-itest/src/test/java/org/apache/aries/jpa/context/itest/JPAContextTest.java
U         jpa/jpa-container-itest/src/test/java/org/apache/aries/jpa/context/itest/EclipseLinkStartupTest.java
U         jpa/jpa-container-itest/src/test/java/org/apache/aries/jpa/advanced/features/itest/JPAWeavingAndAnnotationScanningTest.java
U         jpa/jpa-container-itest/pom.xml
U         web/web-itests/src/test/java/org/apache/aries/web/converter/itest/WabConverterITest.java
U         web/web-itests/pom.xml
U         web/web-urlhandler/src/main/java/org/apache/aries/web/converter/impl/PackageFinder.java
U         web/web-urlhandler/pom.xml
At revision 1236861
Parsing POMs
ERROR: Failed to parse POMs
hudson.util.IOException2: remote file operation failed: <https://builds.apache.org/job/Aries/ws/aries>
at hudson.remoting.Channel@2460e570:ubuntu5
	at hudson.FilePath.act(FilePath.java:780)
	at hudson.FilePath.act(FilePath.java:766)
	at hudson.maven.MavenModuleSetBuild$RunnerImpl.parsePoms(MavenModuleSetBuild.java:913)
	at hudson.maven.MavenModuleSetBuild$RunnerImpl.doRun(MavenModuleSetBuild.java:658)
	at hudson.model.AbstractBuild$AbstractRunner.run(AbstractBuild.java:467)
	at hudson.model.Run.run(Run.java:1404)
	at hudson.maven.MavenModuleSetBuild.run(MavenModuleSetBuild.java:481)
	at hudson.model.ResourceController.execute(ResourceController.java:88)
	at hudson.model.Executor.run(Executor.java:238)
Caused by: hudson.remoting.ProxyException: hudson.maven.MavenModuleSetBuild$MavenExecutionException:
org.apache.maven.project.ProjectBuildingException: Some problems were encountered while processing
the POMs:
[FATAL] Non-resolvable parent POM: Could not find artifact org.apache.aries:java5-parent:pom:0.4-SNAPSHOT
and 'parent.relativePath' points at no local POM @ line 20, column 13

	at hudson.maven.MavenModuleSetBuild$PomParser.invoke(MavenModuleSetBuild.java:1271)
	at hudson.maven.MavenModuleSetBuild$PomParser.invoke(MavenModuleSetBuild.java:1048)
	at hudson.FilePath$FileCallableWrapper.call(FilePath.java:2045)
	at hudson.remoting.UserRequest.perform(UserRequest.java:118)
	at hudson.remoting.UserRequest.perform(UserRequest.java:48)
	at hudson.remoting.Request$2.run(Request.java:287)
	at java.util.concurrent.Executors$RunnableAdapter.call(Executors.java:471)
	at java.util.concurrent.FutureTask$Sync.innerRun(FutureTask.java:334)
	at java.util.concurrent.FutureTask.run(FutureTask.java:166)
	at java.util.concurrent.ThreadPoolExecutor.runWorker(ThreadPoolExecutor.java:1110)
	at java.util.concurrent.ThreadPoolExecutor$Worker.run(ThreadPoolExecutor.java:603)
	at java.lang.Thread.run(Thread.java:636)
Caused by: hudson.remoting.ProxyException: org.apache.maven.project.ProjectBuildingException:
Some problems were encountered while processing the POMs:
[FATAL] Non-resolvable parent POM: Could not find artifact org.apache.aries:java5-parent:pom:0.4-SNAPSHOT
and 'parent.relativePath' points at no local POM @ line 20, column 13

	at org.apache.maven.project.DefaultProjectBuilder.build(DefaultProjectBuilder.java:339)
	at hudson.maven.MavenEmbedder.buildProjects(MavenEmbedder.java:361)
	at hudson.maven.MavenEmbedder.readProjects(MavenEmbedder.java:331)
	at hudson.maven.MavenEmbedder.readProject(MavenEmbedder.java:322)
	at hudson.maven.MavenModuleSetBuild$PomParser.readChilds(MavenModuleSetBuild.java:1325)
	at hudson.maven.MavenModuleSetBuild$PomParser.readChilds(MavenModuleSetBuild.java:1328)
	at hudson.maven.MavenModuleSetBuild$PomParser.invoke(MavenModuleSetBuild.java:1232)
	... 11 more


Mime
View raw message