aries-dev mailing list archives

Site index · List index
Message view « Date » · « Thread »
Top « Date » · « Thread »
From Apache Jenkins Server <jenk...@builds.apache.org>
Subject Build failed in Jenkins: Aries #1414
Date Mon, 26 Mar 2012 17:55:10 GMT
See <https://builds.apache.org/job/Aries/1414/changes>

Changes:

[ejiang] ARIES-837: Modify default of Export-EJB: header to be ALL when empty string (Thanks
Duane for providing the patch)

------------------------------------------
[...truncated 8108 lines...]
	at java.util.regex.Matcher.getTextLength(Matcher.java:1140)
	at java.util.regex.Matcher.reset(Matcher.java:291)
	at java.util.regex.Matcher.<init>(Matcher.java:211)
	at java.util.regex.Pattern.matcher(Pattern.java:888)
	at aQute.libg.version.Version.<init>(Version.java:43)
	at aQute.lib.osgi.Macro.version(Macro.java:633)
	at aQute.lib.osgi.Macro._range(Macro.java:713)
	at sun.reflect.GeneratedMethodAccessor102.invoke(Unknown Source)
	at sun.reflect.DelegatingMethodAccessorImpl.invoke(DelegatingMethodAccessorImpl.java:25)
	at java.lang.reflect.Method.invoke(Method.java:597)
	at aQute.lib.osgi.Macro.doCommand(Macro.java:180)
	at aQute.lib.osgi.Macro.doCommands(Macro.java:169)
	at aQute.lib.osgi.Macro.replace(Macro.java:116)
	at aQute.lib.osgi.Macro.process(Macro.java:62)
	at aQute.lib.osgi.Macro.process(Macro.java:77)
	at aQute.lib.osgi.Macro.process(Macro.java:49)
	at aQute.lib.osgi.Macro.process(Macro.java:44)
	at aQute.lib.osgi.Processor.getProperty(Processor.java:622)
	at aQute.lib.osgi.Processor.getProperty(Processor.java:395)
	at aQute.lib.osgi.Analyzer.getImportPackages(Analyzer.java:258)
	at aQute.lib.osgi.Builder.getImportPackages(Builder.java:249)
	at aQute.lib.osgi.Analyzer.analyze(Analyzer.java:154)
	at aQute.lib.osgi.Builder.analyze(Builder.java:296)
	at aQute.lib.osgi.Analyzer.calcManifest(Analyzer.java:292)
	at aQute.lib.osgi.Builder.build(Builder.java:68)
	at org.apache.felix.bundleplugin.BundlePlugin.buildOSGiBundle(BundlePlugin.java:375)
	at org.apache.felix.bundleplugin.BundlePlugin.execute(BundlePlugin.java:270)
	at org.apache.felix.bundleplugin.BundlePlugin.execute(BundlePlugin.java:224)
	at org.apache.felix.bundleplugin.BundlePlugin.execute(BundlePlugin.java:215)
	at org.apache.maven.plugin.DefaultPluginManager.executeMojo(DefaultPluginManager.java:490)
	at hudson.maven.agent.PluginManagerInterceptor.executeMojo(PluginManagerInterceptor.java:182)
	at org.apache.maven.lifecycle.DefaultLifecycleExecutor.executeGoals(DefaultLifecycleExecutor.java:694)
	at org.apache.maven.lifecycle.DefaultLifecycleExecutor.executeGoalWithLifecycle(DefaultLifecycleExecutor.java:556)
	at org.apache.maven.lifecycle.DefaultLifecycleExecutor.executeGoal(DefaultLifecycleExecutor.java:535)
	at org.apache.maven.lifecycle.DefaultLifecycleExecutor.executeGoalAndHandleFailures(DefaultLifecycleExecutor.java:387)
	at org.apache.maven.lifecycle.DefaultLifecycleExecutor.executeTaskSegments(DefaultLifecycleExecutor.java:348)
	at org.apache.maven.lifecycle.DefaultLifecycleExecutor.execute(DefaultLifecycleExecutor.java:180)
	at org.apache.maven.lifecycle.LifecycleExecutorInterceptor.execute(LifecycleExecutorInterceptor.java:65)
	at org.apache.maven.DefaultMaven.doExecute(DefaultMaven.java:328)
	at org.apache.maven.DefaultMaven.execute(DefaultMaven.java:138)
	at org.apache.maven.cli.MavenCli.main(MavenCli.java:362)
	at sun.reflect.NativeMethodAccessorImpl.invoke0(Native Method)
	at sun.reflect.NativeMethodAccessorImpl.invoke(NativeMethodAccessorImpl.java:39)
	at sun.reflect.DelegatingMethodAccessorImpl.invoke(DelegatingMethodAccessorImpl.java:25)
	at java.lang.reflect.Method.invoke(Method.java:597)
	at org.codehaus.classworlds.Launcher.launchEnhanced(Launcher.java:315)
	at org.codehaus.classworlds.Launcher.launch(Launcher.java:255)
	at hudson.maven.agent.Main.launch(Main.java:185)
	at hudson.maven.MavenBuilder.call(MavenBuilder.java:151)
	at hudson.maven.Maven2Builder.call(Maven2Builder.java:77)
	at hudson.maven.Maven2Builder.call(Maven2Builder.java:53)
	at hudson.remoting.UserRequest.perform(UserRequest.java:118)
	at hudson.remoting.UserRequest.perform(UserRequest.java:48)
	at hudson.remoting.Request$2.run(Request.java:287)
	at hudson.remoting.InterceptingExecutorService$1.call(InterceptingExecutorService.java:72)
	at java.util.concurrent.FutureTask$Sync.innerRun(FutureTask.java:303)
	at java.util.concurrent.FutureTask.run(FutureTask.java:138)
	at java.util.concurrent.ThreadPoolExecutor$Worker.runTask(ThreadPoolExecutor.java:886)
	at java.util.concurrent.ThreadPoolExecutor$Worker.run(ThreadPoolExecutor.java:908)
	at java.lang.Thread.run(Thread.java:662)
java.lang.NullPointerException
	at java.util.regex.Matcher.getTextLength(Matcher.java:1140)
	at java.util.regex.Matcher.reset(Matcher.java:291)
	at java.util.regex.Matcher.<init>(Matcher.java:211)
	at java.util.regex.Pattern.matcher(Pattern.java:888)
	at aQute.libg.version.Version.<init>(Version.java:43)
	at aQute.lib.osgi.Macro.version(Macro.java:633)
	at aQute.lib.osgi.Macro._range(Macro.java:713)
	at sun.reflect.GeneratedMethodAccessor102.invoke(Unknown Source)
	at sun.reflect.DelegatingMethodAccessorImpl.invoke(DelegatingMethodAccessorImpl.java:25)
	at java.lang.reflect.Method.invoke(Method.java:597)
	at aQute.lib.osgi.Macro.doCommand(Macro.java:180)
	at aQute.lib.osgi.Macro.doCommands(Macro.java:169)
	at aQute.lib.osgi.Macro.replace(Macro.java:116)
	at aQute.lib.osgi.Macro.process(Macro.java:62)
	at aQute.lib.osgi.Macro.process(Macro.java:77)
	at aQute.lib.osgi.Macro.process(Macro.java:49)
	at aQute.lib.osgi.Macro.process(Macro.java:44)
	at aQute.lib.osgi.Processor.getProperty(Processor.java:622)
	at aQute.lib.osgi.Processor.getProperty(Processor.java:395)
	at aQute.lib.osgi.Analyzer.getImportPackages(Analyzer.java:258)
	at aQute.lib.osgi.Builder.getImportPackages(Builder.java:249)
	at aQute.lib.osgi.Analyzer.analyze(Analyzer.java:154)
	at aQute.lib.osgi.Builder.analyze(Builder.java:296)
	at aQute.lib.osgi.Analyzer.calcManifest(Analyzer.java:292)
	at aQute.lib.osgi.Builder.build(Builder.java:68)
	at org.apache.felix.bundleplugin.BundlePlugin.buildOSGiBundle(BundlePlugin.java:375)
	at org.apache.felix.bundleplugin.BundlePlugin.execute(BundlePlugin.java:270)
	at org.apache.felix.bundleplugin.BundlePlugin.execute(BundlePlugin.java:224)
	at org.apache.felix.bundleplugin.BundlePlugin.execute(BundlePlugin.java:215)
	at org.apache.maven.plugin.DefaultPluginManager.executeMojo(DefaultPluginManager.java:490)
	at hudson.maven.agent.PluginManagerInterceptor.executeMojo(PluginManagerInterceptor.java:182)
	at org.apache.maven.lifecycle.DefaultLifecycleExecutor.executeGoals(DefaultLifecycleExecutor.java:694)
	at org.apache.maven.lifecycle.DefaultLifecycleExecutor.executeGoalWithLifecycle(DefaultLifecycleExecutor.java:556)
	at org.apache.maven.lifecycle.DefaultLifecycleExecutor.executeGoal(DefaultLifecycleExecutor.java:535)
	at org.apache.maven.lifecycle.DefaultLifecycleExecutor.executeGoalAndHandleFailures(DefaultLifecycleExecutor.java:387)
	at org.apache.maven.lifecycle.DefaultLifecycleExecutor.executeTaskSegments(DefaultLifecycleExecutor.java:348)
	at org.apache.maven.lifecycle.DefaultLifecycleExecutor.execute(DefaultLifecycleExecutor.java:180)
	at org.apache.maven.lifecycle.LifecycleExecutorInterceptor.execute(LifecycleExecutorInterceptor.java:65)
	at org.apache.maven.DefaultMaven.doExecute(DefaultMaven.java:328)
	at org.apache.maven.DefaultMaven.execute(DefaultMaven.java:138)
	at org.apache.maven.cli.MavenCli.main(MavenCli.java:362)
	at sun.reflect.NativeMethodAccessorImpl.invoke0(Native Method)
	at sun.reflect.NativeMethodAccessorImpl.invoke(NativeMethodAccessorImpl.java:39)
	at sun.reflect.DelegatingMethodAccessorImpl.invoke(DelegatingMethodAccessorImpl.java:25)
	at java.lang.reflect.Method.invoke(Method.java:597)
	at org.codehaus.classworlds.Launcher.launchEnhanced(Launcher.java:315)
	at org.codehaus.classworlds.Launcher.launch(Launcher.java:255)
	at hudson.maven.agent.Main.launch(Main.java:185)
	at hudson.maven.MavenBuilder.call(MavenBuilder.java:151)
	at hudson.maven.Maven2Builder.call(Maven2Builder.java:77)
	at hudson.maven.Maven2Builder.call(Maven2Builder.java:53)
	at hudson.remoting.UserRequest.perform(UserRequest.java:118)
	at hudson.remoting.UserRequest.perform(UserRequest.java:48)
	at hudson.remoting.Request$2.run(Request.java:287)
	at hudson.remoting.InterceptingExecutorService$1.call(InterceptingExecutorService.java:72)
	at java.util.concurrent.FutureTask$Sync.innerRun(FutureTask.java:303)
	at java.util.concurrent.FutureTask.run(FutureTask.java:138)
	at java.util.concurrent.ThreadPoolExecutor$Worker.runTask(ThreadPoolExecutor.java:886)
	at java.util.concurrent.ThreadPoolExecutor$Worker.run(ThreadPoolExecutor.java:908)
	at java.lang.Thread.run(Thread.java:662)
java.lang.NullPointerException
	at java.util.regex.Matcher.getTextLength(Matcher.java:1140)
	at java.util.regex.Matcher.reset(Matcher.java:291)
	at java.util.regex.Matcher.<init>(Matcher.java:211)
	at java.util.regex.Pattern.matcher(Pattern.java:888)
	at aQute.libg.version.Version.<init>(Version.java:43)
	at aQute.lib.osgi.Macro.version(Macro.java:633)
	at aQute.lib.osgi.Macro._range(Macro.java:713)
	at sun.reflect.GeneratedMethodAccessor102.invoke(Unknown Source)
	at sun.reflect.DelegatingMethodAccessorImpl.invoke(DelegatingMethodAccessorImpl.java:25)
	at java.lang.reflect.Method.invoke(Method.java:597)
	at aQute.lib.osgi.Macro.doCommand(Macro.java:180)
	at aQute.lib.osgi.Macro.doCommands(Macro.java:169)
	at aQute.lib.osgi.Macro.replace(Macro.java:116)
	at aQute.lib.osgi.Macro.process(Macro.java:62)
	at aQute.lib.osgi.Macro.process(Macro.java:77)
	at aQute.lib.osgi.Macro.process(Macro.java:49)
	at aQute.lib.osgi.Macro.process(Macro.java:44)
	at aQute.lib.osgi.Processor.getProperty(Processor.java:622)
	at aQute.lib.osgi.Processor.getProperty(Processor.java:395)
	at aQute.lib.osgi.Analyzer.getImportPackages(Analyzer.java:258)
	at aQute.lib.osgi.Builder.getImportPackages(Builder.java:249)
	at aQute.lib.osgi.Analyzer.analyze(Analyzer.java:154)
	at aQute.lib.osgi.Builder.analyze(Builder.java:296)
	at aQute.lib.osgi.Analyzer.calcManifest(Analyzer.java:292)
	at aQute.lib.osgi.Builder.build(Builder.java:68)
	at org.apache.felix.bundleplugin.BundlePlugin.buildOSGiBundle(BundlePlugin.java:375)
	at org.apache.felix.bundleplugin.BundlePlugin.execute(BundlePlugin.java:270)
	at org.apache.felix.bundleplugin.BundlePlugin.execute(BundlePlugin.java:224)
	at org.apache.felix.bundleplugin.BundlePlugin.execute(BundlePlugin.java:215)
	at org.apache.maven.plugin.DefaultPluginManager.executeMojo(DefaultPluginManager.java:490)
	at hudson.maven.agent.PluginManagerInterceptor.executeMojo(PluginManagerInterceptor.java:182)
	at org.apache.maven.lifecycle.DefaultLifecycleExecutor.executeGoals(DefaultLifecycleExecutor.java:694)
	at org.apache.maven.lifecycle.DefaultLifecycleExecutor.executeGoalWithLifecycle(DefaultLifecycleExecutor.java:556)
	at org.apache.maven.lifecycle.DefaultLifecycleExecutor.executeGoal(DefaultLifecycleExecutor.java:535)
	at org.apache.maven.lifecycle.DefaultLifecycleExecutor.executeGoalAndHandleFailures(DefaultLifecycleExecutor.java:387)
	at org.apache.maven.lifecycle.DefaultLifecycleExecutor.executeTaskSegments(DefaultLifecycleExecutor.java:348)
	at org.apache.maven.lifecycle.DefaultLifecycleExecutor.execute(DefaultLifecycleExecutor.java:180)
	at org.apache.maven.lifecycle.LifecycleExecutorInterceptor.execute(LifecycleExecutorInterceptor.java:65)
	at org.apache.maven.DefaultMaven.doExecute(DefaultMaven.java:328)
	at org.apache.maven.DefaultMaven.execute(DefaultMaven.java:138)
	at org.apache.maven.cli.MavenCli.main(MavenCli.java:362)
	at sun.reflect.NativeMethodAccessorImpl.invoke0(Native Method)
	at sun.reflect.NativeMethodAccessorImpl.invoke(NativeMethodAccessorImpl.java:39)
	at sun.reflect.DelegatingMethodAccessorImpl.invoke(DelegatingMethodAccessorImpl.java:25)
	at java.lang.reflect.Method.invoke(Method.java:597)
	at org.codehaus.classworlds.Launcher.launchEnhanced(Launcher.java:315)
	at org.codehaus.classworlds.Launcher.launch(Launcher.java:255)
	at hudson.maven.agent.Main.launch(Main.java:185)
	at hudson.maven.MavenBuilder.call(MavenBuilder.java:151)
	at hudson.maven.Maven2Builder.call(Maven2Builder.java:77)
	at hudson.maven.Maven2Builder.call(Maven2Builder.java:53)
	at hudson.remoting.UserRequest.perform(UserRequest.java:118)
	at hudson.remoting.UserRequest.perform(UserRequest.java:48)
	at hudson.remoting.Request$2.run(Request.java:287)
	at hudson.remoting.InterceptingExecutorService$1.call(InterceptingExecutorService.java:72)
	at java.util.concurrent.FutureTask$Sync.innerRun(FutureTask.java:303)
	at java.util.concurrent.FutureTask.run(FutureTask.java:138)
	at java.util.concurrent.ThreadPoolExecutor$Worker.runTask(ThreadPoolExecutor.java:886)
	at java.util.concurrent.ThreadPoolExecutor$Worker.run(ThreadPoolExecutor.java:908)
	at java.lang.Thread.run(Thread.java:662)
[WARNING] Warning building bundle org.apache.aries.blueprint:org.apache.aries.blueprint.core:bundle:0.4.1-SNAPSHOT
: Exception in replace: java.lang.NullPointerException
[WARNING] Warning building bundle org.apache.aries.blueprint:org.apache.aries.blueprint.core:bundle:0.4.1-SNAPSHOT
: No translation found for macro: range;[==,=+)
[WARNING] Warning building bundle org.apache.aries.blueprint:org.apache.aries.blueprint.core:bundle:0.4.1-SNAPSHOT
: Did not find matching referal for !org.osgi.service.blueprint
[INFO] [ianal:verify-legal-files {execution: default}]
[INFO] Checking legal files in: org.apache.aries.blueprint.core-0.4.1-SNAPSHOT.jar
[INFO] [install:install {execution: default-install}]
[INFO] Installing <https://builds.apache.org/job/Aries/ws/aries/blueprint/blueprint-core/target/org.apache.aries.blueprint.core-0.4.1-SNAPSHOT.jar>
to /home/jenkins/jenkins-slave/maven-repositories/1/org/apache/aries/blueprint/org.apache.aries.blueprint.core/0.4.1-SNAPSHOT/org.apache.aries.blueprint.core-0.4.1-SNAPSHOT.jar
[INFO] [bundle:install {execution: default-install}]
[INFO] Installing org/apache/aries/blueprint/org.apache.aries.blueprint.core/0.4.1-SNAPSHOT/org.apache.aries.blueprint.core-0.4.1-SNAPSHOT.jar
[INFO] Writing OBR metadata
[JENKINS] Archiving <https://builds.apache.org/job/Aries/ws/aries/blueprint/blueprint-core/pom.xml>
to /home/hudson/hudson/jobs/Aries/modules/org.apache.aries.blueprint$org.apache.aries.blueprint.core/builds/2012-03-26_16-56-22/archive/org.apache.aries.blueprint/org.apache.aries.blueprint.core/0.4.1-SNAPSHOT/org.apache.aries.blueprint.core-0.4.1-SNAPSHOT.pom
[JENKINS] Archiving <https://builds.apache.org/job/Aries/ws/aries/blueprint/blueprint-core/target/org.apache.aries.blueprint.core-0.4.1-SNAPSHOT.jar>
to /home/hudson/hudson/jobs/Aries/modules/org.apache.aries.blueprint$org.apache.aries.blueprint.core/builds/2012-03-26_16-56-22/archive/org.apache.aries.blueprint/org.apache.aries.blueprint.core/0.4.1-SNAPSHOT/org.apache.aries.blueprint.core-0.4.1-SNAPSHOT.jar
Build timed out (after 60 minutes). Marking the build as failed.
[INFO] ------------------------------------------------------------------------
[ERROR] FATAL ERROR
[INFO] ------------------------------------------------------------------------
channel stopped
[INFO] hudson.remoting.RequestAbortedException: hudson.remoting.Channel$OrderlyShutdown
[INFO] ------------------------------------------------------------------------
[INFO] Trace
hudson.remoting.RequestAbortedException: hudson.remoting.RequestAbortedException: hudson.remoting.Channel$OrderlyShutdown
	at hudson.remoting.Request.call(Request.java:149)
	at hudson.remoting.Channel.call(Channel.java:681)
	at hudson.remoting.RemoteInvocationHandler.invoke(RemoteInvocationHandler.java:158)
	at $Proxy2.isArchivingDisabled(Unknown Source)
	at hudson.maven.MavenBuildProxy$Filter.isArchivingDisabled(MavenBuildProxy.java:227)
	at hudson.maven.reporters.MavenArtifact.archive(MavenArtifact.java:223)
	at hudson.maven.reporters.MavenArtifactArchiver.postBuild(MavenArtifactArchiver.java:106)
	at hudson.maven.Maven2Builder.postModule(Maven2Builder.java:127)
	at hudson.maven.MavenBuilder$Adapter.fireLeaveModule(MavenBuilder.java:327)
	at hudson.maven.MavenBuilder$Adapter.postBuild(MavenBuilder.java:285)
	at org.apache.maven.lifecycle.LifecycleExecutorInterceptor.execute(LifecycleExecutorInterceptor.java:68)
	at org.apache.maven.DefaultMaven.doExecute(DefaultMaven.java:328)
	at org.apache.maven.DefaultMaven.execute(DefaultMaven.java:138)
	at org.apache.maven.cli.MavenCli.main(MavenCli.java:362)
	at sun.reflect.NativeMethodAccessorImpl.invoke0(Native Method)
	at sun.reflect.NativeMethodAccessorImpl.invoke(NativeMethodAccessorImpl.java:39)
	at sun.reflect.DelegatingMethodAccessorImpl.invoke(DelegatingMethodAccessorImpl.java:25)
	at java.lang.reflect.Method.invoke(Method.java:597)
	at org.codehaus.classworlds.Launcher.launchEnhanced(Launcher.java:315)
	at org.codehaus.classworlds.Launcher.launch(Launcher.java:255)
	at hudson.maven.agent.Main.launch(Main.java:185)
	at hudson.maven.MavenBuilder.call(MavenBuilder.java:151)
	at hudson.maven.Maven2Builder.call(Maven2Builder.java:77)
	at hudson.maven.Maven2Builder.call(Maven2Builder.java:53)
	at hudson.remoting.UserRequest.perform(UserRequest.java:118)
	at hudson.remoting.UserRequest.perform(UserRequest.java:48)
	at hudson.remoting.Request$2.run(Request.java:287)
	at hudson.remoting.InterceptingExecutorService$1.call(InterceptingExecutorService.java:72)
	at java.util.concurrent.FutureTask$Sync.innerRun(FutureTask.java:303)
	at java.util.concurrent.FutureTask.run(FutureTask.java:138)
	at java.util.concurrent.ThreadPoolExecutor$Worker.runTask(ThreadPoolExecutor.java:886)
	at java.util.concurrent.ThreadPoolExecutor$Worker.run(ThreadPoolExecutor.java:908)
	at java.lang.Thread.run(Thread.java:662)
Caused by: hudson.remoting.RequestAbortedException: hudson.remoting.Channel$OrderlyShutdown
	at hudson.remoting.Request.abort(Request.java:273)
	at hudson.remoting.Channel.terminate(Channel.java:732)
	at hudson.remoting.Channel$CloseCommand.execute(Channel.java:848)
	at hudson.remoting.Channel$ReaderThread.run(Channel.java:1146)
Caused by: hudson.remoting.Channel$OrderlyShutdown
	... 2 more
Caused by: Command close created at
	at hudson.remoting.Command.<init>(Command.java:51)
	at hudson.remoting.Channel$CloseCommand.<init>(Channel.java:842)
	at hudson.remoting.Channel$CloseCommand.<init>(Channel.java:840)
	at hudson.remoting.Channel.close(Channel.java:907)
	at hudson.remoting.Channel.close(Channel.java:890)

Mime
View raw message