aries-dev mailing list archives

Site index · List index
Message view « Date » · « Thread »
Top « Date » · « Thread »
From Apache Jenkins Server <jenk...@builds.apache.org>
Subject Build failed in Jenkins: AriesWithSnapshotDependencies #215
Date Wed, 29 Aug 2012 13:06:30 GMT
See <https://builds.apache.org/job/AriesWithSnapshotDependencies/215/changes>

Changes:

[davidb] Add the jar-with-dependencies of the static tool to the default build.

------------------------------------------
[...truncated 15445 lines...]
[INFO] META-INF/maven/ already added, skipping
[INFO] META-INF/maven/org.apache.openwebbeans/ already added, skipping
[INFO] META-INF/ already added, skipping
[INFO] META-INF/MANIFEST.MF already added, skipping
[INFO] org/ already added, skipping
[INFO] org/apache/ already added, skipping
[INFO] org/apache/webbeans/ already added, skipping
[INFO] META-INF/DEPENDENCIES already added, skipping
[INFO] META-INF/LICENSE already added, skipping
[INFO] META-INF/NOTICE already added, skipping
[INFO] META-INF/maven/ already added, skipping
[INFO] META-INF/maven/org.apache.openwebbeans/ already added, skipping
[INFO] META-INF/ already added, skipping
[INFO] META-INF/MANIFEST.MF already added, skipping
[INFO] META-INF/openwebbeans/ already added, skipping
[INFO] org/ already added, skipping
[INFO] org/apache/ already added, skipping
[INFO] org/apache/webbeans/ already added, skipping
[INFO] org/apache/webbeans/ee/ already added, skipping
[INFO] META-INF/DEPENDENCIES already added, skipping
[INFO] META-INF/LICENSE already added, skipping
[INFO] META-INF/NOTICE already added, skipping
[INFO] META-INF/openwebbeans/openwebbeans.properties already added, skipping
[INFO] META-INF/maven/ already added, skipping
[INFO] META-INF/maven/org.apache.openwebbeans/ already added, skipping
[INFO] META-INF/ already added, skipping
[INFO] META-INF/MANIFEST.MF already added, skipping
[INFO] META-INF/openwebbeans/ already added, skipping
[INFO] org/ already added, skipping
[INFO] org/apache/ already added, skipping
[INFO] org/apache/webbeans/ already added, skipping
[INFO] META-INF/DEPENDENCIES already added, skipping
[INFO] META-INF/LICENSE already added, skipping
[INFO] META-INF/NOTICE already added, skipping
[INFO] META-INF/openwebbeans/openwebbeans.properties already added, skipping
[INFO] META-INF/maven/ already added, skipping
[INFO] META-INF/maven/org.apache.openwebbeans/ already added, skipping
[INFO] META-INF/ already added, skipping
[INFO] META-INF/MANIFEST.MF already added, skipping
[INFO] META-INF/DEPENDENCIES already added, skipping
[INFO] META-INF/LICENSE already added, skipping
[INFO] META-INF/NOTICE already added, skipping
[INFO] META-INF/maven/ already added, skipping
[INFO] META-INF/services/ already added, skipping
[INFO] org/ already added, skipping
[INFO] org/apache/ already added, skipping
[INFO] META-INF/ already added, skipping
[INFO] META-INF/MANIFEST.MF already added, skipping
[INFO] org/ already added, skipping
[INFO] org/apache/ already added, skipping
[INFO] org/apache/commons/ already added, skipping
[INFO] META-INF/LICENSE.txt already added, skipping
[INFO] META-INF/NOTICE.txt already added, skipping
[INFO] META-INF/maven/ already added, skipping
[INFO] META-INF/ already added, skipping
[INFO] META-INF/MANIFEST.MF already added, skipping
[INFO] META-INF/maven/ already added, skipping
[INFO] META-INF/ already added, skipping
[INFO] META-INF/MANIFEST.MF already added, skipping
[INFO] org/ already added, skipping
[INFO] META-INF/ already added, skipping
[INFO] META-INF/MANIFEST.MF already added, skipping
[INFO] org/ already added, skipping
[INFO] org/apache/ already added, skipping
[INFO] META-INF/DEPENDENCIES already added, skipping
[INFO] META-INF/LICENSE already added, skipping
[INFO] META-INF/NOTICE already added, skipping
[INFO] META-INF/maven/ already added, skipping
[INFO] META-INF/ already added, skipping
[INFO] META-INF/MANIFEST.MF already added, skipping
[INFO] META-INF/LICENSE.txt already added, skipping
[INFO] META-INF/NOTICE.txt already added, skipping
[INFO] org/ already added, skipping
[INFO] org/apache/ already added, skipping
[INFO] org/apache/commons/ already added, skipping
[INFO] org/apache/commons/collections/ already added, skipping
[INFO] org/apache/commons/collections/ArrayStack.class already added, skipping
[INFO] org/apache/commons/collections/Buffer.class already added, skipping
[INFO] org/apache/commons/collections/BufferUnderflowException.class already added, skipping
[INFO] org/apache/commons/collections/FastHashMap$1.class already added, skipping
[INFO] org/apache/commons/collections/FastHashMap$CollectionView$CollectionViewIterator.class
already added, skipping
[INFO] org/apache/commons/collections/FastHashMap$CollectionView.class already added, skipping
[INFO] org/apache/commons/collections/FastHashMap$EntrySet.class already added, skipping
[INFO] org/apache/commons/collections/FastHashMap$KeySet.class already added, skipping
[INFO] org/apache/commons/collections/FastHashMap$Values.class already added, skipping
[INFO] org/apache/commons/collections/FastHashMap.class already added, skipping
[INFO] META-INF/ already added, skipping
[INFO] META-INF/MANIFEST.MF already added, skipping
[INFO] META-INF/services/ already added, skipping
[INFO] META-INF/maven/ already added, skipping
[INFO] META-INF/maven/org.apache.bval/ already added, skipping
[INFO] org/ already added, skipping
[INFO] org/apache/ already added, skipping
[INFO] org/apache/bval/ already added, skipping
[INFO] META-INF/NOTICE already added, skipping
[INFO] META-INF/DEPENDENCIES already added, skipping
[INFO] META-INF/DISCLAIMER already added, skipping
[INFO] META-INF/LICENSE already added, skipping
[INFO] [ianal:verify-legal-files {execution: default}]
[INFO] Checking legal files in: application-modeller-standalone-1.0.1-SNAPSHOT.jar
[INFO] Checking legal files in: application-modeller-standalone-1.0.1-SNAPSHOT-jar-with-dependencies.jar
[INFO] [install:install {execution: default-install}]
[INFO] Installing /x1/jenkins/jenkins-slave/workspace/AriesWithSnapshotDependencies/aries-current-snapshots/application/application-modeller-standalone/target/application-modeller-standalone-1.0.1-SNAPSHOT.jar
to <https://builds.apache.org/job/AriesWithSnapshotDependencies/ws/.repository/org/apache/aries/application/application-modeller-standalone/1.0.1-SNAPSHOT/application-modeller-standalone-1.0.1-SNAPSHOT.jar>
[INFO] Installing /x1/jenkins/jenkins-slave/workspace/AriesWithSnapshotDependencies/aries-current-snapshots/application/application-modeller-standalone/target/application-modeller-standalone-1.0.1-SNAPSHOT-jar-with-dependencies.jar
to <https://builds.apache.org/job/AriesWithSnapshotDependencies/ws/.repository/org/apache/aries/application/application-modeller-standalone/1.0.1-SNAPSHOT/application-modeller-standalone-1.0.1-SNAPSHOT-jar-with-dependencies.jar>
[INFO] ------------------------------------------------------------------------
[INFO] Building Apache Aries Application Modelling tests
[INFO]    task-segment: [clean, install]
[INFO] ------------------------------------------------------------------------
[INFO] [clean:clean {execution: default-clean}]
[INFO] snapshot org.apache.aries.application:application-modeller-standalone:1.0.0-SNAPSHOT:
checking for updates from codehaus.snapshots
[INFO] snapshot org.apache.aries.application:application-modeller-standalone:1.0.0-SNAPSHOT:
checking for updates from EclipseLink Repo
[INFO] snapshot org.apache.aries.application:application-modeller-standalone:1.0.0-SNAPSHOT:
checking for updates from apache.snapshots
Downloading: http://snapshots.repository.codehaus.org/org/apache/aries/application/application-modeller-standalone/1.0.0-SNAPSHOT/application-modeller-standalone-1.0.0-SNAPSHOT.pom
[INFO] Unable to find resource 'org.apache.aries.application:application-modeller-standalone:pom:1.0.0-SNAPSHOT'
in repository codehaus.snapshots (http://snapshots.repository.codehaus.org)
Downloading: http://download.eclipse.org/rt/eclipselink/maven.repo//org/apache/aries/application/application-modeller-standalone/1.0.0-SNAPSHOT/application-modeller-standalone-1.0.0-SNAPSHOT.pom
[INFO] Unable to find resource 'org.apache.aries.application:application-modeller-standalone:pom:1.0.0-SNAPSHOT'
in repository EclipseLink Repo (http://download.eclipse.org/rt/eclipselink/maven.repo/)
Downloading: http://repository.apache.org/snapshots/org/apache/aries/application/application-modeller-standalone/1.0.0-SNAPSHOT/application-modeller-standalone-1.0.0-SNAPSHOT.pom
[INFO] Unable to find resource 'org.apache.aries.application:application-modeller-standalone:pom:1.0.0-SNAPSHOT'
in repository apache.snapshots (http://repository.apache.org/snapshots)
Downloading: http://snapshots.repository.codehaus.org/org/apache/aries/application/application-modeller-standalone/1.0.0-SNAPSHOT/application-modeller-standalone-1.0.0-SNAPSHOT.jar
[INFO] Unable to find resource 'org.apache.aries.application:application-modeller-standalone:jar:1.0.0-SNAPSHOT'
in repository codehaus.snapshots (http://snapshots.repository.codehaus.org)
Downloading: http://download.eclipse.org/rt/eclipselink/maven.repo//org/apache/aries/application/application-modeller-standalone/1.0.0-SNAPSHOT/application-modeller-standalone-1.0.0-SNAPSHOT.jar
[INFO] Unable to find resource 'org.apache.aries.application:application-modeller-standalone:jar:1.0.0-SNAPSHOT'
in repository EclipseLink Repo (http://download.eclipse.org/rt/eclipselink/maven.repo/)
Downloading: http://repository.apache.org/snapshots/org/apache/aries/application/application-modeller-standalone/1.0.0-SNAPSHOT/application-modeller-standalone-1.0.0-SNAPSHOT.jar
[INFO] Unable to find resource 'org.apache.aries.application:application-modeller-standalone:jar:1.0.0-SNAPSHOT'
in repository apache.snapshots (http://repository.apache.org/snapshots)
[INFO] ------------------------------------------------------------------------
[ERROR] BUILD ERROR
[INFO] ------------------------------------------------------------------------
[INFO] Failed to resolve artifact.

Missing:
----------
1) org.apache.aries.application:application-modeller-standalone:jar:1.0.0-SNAPSHOT

  Try downloading the file manually from the project website.

  Then, install it using the command: 
      mvn install:install-file -DgroupId=org.apache.aries.application -DartifactId=application-modeller-standalone
-Dversion=1.0.0-SNAPSHOT -Dpackaging=jar -Dfile=/path/to/file

  Alternatively, if you host your own repository you can deploy the file there: 
      mvn deploy:deploy-file -DgroupId=org.apache.aries.application -DartifactId=application-modeller-standalone
-Dversion=1.0.0-SNAPSHOT -Dpackaging=jar -Dfile=/path/to/file -Durl=[url] -DrepositoryId=[id]

  Path to dependency: 
  	1) org.apache.aries.application:application-modeller-common-test:jar:1.0.0-SNAPSHOT
  	2) org.apache.aries.application:application-modeller-standalone:jar:1.0.0-SNAPSHOT

----------
1 required artifact is missing.

for artifact: 
  org.apache.aries.application:application-modeller-common-test:jar:1.0.0-SNAPSHOT

from the specified remote repositories:
  codehaus.snapshots (http://snapshots.repository.codehaus.org),
  central (http://repo1.maven.org/maven2),
  Nexus (http://repository.apache.org/snapshots),
  EclipseLink Repo (http://download.eclipse.org/rt/eclipselink/maven.repo/)



[INFO] ------------------------------------------------------------------------
[INFO] Trace
org.apache.maven.lifecycle.LifecycleExecutionException: Missing:
----------
1) org.apache.aries.application:application-modeller-standalone:jar:1.0.0-SNAPSHOT

  Try downloading the file manually from the project website.

  Then, install it using the command: 
      mvn install:install-file -DgroupId=org.apache.aries.application -DartifactId=application-modeller-standalone
-Dversion=1.0.0-SNAPSHOT -Dpackaging=jar -Dfile=/path/to/file

  Alternatively, if you host your own repository you can deploy the file there: 
      mvn deploy:deploy-file -DgroupId=org.apache.aries.application -DartifactId=application-modeller-standalone
-Dversion=1.0.0-SNAPSHOT -Dpackaging=jar -Dfile=/path/to/file -Durl=[url] -DrepositoryId=[id]

  Path to dependency: 
  	1) org.apache.aries.application:application-modeller-common-test:jar:1.0.0-SNAPSHOT
  	2) org.apache.aries.application:application-modeller-standalone:jar:1.0.0-SNAPSHOT

----------
1 required artifact is missing.

for artifact: 
  org.apache.aries.application:application-modeller-common-test:jar:1.0.0-SNAPSHOT

from the specified remote repositories:
  codehaus.snapshots (http://snapshots.repository.codehaus.org),
  central (http://repo1.maven.org/maven2),
  Nexus (http://repository.apache.org/snapshots),
  EclipseLink Repo (http://download.eclipse.org/rt/eclipselink/maven.repo/)


	at org.apache.maven.lifecycle.DefaultLifecycleExecutor.executeGoals(DefaultLifecycleExecutor.java:711)
	at org.apache.maven.lifecycle.DefaultLifecycleExecutor.executeGoalWithLifecycle(DefaultLifecycleExecutor.java:556)
	at org.apache.maven.lifecycle.DefaultLifecycleExecutor.executeGoal(DefaultLifecycleExecutor.java:535)
	at org.apache.maven.lifecycle.DefaultLifecycleExecutor.executeGoalAndHandleFailures(DefaultLifecycleExecutor.java:387)
	at org.apache.maven.lifecycle.DefaultLifecycleExecutor.executeTaskSegments(DefaultLifecycleExecutor.java:348)
	at org.apache.maven.lifecycle.DefaultLifecycleExecutor.execute(DefaultLifecycleExecutor.java:180)
	at org.apache.maven.DefaultMaven.doExecute(DefaultMaven.java:328)
	at org.apache.maven.DefaultMaven.execute(DefaultMaven.java:138)
	at org.apache.maven.cli.MavenCli.main(MavenCli.java:362)
	at org.apache.maven.cli.compat.CompatibleMain.main(CompatibleMain.java:60)
	at sun.reflect.NativeMethodAccessorImpl.invoke0(Native Method)
	at sun.reflect.NativeMethodAccessorImpl.invoke(NativeMethodAccessorImpl.java:39)
	at sun.reflect.DelegatingMethodAccessorImpl.invoke(DelegatingMethodAccessorImpl.java:25)
	at java.lang.reflect.Method.invoke(Method.java:597)
	at org.codehaus.classworlds.Launcher.launchEnhanced(Launcher.java:315)
	at org.codehaus.classworlds.Launcher.launch(Launcher.java:255)
	at org.codehaus.classworlds.Launcher.mainWithExitCode(Launcher.java:430)
	at org.codehaus.classworlds.Launcher.main(Launcher.java:375)
Caused by: org.apache.maven.artifact.resolver.MultipleArtifactsNotFoundException: Missing:
----------
1) org.apache.aries.application:application-modeller-standalone:jar:1.0.0-SNAPSHOT

  Try downloading the file manually from the project website.

  Then, install it using the command: 
      mvn install:install-file -DgroupId=org.apache.aries.application -DartifactId=application-modeller-standalone
-Dversion=1.0.0-SNAPSHOT -Dpackaging=jar -Dfile=/path/to/file

  Alternatively, if you host your own repository you can deploy the file there: 
      mvn deploy:deploy-file -DgroupId=org.apache.aries.application -DartifactId=application-modeller-standalone
-Dversion=1.0.0-SNAPSHOT -Dpackaging=jar -Dfile=/path/to/file -Durl=[url] -DrepositoryId=[id]

  Path to dependency: 
  	1) org.apache.aries.application:application-modeller-common-test:jar:1.0.0-SNAPSHOT
  	2) org.apache.aries.application:application-modeller-standalone:jar:1.0.0-SNAPSHOT

----------
1 required artifact is missing.

for artifact: 
  org.apache.aries.application:application-modeller-common-test:jar:1.0.0-SNAPSHOT

from the specified remote repositories:
  codehaus.snapshots (http://snapshots.repository.codehaus.org),
  central (http://repo1.maven.org/maven2),
  Nexus (http://repository.apache.org/snapshots),
  EclipseLink Repo (http://download.eclipse.org/rt/eclipselink/maven.repo/)


	at org.apache.maven.artifact.resolver.DefaultArtifactResolver.resolveTransitively(DefaultArtifactResolver.java:360)
	at org.apache.maven.artifact.resolver.DefaultArtifactResolver.resolveTransitively(DefaultArtifactResolver.java:304)
	at org.apache.maven.plugin.DefaultPluginManager.resolveTransitiveDependencies(DefaultPluginManager.java:1499)
	at org.apache.maven.plugin.DefaultPluginManager.executeMojo(DefaultPluginManager.java:442)
	at org.apache.maven.lifecycle.DefaultLifecycleExecutor.executeGoals(DefaultLifecycleExecutor.java:694)
	... 17 more
[INFO] ------------------------------------------------------------------------
[INFO] Total time: 7 minutes 6 seconds
[INFO] Finished at: Wed Aug 29 13:06:29 UTC 2012
[INFO] Final Memory: 307M/703M
[INFO] ------------------------------------------------------------------------
Build step 'Invoke top-level Maven targets' marked build as failure

Mime
View raw message