aries-dev mailing list archives

Site index · List index
Message view « Date » · « Thread »
Top « Date » · « Thread »
From Apache Jenkins Server <jenk...@builds.apache.org>
Subject Build failed in Jenkins: Aries #1634
Date Tue, 14 Aug 2012 19:37:22 GMT
See <https://builds.apache.org/job/Aries/1634/changes>

Changes:

[cumminsh] [ARIES-862] Moving to released version of proxy bundle

------------------------------------------
[...truncated 1688 lines...]
[INFO] ------------------------------------------------------------------------
[INFO] [clean:clean {execution: default-clean}]
[INFO] [enforcer:enforce {execution: default}]
[INFO] [remote-resources:process {execution: default}]
[INFO] [resources:resources {execution: default-resources}]
[INFO] Using 'UTF-8' encoding to copy filtered resources.
[INFO] Copying 12 resources
[INFO] skip non existing resourceDirectory <https://builds.apache.org/job/Aries/ws/aries/blueprint/blueprint-testbundlea/src/main/filtered-resources>
[INFO] Copying 0 resource
[INFO] Copying 3 resources
[INFO] [compiler:compile {execution: default-compile}]
[INFO] Compiling 13 source files to <https://builds.apache.org/job/Aries/ws/aries/blueprint/blueprint-testbundlea/target/classes>
[INFO] [resources:testResources {execution: default-testResources}]
[INFO] Using 'UTF-8' encoding to copy filtered resources.
[INFO] skip non existing resourceDirectory <https://builds.apache.org/job/Aries/ws/aries/blueprint/blueprint-testbundlea/src/test/resources>
[INFO] skip non existing resourceDirectory <https://builds.apache.org/job/Aries/ws/aries/blueprint/blueprint-testbundlea/src/test/filtered-resources>
[INFO] Copying 3 resources
[INFO] [compiler:testCompile {execution: default-testCompile}]
[INFO] No sources to compile
[INFO] [surefire:test {execution: default-test}]
[INFO] Surefire report directory: <https://builds.apache.org/job/Aries/ws/aries/blueprint/blueprint-testbundlea/target/surefire-reports>

-------------------------------------------------------
 T E S T S
-------------------------------------------------------
There are no tests to run.

Results :

Tests run: 0, Failures: 0, Errors: 0, Skipped: 0

[JENKINS] Recording test results[INFO] [enforcer:enforce {execution: check-java15}]
[INFO] Checking unresolved references to org.codehaus.mojo.signature:java15:1.0

[INFO] [bundle:bundle {execution: default-bundle}]
[INFO] [ianal:verify-legal-files {execution: default}]
[INFO] Checking legal files in: org.apache.aries.blueprint.testbundlea-1.0.1-SNAPSHOT.jar
[INFO] [install:install {execution: default-install}]
[INFO] Installing <https://builds.apache.org/job/Aries/ws/aries/blueprint/blueprint-testbundlea/target/org.apache.aries.blueprint.testbundlea-1.0.1-SNAPSHOT.jar>
to /home/jenkins/jenkins-slave/maven-repositories/1/org/apache/aries/blueprint/org.apache.aries.blueprint.testbundlea/1.0.1-SNAPSHOT/org.apache.aries.blueprint.testbundlea-1.0.1-SNAPSHOT.jar
[INFO] [bundle:install {execution: default-install}]
[INFO] Installing org/apache/aries/blueprint/org.apache.aries.blueprint.testbundlea/1.0.1-SNAPSHOT/org.apache.aries.blueprint.testbundlea-1.0.1-SNAPSHOT.jar
[INFO] Writing OBR metadata
[JENKINS] Archiving <https://builds.apache.org/job/Aries/ws/aries/blueprint/blueprint-testbundlea/pom.xml>
to /home/hudson/hudson/jobs/Aries/modules/org.apache.aries.blueprint$org.apache.aries.blueprint.testbundlea/builds/2012-08-14_19-31-33/archive/org.apache.aries.blueprint/org.apache.aries.blueprint.testbundlea/1.0.1-SNAPSHOT/org.apache.aries.blueprint.testbundlea-1.0.1-SNAPSHOT.pom
[JENKINS] Archiving <https://builds.apache.org/job/Aries/ws/aries/blueprint/blueprint-testbundlea/target/org.apache.aries.blueprint.testbundlea-1.0.1-SNAPSHOT.jar>
to /home/hudson/hudson/jobs/Aries/modules/org.apache.aries.blueprint$org.apache.aries.blueprint.testbundlea/builds/2012-08-14_19-31-33/archive/org.apache.aries.blueprint/org.apache.aries.blueprint.testbundlea/1.0.1-SNAPSHOT/org.apache.aries.blueprint.testbundlea-1.0.1-SNAPSHOT.jar
[INFO] ------------------------------------------------------------------------
[INFO] Building Apache Aries Blueprint Test Bundle B
[INFO]    task-segment: [clean, install]
[INFO] ------------------------------------------------------------------------
[INFO] [clean:clean {execution: default-clean}]
[INFO] [enforcer:enforce {execution: default}]
[INFO] [remote-resources:process {execution: default}]
[INFO] [resources:resources {execution: default-resources}]
[INFO] Using 'UTF-8' encoding to copy filtered resources.
[INFO] Copying 3 resources
[INFO] skip non existing resourceDirectory <https://builds.apache.org/job/Aries/ws/aries/blueprint/blueprint-testbundleb/src/main/filtered-resources>
[INFO] Copying 0 resource
[INFO] Copying 3 resources
[INFO] [compiler:compile {execution: default-compile}]
[INFO] Compiling 4 source files to <https://builds.apache.org/job/Aries/ws/aries/blueprint/blueprint-testbundleb/target/classes>
[INFO] [resources:testResources {execution: default-testResources}]
[INFO] Using 'UTF-8' encoding to copy filtered resources.
[INFO] skip non existing resourceDirectory <https://builds.apache.org/job/Aries/ws/aries/blueprint/blueprint-testbundleb/src/test/resources>
[INFO] skip non existing resourceDirectory <https://builds.apache.org/job/Aries/ws/aries/blueprint/blueprint-testbundleb/src/test/filtered-resources>
[INFO] Copying 3 resources
[INFO] [compiler:testCompile {execution: default-testCompile}]
[INFO] No sources to compile
[INFO] [surefire:test {execution: default-test}]
[INFO] Surefire report directory: <https://builds.apache.org/job/Aries/ws/aries/blueprint/blueprint-testbundleb/target/surefire-reports>

-------------------------------------------------------
 T E S T S
-------------------------------------------------------
There are no tests to run.

Results :

Tests run: 0, Failures: 0, Errors: 0, Skipped: 0

[JENKINS] Recording test results[INFO] [enforcer:enforce {execution: check-java15}]
[INFO] Checking unresolved references to org.codehaus.mojo.signature:java15:1.0

[INFO] [bundle:bundle {execution: default-bundle}]
[INFO] [ianal:verify-legal-files {execution: default}]
[INFO] Checking legal files in: org.apache.aries.blueprint.testbundleb-1.0.0-SNAPSHOT.jar
[INFO] [install:install {execution: default-install}]
[INFO] Installing <https://builds.apache.org/job/Aries/ws/aries/blueprint/blueprint-testbundleb/target/org.apache.aries.blueprint.testbundleb-1.0.0-SNAPSHOT.jar>
to /home/jenkins/jenkins-slave/maven-repositories/1/org/apache/aries/blueprint/org.apache.aries.blueprint.testbundleb/1.0.0-SNAPSHOT/org.apache.aries.blueprint.testbundleb-1.0.0-SNAPSHOT.jar
[INFO] [bundle:install {execution: default-install}]
[INFO] Installing org/apache/aries/blueprint/org.apache.aries.blueprint.testbundleb/1.0.0-SNAPSHOT/org.apache.aries.blueprint.testbundleb-1.0.0-SNAPSHOT.jar
[INFO] Writing OBR metadata
[JENKINS] Archiving <https://builds.apache.org/job/Aries/ws/aries/blueprint/blueprint-testbundleb/pom.xml>
to /home/hudson/hudson/jobs/Aries/modules/org.apache.aries.blueprint$org.apache.aries.blueprint.testbundleb/builds/2012-08-14_19-31-33/archive/org.apache.aries.blueprint/org.apache.aries.blueprint.testbundleb/1.0.0-SNAPSHOT/org.apache.aries.blueprint.testbundleb-1.0.0-SNAPSHOT.pom
[JENKINS] Archiving <https://builds.apache.org/job/Aries/ws/aries/blueprint/blueprint-testbundleb/target/org.apache.aries.blueprint.testbundleb-1.0.0-SNAPSHOT.jar>
to /home/hudson/hudson/jobs/Aries/modules/org.apache.aries.blueprint$org.apache.aries.blueprint.testbundleb/builds/2012-08-14_19-31-33/archive/org.apache.aries.blueprint/org.apache.aries.blueprint.testbundleb/1.0.0-SNAPSHOT/org.apache.aries.blueprint.testbundleb-1.0.0-SNAPSHOT.jar
[INFO] ------------------------------------------------------------------------
[INFO] Building Apache Aries Blueprint Test Quiesce Bundle
[INFO]    task-segment: [clean, install]
[INFO] ------------------------------------------------------------------------
[INFO] [clean:clean {execution: default-clean}]
[INFO] [enforcer:enforce {execution: default}]
[INFO] [remote-resources:process {execution: default}]
[INFO] [resources:resources {execution: default-resources}]
[INFO] Using 'UTF-8' encoding to copy filtered resources.
[INFO] Copying 1 resource
[INFO] skip non existing resourceDirectory <https://builds.apache.org/job/Aries/ws/aries/blueprint/blueprint-testquiescebundle/src/main/filtered-resources>
[INFO] Copying 0 resource
[INFO] Copying 3 resources
[INFO] [compiler:compile {execution: default-compile}]
[INFO] Compiling 2 source files to <https://builds.apache.org/job/Aries/ws/aries/blueprint/blueprint-testquiescebundle/target/classes>
[INFO] [resources:testResources {execution: default-testResources}]
[INFO] Using 'UTF-8' encoding to copy filtered resources.
[INFO] skip non existing resourceDirectory <https://builds.apache.org/job/Aries/ws/aries/blueprint/blueprint-testquiescebundle/src/test/resources>
[INFO] skip non existing resourceDirectory <https://builds.apache.org/job/Aries/ws/aries/blueprint/blueprint-testquiescebundle/src/test/filtered-resources>
[INFO] Copying 3 resources
[INFO] [compiler:testCompile {execution: default-testCompile}]
[INFO] No sources to compile
[INFO] [surefire:test {execution: default-test}]
[INFO] Surefire report directory: <https://builds.apache.org/job/Aries/ws/aries/blueprint/blueprint-testquiescebundle/target/surefire-reports>

-------------------------------------------------------
 T E S T S
-------------------------------------------------------
There are no tests to run.

Results :

Tests run: 0, Failures: 0, Errors: 0, Skipped: 0

[JENKINS] Recording test results[INFO] [enforcer:enforce {execution: check-java15}]
[INFO] Checking unresolved references to org.codehaus.mojo.signature:java15:1.0

[INFO] [bundle:bundle {execution: default-bundle}]
[WARNING] Warning building bundle org.apache.aries.blueprint:org.apache.aries.blueprint.testquiescebundle:bundle:1.0.1-SNAPSHOT
: Did not find matching referal for org.apache.aries.*
[INFO] [ianal:verify-legal-files {execution: default}]
[INFO] Checking legal files in: org.apache.aries.blueprint.testquiescebundle-1.0.1-SNAPSHOT.jar
[INFO] [install:install {execution: default-install}]
[INFO] Installing <https://builds.apache.org/job/Aries/ws/aries/blueprint/blueprint-testquiescebundle/target/org.apache.aries.blueprint.testquiescebundle-1.0.1-SNAPSHOT.jar>
to /home/jenkins/jenkins-slave/maven-repositories/1/org/apache/aries/blueprint/org.apache.aries.blueprint.testquiescebundle/1.0.1-SNAPSHOT/org.apache.aries.blueprint.testquiescebundle-1.0.1-SNAPSHOT.jar
[INFO] [bundle:install {execution: default-install}]
[INFO] Installing org/apache/aries/blueprint/org.apache.aries.blueprint.testquiescebundle/1.0.1-SNAPSHOT/org.apache.aries.blueprint.testquiescebundle-1.0.1-SNAPSHOT.jar
[INFO] Writing OBR metadata
[JENKINS] Archiving <https://builds.apache.org/job/Aries/ws/aries/blueprint/blueprint-testquiescebundle/pom.xml>
to /home/hudson/hudson/jobs/Aries/modules/org.apache.aries.blueprint$org.apache.aries.blueprint.testquiescebundle/builds/2012-08-14_19-31-33/archive/org.apache.aries.blueprint/org.apache.aries.blueprint.testquiescebundle/1.0.1-SNAPSHOT/org.apache.aries.blueprint.testquiescebundle-1.0.1-SNAPSHOT.pom
[JENKINS] Archiving <https://builds.apache.org/job/Aries/ws/aries/blueprint/blueprint-testquiescebundle/target/org.apache.aries.blueprint.testquiescebundle-1.0.1-SNAPSHOT.jar>
to /home/hudson/hudson/jobs/Aries/modules/org.apache.aries.blueprint$org.apache.aries.blueprint.testquiescebundle/builds/2012-08-14_19-31-33/archive/org.apache.aries.blueprint/org.apache.aries.blueprint.testquiescebundle/1.0.1-SNAPSHOT/org.apache.aries.blueprint.testquiescebundle-1.0.1-SNAPSHOT.jar
[INFO] ------------------------------------------------------------------------
[INFO] Building Apache Aries Blueprint iTests
[INFO]    task-segment: [clean, install]
[INFO] ------------------------------------------------------------------------
[INFO] [clean:clean {execution: default-clean}]
[INFO] snapshot org.apache.aries.blueprint:org.apache.aries.blueprint.testbundleb:1.0.0-SNAPSHOT:
checking for updates from codehaus.snapshots
[INFO] snapshot org.apache.aries.blueprint:org.apache.aries.blueprint.testbundleb:1.0.0-SNAPSHOT:
checking for updates from EclipseLink Repo
[INFO] snapshot org.apache.aries.blueprint:org.apache.aries.blueprint.testbundleb:1.0.0-SNAPSHOT:
checking for updates from apache.snapshots
[WARNING] *** CHECKSUM FAILED - Checksum failed on download: local = '94486b3f0fdad8f48bf1c35fc7975168432b9e48';
remote = '<!DOCTYPE' - RETRYING
[WARNING] *** CHECKSUM FAILED - Checksum failed on download: local = '94486b3f0fdad8f48bf1c35fc7975168432b9e48';
remote = '<!DOCTYPE' - IGNORING
[JENKINS] Archiving <https://builds.apache.org/job/Aries/ws/aries/blueprint/blueprint-itests/pom.xml>
to /home/hudson/hudson/jobs/Aries/modules/org.apache.aries.blueprint$org.apache.aries.blueprint.itests/builds/2012-08-14_19-31-33/archive/org.apache.aries.blueprint/org.apache.aries.blueprint.itests/1.0.0-SNAPSHOT/org.apache.aries.blueprint.itests-1.0.0-SNAPSHOT.pom
[INFO] ------------------------------------------------------------------------
[ERROR] BUILD ERROR
[INFO] ------------------------------------------------------------------------
[INFO] Failed to resolve artifact.

Unable to read local copy of metadata: Cannot read metadata from '/home/jenkins/jenkins-slave/maven-repositories/1/org/apache/aries/blueprint/org.apache.aries.blueprint.testbundleb/1.0.0-SNAPSHOT/maven-metadata-apache.snapshots.xml':
end tag name </body> must match start tag name <hr> from line 7 (position: TEXT
seen ...</address>\n</body>... @9:8) 
  org.apache.aries.blueprint:org.apache.aries.blueprint.testbundleb:jar:1.0.0-SNAPSHOT


Path to dependency: 
	1) org.apache.aries.blueprint:org.apache.aries.blueprint.itests:jar:1.0.0-SNAPSHOT
	2) org.apache.aries.blueprint:org.apache.aries.blueprint.testbundleb:jar:1.0.0-SNAPSHOT



[INFO] ------------------------------------------------------------------------
[INFO] Trace
org.apache.maven.lifecycle.LifecycleExecutionException: Unable to read local copy of metadata:
Cannot read metadata from '/home/jenkins/jenkins-slave/maven-repositories/1/org/apache/aries/blueprint/org.apache.aries.blueprint.testbundleb/1.0.0-SNAPSHOT/maven-metadata-apache.snapshots.xml':
end tag name </body> must match start tag name <hr> from line 7 (position: TEXT
seen ...</address>\n</body>... @9:8) 
  org.apache.aries.blueprint:org.apache.aries.blueprint.testbundleb:jar:1.0.0-SNAPSHOT


Path to dependency: 
	1) org.apache.aries.blueprint:org.apache.aries.blueprint.itests:jar:1.0.0-SNAPSHOT
	2) org.apache.aries.blueprint:org.apache.aries.blueprint.testbundleb:jar:1.0.0-SNAPSHOT


	at org.apache.maven.lifecycle.DefaultLifecycleExecutor.executeGoals(DefaultLifecycleExecutor.java:711)
	at org.apache.maven.lifecycle.DefaultLifecycleExecutor.executeGoalWithLifecycle(DefaultLifecycleExecutor.java:556)
	at org.apache.maven.lifecycle.DefaultLifecycleExecutor.executeGoal(DefaultLifecycleExecutor.java:535)
	at org.apache.maven.lifecycle.DefaultLifecycleExecutor.executeGoalAndHandleFailures(DefaultLifecycleExecutor.java:387)
	at org.apache.maven.lifecycle.DefaultLifecycleExecutor.executeTaskSegments(DefaultLifecycleExecutor.java:348)
	at org.apache.maven.lifecycle.DefaultLifecycleExecutor.execute(DefaultLifecycleExecutor.java:180)
	at org.apache.maven.lifecycle.LifecycleExecutorInterceptor.execute(LifecycleExecutorInterceptor.java:65)
	at org.apache.maven.DefaultMaven.doExecute(DefaultMaven.java:328)
	at org.apache.maven.DefaultMaven.execute(DefaultMaven.java:138)
	at org.apache.maven.cli.MavenCli.main(MavenCli.java:362)
	at sun.reflect.NativeMethodAccessorImpl.invoke0(Native Method)
	at sun.reflect.NativeMethodAccessorImpl.invoke(NativeMethodAccessorImpl.java:39)
	at sun.reflect.DelegatingMethodAccessorImpl.invoke(DelegatingMethodAccessorImpl.java:25)
	at java.lang.reflect.Method.invoke(Method.java:597)
	at org.codehaus.classworlds.Launcher.launchEnhanced(Launcher.java:315)
	at org.codehaus.classworlds.Launcher.launch(Launcher.java:255)
	at hudson.maven.agent.Main.launch(Main.java:185)
	at hudson.maven.MavenBuilder.call(MavenBuilder.java:151)
	at hudson.maven.Maven2Builder.call(Maven2Builder.java:77)
	at hudson.maven.Maven2Builder.call(Maven2Builder.java:53)
	at hudson.remoting.UserRequest.perform(UserRequest.java:118)
	at hudson.remoting.UserRequest.perform(UserRequest.java:48)
	at hudson.remoting.Request$2.run(Request.java:326)
	at hudson.remoting.InterceptingExecutorService$1.call(InterceptingExecutorService.java:72)
	at java.util.concurrent.FutureTask$Sync.innerRun(FutureTask.java:303)
	at java.util.concurrent.FutureTask.run(FutureTask.java:138)
	at java.util.concurrent.ThreadPoolExecutor$Worker.runTask(ThreadPoolExecutor.java:886)
	at java.util.concurrent.ThreadPoolExecutor$Worker.run(ThreadPoolExecutor.java:908)
	at java.lang.Thread.run(Thread.java:662)
Caused by: org.apache.maven.artifact.resolver.ArtifactResolutionException: Unable to read
local copy of metadata: Cannot read metadata from '/home/jenkins/jenkins-slave/maven-repositories/1/org/apache/aries/blueprint/org.apache.aries.blueprint.testbundleb/1.0.0-SNAPSHOT/maven-metadata-apache.snapshots.xml':
end tag name </body> must match start tag name <hr> from line 7 (position: TEXT
seen ...</address>\n</body>... @9:8) 
  org.apache.aries.blueprint:org.apache.aries.blueprint.testbundleb:jar:1.0.0-SNAPSHOT


Path to dependency: 
	1) org.apache.aries.blueprint:org.apache.aries.blueprint.itests:jar:1.0.0-SNAPSHOT
	2) org.apache.aries.blueprint:org.apache.aries.blueprint.testbundleb:jar:1.0.0-SNAPSHOT


	at org.apache.maven.artifact.transform.SnapshotTransformation.transformForResolve(SnapshotTransformation.java:68)
	at org.apache.maven.artifact.transform.DefaultArtifactTransformationManager.transformForResolve(DefaultArtifactTransformationManager.java:55)
	at org.apache.maven.artifact.resolver.DefaultArtifactResolver.resolve(DefaultArtifactResolver.java:145)
	at org.apache.maven.artifact.resolver.DefaultArtifactResolver.resolve(DefaultArtifactResolver.java:90)
	at org.apache.maven.artifact.resolver.DefaultArtifactResolver$ResolveArtifactTask.resolveArtifact(DefaultArtifactResolver.java:456)
	at org.apache.maven.artifact.resolver.DefaultArtifactResolver$ResolveArtifactTask.run(DefaultArtifactResolver.java:433)
	at hidden.edu.emory.mathcs.backport.java.util.concurrent.ThreadPoolExecutor.runWorker(ThreadPoolExecutor.java:1061)
	at hidden.edu.emory.mathcs.backport.java.util.concurrent.ThreadPoolExecutor$Worker.run(ThreadPoolExecutor.java:575)
	... 1 more
Caused by: org.apache.maven.artifact.repository.metadata.RepositoryMetadataResolutionException:
Unable to read local copy of metadata: Cannot read metadata from '/home/jenkins/jenkins-slave/maven-repositories/1/org/apache/aries/blueprint/org.apache.aries.blueprint.testbundleb/1.0.0-SNAPSHOT/maven-metadata-apache.snapshots.xml':
end tag name </body> must match start tag name <hr> from line 7 (position: TEXT
seen ...</address>\n</body>... @9:8) 
	at org.apache.maven.artifact.repository.metadata.DefaultRepositoryMetadataManager.resolve(DefaultRepositoryMetadataManager.java:175)
	at org.apache.maven.artifact.transform.AbstractVersionTransformation.resolveVersion(AbstractVersionTransformation.java:65)
	at org.apache.maven.artifact.transform.SnapshotTransformation.transformForResolve(SnapshotTransformation.java:63)
	... 8 more
Caused by: org.apache.maven.artifact.repository.metadata.RepositoryMetadataReadException:
Cannot read metadata from '/home/jenkins/jenkins-slave/maven-repositories/1/org/apache/aries/blueprint/org.apache.aries.blueprint.testbundleb/1.0.0-SNAPSHOT/maven-metadata-apache.snapshots.xml':
end tag name </body> must match start tag name <hr> from line 7 (position: TEXT
seen ...</address>\n</body>... @9:8) 
	at org.apache.maven.artifact.repository.metadata.DefaultRepositoryMetadataManager.readMetadata(DefaultRepositoryMetadataManager.java:323)
	at org.apache.maven.artifact.repository.metadata.DefaultRepositoryMetadataManager.loadMetadata(DefaultRepositoryMetadataManager.java:275)
	at org.apache.maven.artifact.repository.metadata.DefaultRepositoryMetadataManager.mergeMetadata(DefaultRepositoryMetadataManager.java:198)
	at org.apache.maven.artifact.repository.metadata.DefaultRepositoryMetadataManager.resolve(DefaultRepositoryMetadataManager.java:166)
	... 10 more
Caused by: org.codehaus.plexus.util.xml.pull.XmlPullParserException: end tag name </body>
must match start tag name <hr> from line 7 (position: TEXT seen ...</address>\n</body>...
@9:8) 
	at hidden.org.codehaus.plexus.util.xml.pull.MXParser.parseEndTag(MXParser.java:1698)
	at hidden.org.codehaus.plexus.util.xml.pull.MXParser.nextImpl(MXParser.java:1143)
	at hidden.org.codehaus.plexus.util.xml.pull.MXParser.next(MXParser.java:1105)
	at org.apache.maven.artifact.repository.metadata.io.xpp3.MetadataXpp3Reader.parseMetadata(MetadataXpp3Reader.java:501)
	at org.apache.maven.artifact.repository.metadata.io.xpp3.MetadataXpp3Reader.read(MetadataXpp3Reader.java:950)
	at org.apache.maven.artifact.repository.metadata.DefaultRepositoryMetadataManager.readMetadata(DefaultRepositoryMetadataManager.java:310)
	... 13 more
[INFO] ------------------------------------------------------------------------
[INFO] Total time: 5 minutes 8 seconds
[INFO] Finished at: Tue Aug 14 19:37:17 UTC 2012
[INFO] Final Memory: 139M/532M
[INFO] ------------------------------------------------------------------------
Sending e-mails to: dev@aries.apache.org
channel stopped

Mime
View raw message