aries-dev mailing list archives

Site index · List index
Message view « Date » · « Thread »
Top « Date » · « Thread »
From Apache Jenkins Server <jenk...@builds.apache.org>
Subject Build failed in Jenkins: Aries #1629
Date Wed, 01 Aug 2012 22:19:04 GMT
See <https://builds.apache.org/job/Aries/1629/changes>

Changes:

[cumminsh] [ARIES-862]Moving to released versions of dependencies (a little early, so may
have to wait for maven central to catch up

------------------------------------------
[...truncated 1236 lines...]
[INFO] Checking unresolved references to org.codehaus.mojo.signature:java15:1.0
[INFO] [site:attach-descriptor {execution: default-attach-descriptor}]
[INFO] [ianal:verify-legal-files {execution: default}]
[INFO] [install:install {execution: default-install}]
[INFO] Installing <https://builds.apache.org/job/Aries/ws/aries/quiesce/pom.xml> to
/home/jenkins/jenkins-slave/maven-repositories/0/org/apache/aries/quiesce/quiesce/1.0.0-SNAPSHOT/quiesce-1.0.0-SNAPSHOT.pom
[JENKINS] Archiving <https://builds.apache.org/job/Aries/ws/aries/quiesce/pom.xml> to
/home/hudson/hudson/jobs/Aries/modules/org.apache.aries.quiesce$quiesce/builds/2012-08-01_22-14-03/archive/org.apache.aries.quiesce/quiesce/1.0.0-SNAPSHOT/quiesce-1.0.0-SNAPSHOT.pom
[INFO] ------------------------------------------------------------------------
[INFO] Building Apache Aries Blueprint API
[INFO]    task-segment: [clean, install]
[INFO] ------------------------------------------------------------------------
[INFO] [clean:clean {execution: default-clean}]
[INFO] Deleting file set: <https://builds.apache.org/job/Aries/ws/aries/blueprint/blueprint-api/target>
(included: [**], excluded: [])
[INFO] [enforcer:enforce {execution: default}]
[INFO] [remote-resources:process {execution: default}]
[INFO] [resources:resources {execution: default-resources}]
[INFO] Using 'UTF-8' encoding to copy filtered resources.
[INFO] Copying 1 resource
[INFO] skip non existing resourceDirectory <https://builds.apache.org/job/Aries/ws/aries/blueprint/blueprint-api/src/main/filtered-resources>
[INFO] Copying 2 resources
[INFO] Copying 3 resources
[INFO] [compiler:compile {execution: default-compile}]
[INFO] Compiling 30 source files to <https://builds.apache.org/job/Aries/ws/aries/blueprint/blueprint-api/target/classes>
[INFO] [resources:testResources {execution: default-testResources}]
[INFO] Using 'UTF-8' encoding to copy filtered resources.
[INFO] skip non existing resourceDirectory <https://builds.apache.org/job/Aries/ws/aries/blueprint/blueprint-api/src/test/resources>
[INFO] skip non existing resourceDirectory <https://builds.apache.org/job/Aries/ws/aries/blueprint/blueprint-api/src/test/filtered-resources>
[INFO] Copying 3 resources
[INFO] [compiler:testCompile {execution: default-testCompile}]
[INFO] No sources to compile
[INFO] [surefire:test {execution: default-test}]
[INFO] Surefire report directory: <https://builds.apache.org/job/Aries/ws/aries/blueprint/blueprint-api/target/surefire-reports>

-------------------------------------------------------
 T E S T S
-------------------------------------------------------
There are no tests to run.

Results :

Tests run: 0, Failures: 0, Errors: 0, Skipped: 0

[JENKINS] Recording test results[INFO] [enforcer:enforce {execution: check-java15}]
[INFO] Checking unresolved references to org.codehaus.mojo.signature:java15:1.0

[INFO] [bundle:bundle {execution: default-bundle}]
[WARNING] Warning building bundle org.apache.aries.blueprint:org.apache.aries.blueprint.api:bundle:1.0.1-SNAPSHOT
: Did not find matching referal for org.apache.aries.*
[INFO] [ianal:verify-legal-files {execution: default}]
[INFO] Checking legal files in: org.apache.aries.blueprint.api-1.0.1-SNAPSHOT.jar
[INFO] [install:install {execution: default-install}]
[INFO] Installing <https://builds.apache.org/job/Aries/ws/aries/blueprint/blueprint-api/target/org.apache.aries.blueprint.api-1.0.1-SNAPSHOT.jar>
to /home/jenkins/jenkins-slave/maven-repositories/0/org/apache/aries/blueprint/org.apache.aries.blueprint.api/1.0.1-SNAPSHOT/org.apache.aries.blueprint.api-1.0.1-SNAPSHOT.jar
[INFO] [bundle:install {execution: default-install}]
[INFO] Installing org/apache/aries/blueprint/org.apache.aries.blueprint.api/1.0.1-SNAPSHOT/org.apache.aries.blueprint.api-1.0.1-SNAPSHOT.jar
[INFO] Writing OBR metadata
[JENKINS] Archiving <https://builds.apache.org/job/Aries/ws/aries/blueprint/blueprint-api/pom.xml>
to /home/hudson/hudson/jobs/Aries/modules/org.apache.aries.blueprint$org.apache.aries.blueprint.api/builds/2012-08-01_22-14-03/archive/org.apache.aries.blueprint/org.apache.aries.blueprint.api/1.0.1-SNAPSHOT/org.apache.aries.blueprint.api-1.0.1-SNAPSHOT.pom
[JENKINS] Archiving <https://builds.apache.org/job/Aries/ws/aries/blueprint/blueprint-api/target/org.apache.aries.blueprint.api-1.0.1-SNAPSHOT.jar>
to /home/hudson/hudson/jobs/Aries/modules/org.apache.aries.blueprint$org.apache.aries.blueprint.api/builds/2012-08-01_22-14-03/archive/org.apache.aries.blueprint/org.apache.aries.blueprint.api/1.0.1-SNAPSHOT/org.apache.aries.blueprint.api-1.0.1-SNAPSHOT.jar
[INFO] ------------------------------------------------------------------------
[INFO] Building Apache Aries Blueprint Parser
[INFO]    task-segment: [clean, install]
[INFO] ------------------------------------------------------------------------
[INFO] [clean:clean {execution: default-clean}]
[INFO] Deleting file set: <https://builds.apache.org/job/Aries/ws/aries/blueprint/blueprint-parser/target>
(included: [**], excluded: [])
[INFO] [enforcer:enforce {execution: default}]
[INFO] [remote-resources:process {execution: default}]
[INFO] [resources:resources {execution: default-resources}]
[INFO] Using 'UTF-8' encoding to copy filtered resources.
[INFO] skip non existing resourceDirectory <https://builds.apache.org/job/Aries/ws/aries/blueprint/blueprint-parser/src/main/resources>
[INFO] skip non existing resourceDirectory <https://builds.apache.org/job/Aries/ws/aries/blueprint/blueprint-parser/src/main/filtered-resources>
[INFO] Copying 3 resources
[INFO] Copying 3 resources
[INFO] [compiler:compile {execution: default-compile}]
[INFO] Compiling 56 source files to <https://builds.apache.org/job/Aries/ws/aries/blueprint/blueprint-parser/target/classes>
[INFO] [resources:testResources {execution: default-testResources}]
[INFO] Using 'UTF-8' encoding to copy filtered resources.
[INFO] skip non existing resourceDirectory <https://builds.apache.org/job/Aries/ws/aries/blueprint/blueprint-parser/src/test/resources>
[INFO] skip non existing resourceDirectory <https://builds.apache.org/job/Aries/ws/aries/blueprint/blueprint-parser/src/test/filtered-resources>
[INFO] Copying 3 resources
[INFO] [compiler:testCompile {execution: default-testCompile}]
[INFO] No sources to compile
[INFO] [surefire:test {execution: default-test}]
[INFO] Surefire report directory: <https://builds.apache.org/job/Aries/ws/aries/blueprint/blueprint-parser/target/surefire-reports>

-------------------------------------------------------
 T E S T S
-------------------------------------------------------
There are no tests to run.

Results :

Tests run: 0, Failures: 0, Errors: 0, Skipped: 0

[JENKINS] Recording test results[INFO] [enforcer:enforce {execution: check-java15}]
[INFO] Checking unresolved references to org.codehaus.mojo.signature:java15:1.0

[INFO] [jar:jar {execution: default-jar}]
[INFO] Building jar: <https://builds.apache.org/job/Aries/ws/aries/blueprint/blueprint-parser/target/blueprint-parser-1.0.1-SNAPSHOT.jar>
[INFO] [ianal:verify-legal-files {execution: default}]
[INFO] Checking legal files in: blueprint-parser-1.0.1-SNAPSHOT.jar
[INFO] [install:install {execution: default-install}]
[INFO] Installing <https://builds.apache.org/job/Aries/ws/aries/blueprint/blueprint-parser/target/blueprint-parser-1.0.1-SNAPSHOT.jar>
to /home/jenkins/jenkins-slave/maven-repositories/0/org/apache/aries/blueprint/blueprint-parser/1.0.1-SNAPSHOT/blueprint-parser-1.0.1-SNAPSHOT.jar
[JENKINS] Archiving <https://builds.apache.org/job/Aries/ws/aries/blueprint/blueprint-parser/pom.xml>
to /home/hudson/hudson/jobs/Aries/modules/org.apache.aries.blueprint$blueprint-parser/builds/2012-08-01_22-14-03/archive/org.apache.aries.blueprint/blueprint-parser/1.0.1-SNAPSHOT/blueprint-parser-1.0.1-SNAPSHOT.pom
[JENKINS] Archiving <https://builds.apache.org/job/Aries/ws/aries/blueprint/blueprint-parser/target/blueprint-parser-1.0.1-SNAPSHOT.jar>
to /home/hudson/hudson/jobs/Aries/modules/org.apache.aries.blueprint$blueprint-parser/builds/2012-08-01_22-14-03/archive/org.apache.aries.blueprint/blueprint-parser/1.0.1-SNAPSHOT/blueprint-parser-1.0.1-SNAPSHOT.jar
[INFO] ------------------------------------------------------------------------
[INFO] Building Apache Aries Blueprint Annotation API
[INFO]    task-segment: [clean, install]
[INFO] ------------------------------------------------------------------------
[INFO] [clean:clean {execution: default-clean}]
[INFO] Deleting file set: <https://builds.apache.org/job/Aries/ws/aries/blueprint/blueprint-annotation-api/target>
(included: [**], excluded: [])
[INFO] [enforcer:enforce {execution: default}]
[INFO] [remote-resources:process {execution: default}]
[INFO] [resources:resources {execution: default-resources}]
[INFO] Using 'UTF-8' encoding to copy filtered resources.
[INFO] skip non existing resourceDirectory <https://builds.apache.org/job/Aries/ws/aries/blueprint/blueprint-annotation-api/src/main/resources>
[INFO] skip non existing resourceDirectory <https://builds.apache.org/job/Aries/ws/aries/blueprint/blueprint-annotation-api/src/main/filtered-resources>
[INFO] Copying 2 resources
[INFO] Copying 3 resources
[INFO] [compiler:compile {execution: default-compile}]
[INFO] Compiling 19 source files to <https://builds.apache.org/job/Aries/ws/aries/blueprint/blueprint-annotation-api/target/classes>
[INFO] [resources:testResources {execution: default-testResources}]
[INFO] Using 'UTF-8' encoding to copy filtered resources.
[INFO] skip non existing resourceDirectory <https://builds.apache.org/job/Aries/ws/aries/blueprint/blueprint-annotation-api/src/test/resources>
[INFO] skip non existing resourceDirectory <https://builds.apache.org/job/Aries/ws/aries/blueprint/blueprint-annotation-api/src/test/filtered-resources>
[INFO] Copying 3 resources
[INFO] [compiler:testCompile {execution: default-testCompile}]
[INFO] No sources to compile
[INFO] [surefire:test {execution: default-test}]
[INFO] Surefire report directory: <https://builds.apache.org/job/Aries/ws/aries/blueprint/blueprint-annotation-api/target/surefire-reports>

-------------------------------------------------------
 T E S T S
-------------------------------------------------------
There are no tests to run.

Results :

Tests run: 0, Failures: 0, Errors: 0, Skipped: 0

[JENKINS] Recording test results[INFO] [enforcer:enforce {execution: check-java15}]
[INFO] Checking unresolved references to org.codehaus.mojo.signature:java15:1.0

[INFO] [bundle:bundle {execution: default-bundle}]
[WARNING] Warning building bundle org.apache.aries.blueprint:org.apache.aries.blueprint.annotation.api:bundle:1.0.1-SNAPSHOT
: Did not find matching referal for org.apache.aries.*
[INFO] [ianal:verify-legal-files {execution: default}]
[INFO] Checking legal files in: org.apache.aries.blueprint.annotation.api-1.0.1-SNAPSHOT.jar
[INFO] [install:install {execution: default-install}]
[INFO] Installing <https://builds.apache.org/job/Aries/ws/aries/blueprint/blueprint-annotation-api/target/org.apache.aries.blueprint.annotation.api-1.0.1-SNAPSHOT.jar>
to /home/jenkins/jenkins-slave/maven-repositories/0/org/apache/aries/blueprint/org.apache.aries.blueprint.annotation.api/1.0.1-SNAPSHOT/org.apache.aries.blueprint.annotation.api-1.0.1-SNAPSHOT.jar
[INFO] [bundle:install {execution: default-install}]
[INFO] Installing org/apache/aries/blueprint/org.apache.aries.blueprint.annotation.api/1.0.1-SNAPSHOT/org.apache.aries.blueprint.annotation.api-1.0.1-SNAPSHOT.jar
[INFO] Writing OBR metadata
[JENKINS] Archiving <https://builds.apache.org/job/Aries/ws/aries/blueprint/blueprint-annotation-api/pom.xml>
to /home/hudson/hudson/jobs/Aries/modules/org.apache.aries.blueprint$org.apache.aries.blueprint.annotation.api/builds/2012-08-01_22-14-04/archive/org.apache.aries.blueprint/org.apache.aries.blueprint.annotation.api/1.0.1-SNAPSHOT/org.apache.aries.blueprint.annotation.api-1.0.1-SNAPSHOT.pom
[JENKINS] Archiving <https://builds.apache.org/job/Aries/ws/aries/blueprint/blueprint-annotation-api/target/org.apache.aries.blueprint.annotation.api-1.0.1-SNAPSHOT.jar>
to /home/hudson/hudson/jobs/Aries/modules/org.apache.aries.blueprint$org.apache.aries.blueprint.annotation.api/builds/2012-08-01_22-14-04/archive/org.apache.aries.blueprint/org.apache.aries.blueprint.annotation.api/1.0.1-SNAPSHOT/org.apache.aries.blueprint.annotation.api-1.0.1-SNAPSHOT.jar
[INFO] ------------------------------------------------------------------------
[INFO] Building Apache Aries Blueprint Core
[INFO]    task-segment: [clean, install]
[INFO] ------------------------------------------------------------------------
[INFO] [clean:clean {execution: default-clean}]
[INFO] Deleting file set: <https://builds.apache.org/job/Aries/ws/aries/blueprint/blueprint-core/target>
(included: [**], excluded: [])
Downloading: http://download.eclipse.org/rt/eclipselink/maven.repo//org/apache/aries/blueprint/blueprint-parser/1.0.0/blueprint-parser-1.0.0.pom
[INFO] Unable to find resource 'org.apache.aries.blueprint:blueprint-parser:pom:1.0.0' in
repository EclipseLink Repo (http://download.eclipse.org/rt/eclipselink/maven.repo/)
Downloading: http://repo1.maven.org/maven2/org/apache/aries/blueprint/blueprint-parser/1.0.0/blueprint-parser-1.0.0.pom
2K downloaded  (blueprint-parser-1.0.0.pom)
Downloading: http://download.eclipse.org/rt/eclipselink/maven.repo//org/apache/aries/blueprint/blueprint-parser/1.0.0/blueprint-parser-1.0.0.jar
[INFO] Unable to find resource 'org.apache.aries.blueprint:blueprint-parser:jar:1.0.0' in
repository EclipseLink Repo (http://download.eclipse.org/rt/eclipselink/maven.repo/)
Downloading: http://repo1.maven.org/maven2/org/apache/aries/blueprint/blueprint-parser/1.0.0/blueprint-parser-1.0.0.jar
74K downloaded  (blueprint-parser-1.0.0.jar)
[INFO] [enforcer:enforce {execution: default}]
[INFO] [dependency:unpack {execution: unpack-sources}]
[INFO] Configured Artifact: org.apache.aries.blueprint:org.apache.aries.blueprint.api:?:jar
[INFO] Unpacking /home/jenkins/jenkins-slave/maven-repositories/0/org/apache/aries/blueprint/org.apache.aries.blueprint.api/1.0.0/org.apache.aries.blueprint.api-1.0.0.jarto
 <https://builds.apache.org/job/Aries/ws/aries/blueprint/blueprint-core/target/sources>
with Includes **/blueprint.xsd and excludes:null
[INFO] [remote-resources:process {execution: default}]
[INFO] [resources:resources {execution: default-resources}]
[INFO] Using 'UTF-8' encoding to copy filtered resources.
[INFO] Copying 6 resources
[INFO] Copying 9 resources
[INFO] Copying 3 resources
[INFO] [compiler:compile {execution: default-compile}]
[INFO] Compiling 64 source files to <https://builds.apache.org/job/Aries/ws/aries/blueprint/blueprint-core/target/classes>
[JENKINS] Archiving <https://builds.apache.org/job/Aries/ws/aries/blueprint/blueprint-core/pom.xml>
to /home/hudson/hudson/jobs/Aries/modules/org.apache.aries.blueprint$org.apache.aries.blueprint.core/builds/2012-08-01_22-14-03/archive/org.apache.aries.blueprint/org.apache.aries.blueprint.core/1.0.1-SNAPSHOT/org.apache.aries.blueprint.core-1.0.1-SNAPSHOT.pom
[INFO] ------------------------------------------------------------------------
[ERROR] BUILD FAILURE
[INFO] ------------------------------------------------------------------------
[INFO] Compilation failure

<https://builds.apache.org/job/Aries/ws/aries/blueprint/blueprint-core/src/main/java/org/apache/aries/blueprint/container/BlueprintContainerImpl.java>:[107,30]
[deprecation] org.apache.aries.blueprint.ExtendedBlueprintContainer in org.apache.aries.blueprint
has been deprecated

<https://builds.apache.org/job/Aries/ws/aries/blueprint/blueprint-core/src/main/java/org/apache/aries/blueprint/namespace/NamespaceHandlerRegistryImpl.java>:[417,8]
cannot find symbol
symbol  : variable lock
location: class org.apache.aries.blueprint.namespace.NamespaceHandlerRegistryImpl

<https://builds.apache.org/job/Aries/ws/aries/blueprint/blueprint-core/src/main/java/org/apache/aries/blueprint/namespace/NamespaceHandlerRegistryImpl.java>:[425,12]
cannot find symbol
symbol  : variable lock
location: class org.apache.aries.blueprint.namespace.NamespaceHandlerRegistryImpl

<https://builds.apache.org/job/Aries/ws/aries/blueprint/blueprint-core/src/main/java/org/apache/aries/blueprint/namespace/NamespaceHandlerRegistryImpl.java>:[428,12]
cannot find symbol
symbol  : variable lock
location: class org.apache.aries.blueprint.namespace.NamespaceHandlerRegistryImpl

<https://builds.apache.org/job/Aries/ws/aries/blueprint/blueprint-core/src/main/java/org/apache/aries/blueprint/namespace/NamespaceHandlerRegistryImpl.java>:[434,16]
cannot find symbol
symbol  : variable lock
location: class org.apache.aries.blueprint.namespace.NamespaceHandlerRegistryImpl


[INFO] ------------------------------------------------------------------------
[INFO] Trace
org.apache.maven.BuildFailureException: Compilation failure
	at org.apache.maven.lifecycle.DefaultLifecycleExecutor.executeGoals(DefaultLifecycleExecutor.java:715)
	at org.apache.maven.lifecycle.DefaultLifecycleExecutor.executeGoalWithLifecycle(DefaultLifecycleExecutor.java:556)
	at org.apache.maven.lifecycle.DefaultLifecycleExecutor.executeGoal(DefaultLifecycleExecutor.java:535)
	at org.apache.maven.lifecycle.DefaultLifecycleExecutor.executeGoalAndHandleFailures(DefaultLifecycleExecutor.java:387)
	at org.apache.maven.lifecycle.DefaultLifecycleExecutor.executeTaskSegments(DefaultLifecycleExecutor.java:348)
	at org.apache.maven.lifecycle.DefaultLifecycleExecutor.execute(DefaultLifecycleExecutor.java:180)
	at org.apache.maven.lifecycle.LifecycleExecutorInterceptor.execute(LifecycleExecutorInterceptor.java:65)
	at org.apache.maven.DefaultMaven.doExecute(DefaultMaven.java:328)
	at org.apache.maven.DefaultMaven.execute(DefaultMaven.java:138)
	at org.apache.maven.cli.MavenCli.main(MavenCli.java:362)
	at sun.reflect.NativeMethodAccessorImpl.invoke0(Native Method)
	at sun.reflect.NativeMethodAccessorImpl.invoke(NativeMethodAccessorImpl.java:39)
	at sun.reflect.DelegatingMethodAccessorImpl.invoke(DelegatingMethodAccessorImpl.java:25)
	at java.lang.reflect.Method.invoke(Method.java:597)
	at org.codehaus.classworlds.Launcher.launchEnhanced(Launcher.java:315)
	at org.codehaus.classworlds.Launcher.launch(Launcher.java:255)
	at hudson.maven.agent.Main.launch(Main.java:185)
	at hudson.maven.MavenBuilder.call(MavenBuilder.java:151)
	at hudson.maven.Maven2Builder.call(Maven2Builder.java:77)
	at hudson.maven.Maven2Builder.call(Maven2Builder.java:53)
	at hudson.remoting.UserRequest.perform(UserRequest.java:118)
	at hudson.remoting.UserRequest.perform(UserRequest.java:48)
	at hudson.remoting.Request$2.run(Request.java:326)
	at hudson.remoting.InterceptingExecutorService$1.call(InterceptingExecutorService.java:72)
	at java.util.concurrent.FutureTask$Sync.innerRun(FutureTask.java:303)
	at java.util.concurrent.FutureTask.run(FutureTask.java:138)
	at java.util.concurrent.ThreadPoolExecutor$Worker.runTask(ThreadPoolExecutor.java:886)
	at java.util.concurrent.ThreadPoolExecutor$Worker.run(ThreadPoolExecutor.java:908)
	at java.lang.Thread.run(Thread.java:662)
Caused by: org.apache.maven.plugin.CompilationFailureException: Compilation failure
	at org.apache.maven.plugin.AbstractCompilerMojo.execute(AbstractCompilerMojo.java:516)
	at org.apache.maven.plugin.CompilerMojo.execute(CompilerMojo.java:114)
	at org.apache.maven.plugin.DefaultPluginManager.executeMojo(DefaultPluginManager.java:490)
	at hudson.maven.agent.PluginManagerInterceptor.executeMojo(PluginManagerInterceptor.java:182)
	at org.apache.maven.lifecycle.DefaultLifecycleExecutor.executeGoals(DefaultLifecycleExecutor.java:694)
	... 28 more
[INFO] ------------------------------------------------------------------------
[INFO] Total time: 4 minutes 17 seconds
[INFO] Finished at: Wed Aug 01 22:19:00 UTC 2012
[INFO] Final Memory: 162M/449M
[INFO] ------------------------------------------------------------------------
Sending e-mails to: dev@aries.apache.org
channel stopped

Mime
View raw message