aries-dev mailing list archives

Site index · List index
Message view « Date » · « Thread »
Top « Date » · « Thread »
From Apache Jenkins Server <jenk...@builds.apache.org>
Subject Build failed in Jenkins: Aries #1633
Date Tue, 14 Aug 2012 19:28:12 GMT
See <https://builds.apache.org/job/Aries/1633/changes>

Changes:

[davidb] A minor change to the script that copies the SPI-Fly bundle to the OSGi CT location.

The SPI-Fly version in this commit passes the OSGi ServiceLoader Mediator CT.

[cumminsh] [ARIES-899] Backing out change, since it doesn't compile (missing lock variable)

------------------------------------------
[...truncated 7209 lines...]
[INFO] [resources:testResources {execution: default-testResources}]
[INFO] Using 'UTF-8' encoding to copy filtered resources.
[INFO] Copying 0 resource
[INFO] skip non existing resourceDirectory <https://builds.apache.org/job/Aries/ws/aries/proxy/proxy-impl/src/test/filtered-resources>
[INFO] Copying 3 resources
[INFO] [compiler:testCompile {execution: default-testCompile}]
[INFO] Compiling 40 source files to <https://builds.apache.org/job/Aries/ws/aries/proxy/proxy-impl/target/test-classes>
[INFO] [surefire:test {execution: default-test}]
[INFO] Surefire report directory: <https://builds.apache.org/job/Aries/ws/aries/proxy/proxy-impl/target/surefire-reports>

-------------------------------------------------------
 T E S T S
-------------------------------------------------------
Running org.apache.aries.blueprint.proxy.WovenProxyGeneratorTest
Tests run: 34, Failures: 0, Errors: 0, Skipped: 0, Time elapsed: 0.276 sec
Running org.apache.aries.proxy.impl.weaving.ProxyWeavingHookTest
Tests run: 2, Failures: 0, Errors: 0, Skipped: 0, Time elapsed: 0.03 sec
Running org.apache.aries.blueprint.proxy.InterfaceProxyingTest
Tests run: 7, Failures: 0, Errors: 0, Skipped: 0, Time elapsed: 0.084 sec
Running org.apache.aries.blueprint.proxy.WovenProxyPlusSubclassGeneratorTest
Tests run: 35, Failures: 0, Errors: 0, Skipped: 0, Time elapsed: 0.084 sec
Running org.apache.aries.blueprint.proxy.ProxySubclassGeneratorTest
Tests run: 21, Failures: 0, Errors: 0, Skipped: 1, Time elapsed: 0.054 sec
Running org.apache.aries.blueprint.proxy.WovenSubclassGeneratorTest
Tests run: 21, Failures: 0, Errors: 0, Skipped: 0, Time elapsed: 0.058 sec

Results :

Tests run: 120, Failures: 0, Errors: 0, Skipped: 1

[JENKINS] Recording test results
[INFO] [enforcer:enforce {execution: check-java15}]
[INFO] Checking unresolved references to org.codehaus.mojo.signature:java15:1.0
[INFO] [bundle:bundle {execution: default-bundle}]
[INFO] [ianal:verify-legal-files {execution: default}]
[INFO] Checking legal files in: org.apache.aries.proxy.impl-1.0.1-SNAPSHOT.jar
[INFO] [install:install {execution: default-install}]
[INFO] Installing <https://builds.apache.org/job/Aries/ws/aries/proxy/proxy-impl/target/org.apache.aries.proxy.impl-1.0.1-SNAPSHOT.jar>
to /home/jenkins/jenkins-slave/maven-repositories/0/org/apache/aries/proxy/org.apache.aries.proxy.impl/1.0.1-SNAPSHOT/org.apache.aries.proxy.impl-1.0.1-SNAPSHOT.jar
[INFO] [bundle:install {execution: default-install}]
[INFO] Installing org/apache/aries/proxy/org.apache.aries.proxy.impl/1.0.1-SNAPSHOT/org.apache.aries.proxy.impl-1.0.1-SNAPSHOT.jar
[INFO] Writing OBR metadata
[JENKINS] Archiving <https://builds.apache.org/job/Aries/ws/aries/proxy/proxy-impl/pom.xml>
to /home/hudson/hudson/jobs/Aries/modules/org.apache.aries.proxy$org.apache.aries.proxy.impl/builds/2012-08-14_19-25-58/archive/org.apache.aries.proxy/org.apache.aries.proxy.impl/1.0.1-SNAPSHOT/org.apache.aries.proxy.impl-1.0.1-SNAPSHOT.pom
[JENKINS] Archiving <https://builds.apache.org/job/Aries/ws/aries/proxy/proxy-impl/target/org.apache.aries.proxy.impl-1.0.1-SNAPSHOT.jar>
to /home/hudson/hudson/jobs/Aries/modules/org.apache.aries.proxy$org.apache.aries.proxy.impl/builds/2012-08-14_19-25-58/archive/org.apache.aries.proxy/org.apache.aries.proxy.impl/1.0.1-SNAPSHOT/org.apache.aries.proxy.impl-1.0.1-SNAPSHOT.jar
[INFO] ------------------------------------------------------------------------
[INFO] Building Apache Aries Proxy Bundle
[INFO]    task-segment: [clean, install]
[INFO] ------------------------------------------------------------------------
[INFO] [clean:clean {execution: default-clean}]
[INFO] [enforcer:enforce {execution: default}]
[INFO] [remote-resources:process {execution: default}]
[INFO] [resources:resources {execution: default-resources}]
[INFO] Using 'UTF-8' encoding to copy filtered resources.
[INFO] skip non existing resourceDirectory <https://builds.apache.org/job/Aries/ws/aries/proxy/proxy-bundle/src/main/resources>
[INFO] skip non existing resourceDirectory <https://builds.apache.org/job/Aries/ws/aries/proxy/proxy-bundle/src/main/filtered-resources>
[INFO] skip non existing resourceDirectory <https://builds.apache.org/job/Aries/ws/aries/proxy/proxy-bundle/src/main/java>
[INFO] Copying 3 resources
[INFO] [compiler:compile {execution: default-compile}]
[INFO] No sources to compile
[INFO] [resources:testResources {execution: default-testResources}]
[INFO] Using 'UTF-8' encoding to copy filtered resources.
[INFO] skip non existing resourceDirectory <https://builds.apache.org/job/Aries/ws/aries/proxy/proxy-bundle/src/test/resources>
[INFO] skip non existing resourceDirectory <https://builds.apache.org/job/Aries/ws/aries/proxy/proxy-bundle/src/test/filtered-resources>
[INFO] Copying 3 resources
[INFO] [compiler:testCompile {execution: default-testCompile}]
[INFO] No sources to compile
[INFO] [surefire:test {execution: default-test}]
[INFO] Surefire report directory: <https://builds.apache.org/job/Aries/ws/aries/proxy/proxy-bundle/target/surefire-reports>

-------------------------------------------------------
 T E S T S
-------------------------------------------------------
There are no tests to run.

Results :

Tests run: 0, Failures: 0, Errors: 0, Skipped: 0

[JENKINS] Recording test results[INFO] [enforcer:enforce {execution: check-java15}]
[INFO] Checking unresolved references to org.codehaus.mojo.signature:java15:1.0

[INFO] [bundle:bundle {execution: default-bundle}]
[WARNING] Warning building bundle org.apache.aries.proxy:org.apache.aries.proxy:bundle:1.0.1-SNAPSHOT
: Split package org/apache/aries/proxy/nls
Use directive -split-package:=(merge-first|merge-last|error|first) on Export/Private Package
instruction to get rid of this warning
Package found in   [Jar:org.apache.aries.proxy.api, Jar:org.apache.aries.proxy.impl]
Reference from     /home/jenkins/jenkins-slave/maven-repositories/0/org/apache/aries/proxy/org.apache.aries.proxy.impl/1.0.0/org.apache.aries.proxy.impl-1.0.0.jar
Classpath          [Jar:., Jar:org.apache.aries.proxy.api, Jar:org.apache.aries.util, Jar:org.apache.aries.proxy.impl,
Jar:org.osgi.core, Jar:org.osgi.compendium, Jar:asm-all, Jar:slf4j-api]
[INFO] [ianal:verify-legal-files {execution: default}]
[INFO] Checking legal files in: org.apache.aries.proxy-1.0.1-SNAPSHOT.jar
[INFO] [install:install {execution: default-install}]
[INFO] Installing <https://builds.apache.org/job/Aries/ws/aries/proxy/proxy-bundle/target/org.apache.aries.proxy-1.0.1-SNAPSHOT.jar>
to /home/jenkins/jenkins-slave/maven-repositories/0/org/apache/aries/proxy/org.apache.aries.proxy/1.0.1-SNAPSHOT/org.apache.aries.proxy-1.0.1-SNAPSHOT.jar
[INFO] [bundle:install {execution: default-install}]
[INFO] Installing org/apache/aries/proxy/org.apache.aries.proxy/1.0.1-SNAPSHOT/org.apache.aries.proxy-1.0.1-SNAPSHOT.jar
[INFO] Writing OBR metadata
[JENKINS] Archiving <https://builds.apache.org/job/Aries/ws/aries/proxy/proxy-bundle/pom.xml>
to /home/hudson/hudson/jobs/Aries/modules/org.apache.aries.proxy$org.apache.aries.proxy/builds/2012-08-14_19-25-58/archive/org.apache.aries.proxy/org.apache.aries.proxy/1.0.1-SNAPSHOT/org.apache.aries.proxy-1.0.1-SNAPSHOT.pom
[JENKINS] Archiving <https://builds.apache.org/job/Aries/ws/aries/proxy/proxy-bundle/target/org.apache.aries.proxy-1.0.1-SNAPSHOT.jar>
to /home/hudson/hudson/jobs/Aries/modules/org.apache.aries.proxy$org.apache.aries.proxy/builds/2012-08-14_19-25-58/archive/org.apache.aries.proxy/org.apache.aries.proxy/1.0.1-SNAPSHOT/org.apache.aries.proxy-1.0.1-SNAPSHOT.jar
[INFO] ------------------------------------------------------------------------
[INFO] Building Apache Aries Proxy iTests
[INFO]    task-segment: [clean, install]
[INFO] ------------------------------------------------------------------------
[INFO] [clean:clean {execution: default-clean}]
[INFO] snapshot org.apache.aries.proxy:org.apache.aries.proxy:1.0.0-SNAPSHOT: checking for
updates from codehaus.snapshots
[INFO] snapshot org.apache.aries.proxy:org.apache.aries.proxy:1.0.0-SNAPSHOT: checking for
updates from EclipseLink Repo
[INFO] snapshot org.apache.aries.proxy:org.apache.aries.proxy:1.0.0-SNAPSHOT: checking for
updates from apache.snapshots
[WARNING] *** CHECKSUM FAILED - Checksum failed on download: local = '94486b3f0fdad8f48bf1c35fc7975168432b9e48';
remote = '<!DOCTYPE' - RETRYING
[WARNING] *** CHECKSUM FAILED - Checksum failed on download: local = '94486b3f0fdad8f48bf1c35fc7975168432b9e48';
remote = '<!DOCTYPE' - IGNORING
[JENKINS] Archiving <https://builds.apache.org/job/Aries/ws/aries/proxy/proxy-itests/pom.xml>
to /home/hudson/hudson/jobs/Aries/modules/org.apache.aries.proxy$org.apache.aries.proxy.itests/builds/2012-08-14_19-25-58/archive/org.apache.aries.proxy/org.apache.aries.proxy.itests/1.0.0-SNAPSHOT/org.apache.aries.proxy.itests-1.0.0-SNAPSHOT.pom
[INFO] ------------------------------------------------------------------------
[ERROR] BUILD ERROR
[INFO] ------------------------------------------------------------------------
[INFO] Error building POM (may not be this project's POM).


Project ID: org.apache.aries.proxy:org.apache.aries.proxy

Reason: Error getting POM for 'org.apache.aries.proxy:org.apache.aries.proxy' from the repository:
Unable to read local copy of metadata: Cannot read metadata from '/home/jenkins/jenkins-slave/maven-repositories/0/org/apache/aries/proxy/org.apache.aries.proxy/1.0.0-SNAPSHOT/maven-metadata-apache.snapshots.xml':
end tag name </body> must match start tag name <hr> from line 7 (position: TEXT
seen ...</address>\n</body>... @9:8) 
  org.apache.aries.proxy:org.apache.aries.proxy:pom:1.0.0-SNAPSHOT


 for project org.apache.aries.proxy:org.apache.aries.proxy


[INFO] ------------------------------------------------------------------------
[INFO] Trace
org.apache.maven.lifecycle.LifecycleExecutionException: Unable to get dependency information:
Unable to read the metadata file for artifact 'org.apache.aries.proxy:org.apache.aries.proxy:jar':
Error getting POM for 'org.apache.aries.proxy:org.apache.aries.proxy' from the repository:
Unable to read local copy of metadata: Cannot read metadata from '/home/jenkins/jenkins-slave/maven-repositories/0/org/apache/aries/proxy/org.apache.aries.proxy/1.0.0-SNAPSHOT/maven-metadata-apache.snapshots.xml':
end tag name </body> must match start tag name <hr> from line 7 (position: TEXT
seen ...</address>\n</body>... @9:8) 
  org.apache.aries.proxy:org.apache.aries.proxy:pom:1.0.0-SNAPSHOT


 for project org.apache.aries.proxy:org.apache.aries.proxy
  org.apache.aries.proxy:org.apache.aries.proxy:jar:1.0.0-SNAPSHOT

from the specified remote repositories:
  apache.snapshots (http://repository.apache.org/snapshots),
  codehaus.snapshots (http://snapshots.repository.codehaus.org),
  central (http://repo1.maven.org/maven2),
  EclipseLink Repo (http://download.eclipse.org/rt/eclipselink/maven.repo/)

Path to dependency: 
	1) org.apache.aries.proxy:org.apache.aries.proxy.itests:jar:1.0.0-SNAPSHOT


	at org.apache.maven.lifecycle.DefaultLifecycleExecutor.executeGoals(DefaultLifecycleExecutor.java:711)
	at org.apache.maven.lifecycle.DefaultLifecycleExecutor.executeGoalWithLifecycle(DefaultLifecycleExecutor.java:556)
	at org.apache.maven.lifecycle.DefaultLifecycleExecutor.executeGoal(DefaultLifecycleExecutor.java:535)
	at org.apache.maven.lifecycle.DefaultLifecycleExecutor.executeGoalAndHandleFailures(DefaultLifecycleExecutor.java:387)
	at org.apache.maven.lifecycle.DefaultLifecycleExecutor.executeTaskSegments(DefaultLifecycleExecutor.java:348)
	at org.apache.maven.lifecycle.DefaultLifecycleExecutor.execute(DefaultLifecycleExecutor.java:180)
	at org.apache.maven.lifecycle.LifecycleExecutorInterceptor.execute(LifecycleExecutorInterceptor.java:65)
	at org.apache.maven.DefaultMaven.doExecute(DefaultMaven.java:328)
	at org.apache.maven.DefaultMaven.execute(DefaultMaven.java:138)
	at org.apache.maven.cli.MavenCli.main(MavenCli.java:362)
	at sun.reflect.NativeMethodAccessorImpl.invoke0(Native Method)
	at sun.reflect.NativeMethodAccessorImpl.invoke(NativeMethodAccessorImpl.java:39)
	at sun.reflect.DelegatingMethodAccessorImpl.invoke(DelegatingMethodAccessorImpl.java:25)
	at java.lang.reflect.Method.invoke(Method.java:597)
	at org.codehaus.classworlds.Launcher.launchEnhanced(Launcher.java:315)
	at org.codehaus.classworlds.Launcher.launch(Launcher.java:255)
	at hudson.maven.agent.Main.launch(Main.java:185)
	at hudson.maven.MavenBuilder.call(MavenBuilder.java:151)
	at hudson.maven.Maven2Builder.call(Maven2Builder.java:77)
	at hudson.maven.Maven2Builder.call(Maven2Builder.java:53)
	at hudson.remoting.UserRequest.perform(UserRequest.java:118)
	at hudson.remoting.UserRequest.perform(UserRequest.java:48)
	at hudson.remoting.Request$2.run(Request.java:326)
	at hudson.remoting.InterceptingExecutorService$1.call(InterceptingExecutorService.java:72)
	at java.util.concurrent.FutureTask$Sync.innerRun(FutureTask.java:303)
	at java.util.concurrent.FutureTask.run(FutureTask.java:138)
	at java.util.concurrent.ThreadPoolExecutor$Worker.runTask(ThreadPoolExecutor.java:886)
	at java.util.concurrent.ThreadPoolExecutor$Worker.run(ThreadPoolExecutor.java:908)
	at java.lang.Thread.run(Thread.java:662)
Caused by: org.apache.maven.artifact.resolver.ArtifactResolutionException: Unable to get dependency
information: Unable to read the metadata file for artifact 'org.apache.aries.proxy:org.apache.aries.proxy:jar':
Error getting POM for 'org.apache.aries.proxy:org.apache.aries.proxy' from the repository:
Unable to read local copy of metadata: Cannot read metadata from '/home/jenkins/jenkins-slave/maven-repositories/0/org/apache/aries/proxy/org.apache.aries.proxy/1.0.0-SNAPSHOT/maven-metadata-apache.snapshots.xml':
end tag name </body> must match start tag name <hr> from line 7 (position: TEXT
seen ...</address>\n</body>... @9:8) 
  org.apache.aries.proxy:org.apache.aries.proxy:pom:1.0.0-SNAPSHOT


 for project org.apache.aries.proxy:org.apache.aries.proxy
  org.apache.aries.proxy:org.apache.aries.proxy:jar:1.0.0-SNAPSHOT

from the specified remote repositories:
  apache.snapshots (http://repository.apache.org/snapshots),
  codehaus.snapshots (http://snapshots.repository.codehaus.org),
  central (http://repo1.maven.org/maven2),
  EclipseLink Repo (http://download.eclipse.org/rt/eclipselink/maven.repo/)

Path to dependency: 
	1) org.apache.aries.proxy:org.apache.aries.proxy.itests:jar:1.0.0-SNAPSHOT


	at org.apache.maven.artifact.resolver.DefaultArtifactCollector.recurse(DefaultArtifactCollector.java:430)
	at org.apache.maven.artifact.resolver.DefaultArtifactCollector.collect(DefaultArtifactCollector.java:74)
	at org.apache.maven.artifact.resolver.DefaultArtifactResolver.resolveTransitively(DefaultArtifactResolver.java:316)
	at org.apache.maven.artifact.resolver.DefaultArtifactResolver.resolveTransitively(DefaultArtifactResolver.java:304)
	at org.apache.maven.plugin.DefaultPluginManager.resolveTransitiveDependencies(DefaultPluginManager.java:1499)
	at org.apache.maven.plugin.DefaultPluginManager.executeMojo(DefaultPluginManager.java:442)
	at hudson.maven.agent.PluginManagerInterceptor.executeMojo(PluginManagerInterceptor.java:182)
	at org.apache.maven.lifecycle.DefaultLifecycleExecutor.executeGoals(DefaultLifecycleExecutor.java:694)
	... 28 more
Caused by: org.apache.maven.artifact.metadata.ArtifactMetadataRetrievalException: Unable to
read the metadata file for artifact 'org.apache.aries.proxy:org.apache.aries.proxy:jar': Error
getting POM for 'org.apache.aries.proxy:org.apache.aries.proxy' from the repository: Unable
to read local copy of metadata: Cannot read metadata from '/home/jenkins/jenkins-slave/maven-repositories/0/org/apache/aries/proxy/org.apache.aries.proxy/1.0.0-SNAPSHOT/maven-metadata-apache.snapshots.xml':
end tag name </body> must match start tag name <hr> from line 7 (position: TEXT
seen ...</address>\n</body>... @9:8) 
  org.apache.aries.proxy:org.apache.aries.proxy:pom:1.0.0-SNAPSHOT


 for project org.apache.aries.proxy:org.apache.aries.proxy
	at org.apache.maven.project.artifact.MavenMetadataSource.retrieveRelocatedProject(MavenMetadataSource.java:200)
	at org.apache.maven.project.artifact.MavenMetadataSource.retrieveRelocatedArtifact(MavenMetadataSource.java:94)
	at org.apache.maven.artifact.resolver.DefaultArtifactCollector.recurse(DefaultArtifactCollector.java:387)
	... 35 more
Caused by: org.apache.maven.project.ProjectBuildingException: Error getting POM for 'org.apache.aries.proxy:org.apache.aries.proxy'
from the repository: Unable to read local copy of metadata: Cannot read metadata from '/home/jenkins/jenkins-slave/maven-repositories/0/org/apache/aries/proxy/org.apache.aries.proxy/1.0.0-SNAPSHOT/maven-metadata-apache.snapshots.xml':
end tag name </body> must match start tag name <hr> from line 7 (position: TEXT
seen ...</address>\n</body>... @9:8) 
  org.apache.aries.proxy:org.apache.aries.proxy:pom:1.0.0-SNAPSHOT


 for project org.apache.aries.proxy:org.apache.aries.proxy
	at org.apache.maven.project.DefaultMavenProjectBuilder.findModelFromRepository(DefaultMavenProjectBuilder.java:592)
	at org.apache.maven.project.DefaultMavenProjectBuilder.buildFromRepository(DefaultMavenProjectBuilder.java:251)
	at org.apache.maven.project.artifact.MavenMetadataSource.retrieveRelocatedProject(MavenMetadataSource.java:163)
	... 37 more
Caused by: org.apache.maven.artifact.resolver.ArtifactResolutionException: Unable to read
local copy of metadata: Cannot read metadata from '/home/jenkins/jenkins-slave/maven-repositories/0/org/apache/aries/proxy/org.apache.aries.proxy/1.0.0-SNAPSHOT/maven-metadata-apache.snapshots.xml':
end tag name </body> must match start tag name <hr> from line 7 (position: TEXT
seen ...</address>\n</body>... @9:8) 
  org.apache.aries.proxy:org.apache.aries.proxy:pom:1.0.0-SNAPSHOT



	at org.apache.maven.artifact.transform.SnapshotTransformation.transformForResolve(SnapshotTransformation.java:68)
	at org.apache.maven.artifact.transform.DefaultArtifactTransformationManager.transformForResolve(DefaultArtifactTransformationManager.java:55)
	at org.apache.maven.artifact.resolver.DefaultArtifactResolver.resolve(DefaultArtifactResolver.java:145)
	at org.apache.maven.artifact.resolver.DefaultArtifactResolver.resolve(DefaultArtifactResolver.java:90)
	at org.apache.maven.project.DefaultMavenProjectBuilder.findModelFromRepository(DefaultMavenProjectBuilder.java:558)
	... 39 more
Caused by: org.apache.maven.artifact.repository.metadata.RepositoryMetadataResolutionException:
Unable to read local copy of metadata: Cannot read metadata from '/home/jenkins/jenkins-slave/maven-repositories/0/org/apache/aries/proxy/org.apache.aries.proxy/1.0.0-SNAPSHOT/maven-metadata-apache.snapshots.xml':
end tag name </body> must match start tag name <hr> from line 7 (position: TEXT
seen ...</address>\n</body>... @9:8) 
	at org.apache.maven.artifact.repository.metadata.DefaultRepositoryMetadataManager.resolve(DefaultRepositoryMetadataManager.java:175)
	at org.apache.maven.artifact.transform.AbstractVersionTransformation.resolveVersion(AbstractVersionTransformation.java:65)
	at org.apache.maven.artifact.transform.SnapshotTransformation.transformForResolve(SnapshotTransformation.java:63)
	... 43 more
Caused by: org.apache.maven.artifact.repository.metadata.RepositoryMetadataReadException:
Cannot read metadata from '/home/jenkins/jenkins-slave/maven-repositories/0/org/apache/aries/proxy/org.apache.aries.proxy/1.0.0-SNAPSHOT/maven-metadata-apache.snapshots.xml':
end tag name </body> must match start tag name <hr> from line 7 (position: TEXT
seen ...</address>\n</body>... @9:8) 
	at org.apache.maven.artifact.repository.metadata.DefaultRepositoryMetadataManager.readMetadata(DefaultRepositoryMetadataManager.java:323)
	at org.apache.maven.artifact.repository.metadata.DefaultRepositoryMetadataManager.loadMetadata(DefaultRepositoryMetadataManager.java:275)
	at org.apache.maven.artifact.repository.metadata.DefaultRepositoryMetadataManager.mergeMetadata(DefaultRepositoryMetadataManager.java:198)
	at org.apache.maven.artifact.repository.metadata.DefaultRepositoryMetadataManager.resolve(DefaultRepositoryMetadataManager.java:166)
	... 45 more
Caused by: org.codehaus.plexus.util.xml.pull.XmlPullParserException: end tag name </body>
must match start tag name <hr> from line 7 (position: TEXT seen ...</address>\n</body>...
@9:8) 
	at hidden.org.codehaus.plexus.util.xml.pull.MXParser.parseEndTag(MXParser.java:1698)
	at hidden.org.codehaus.plexus.util.xml.pull.MXParser.nextImpl(MXParser.java:1143)
	at hidden.org.codehaus.plexus.util.xml.pull.MXParser.next(MXParser.java:1105)
	at org.apache.maven.artifact.repository.metadata.io.xpp3.MetadataXpp3Reader.parseMetadata(MetadataXpp3Reader.java:501)
	at org.apache.maven.artifact.repository.metadata.io.xpp3.MetadataXpp3Reader.read(MetadataXpp3Reader.java:950)
	at org.apache.maven.artifact.repository.metadata.DefaultRepositoryMetadataManager.readMetadata(DefaultRepositoryMetadataManager.java:310)
	... 48 more
[INFO] ------------------------------------------------------------------------
[INFO] Total time: 1 minute 36 seconds
[INFO] Finished at: Tue Aug 14 19:28:05 UTC 2012
[INFO] Final Memory: 131M/475M
[INFO] ------------------------------------------------------------------------
channel stopped

Mime
View raw message