aries-dev mailing list archives

Site index · List index
Message view « Date » · « Thread »
Top « Date » · « Thread »
From Apache Jenkins Server <jenk...@builds.apache.org>
Subject Build failed in Jenkins: Aries #1751
Date Wed, 21 Nov 2012 17:18:16 GMT
See <https://builds.apache.org/job/Aries/1751/changes>

Changes:

[jwross] [ARIES-967] NPE in org.apache.aries.subsystem.core.internal.BundleEventHook.event()
at server shutdown.

Updated the bundle event hook to handle the case where it receives an uninstalled event for
a bundle that is not in its
internal data structure because the hook was not registered when the bundle was installed.

Also fixed another issue where region context bundles of subsystems that failed to install
at certain points were not
being uninstalled.

Added some new tests highlighting unmanaged bundle behavior.

------------------------------------------
[...truncated 11947 lines...]

-------------------------------------------------------
 T E S T S
-------------------------------------------------------
There are no tests to run.

Results :

Tests run: 0, Failures: 0, Errors: 0, Skipped: 0

[JENKINS] Recording test results[INFO] [bundle:bundle {execution: default-bundle}]
[WARNING] Warning building bundle org.apache.aries.subsystem:org.apache.aries.subsystem.api:bundle:1.0.0-SNAPSHOT
: Instructions in Private-Package, or -testpackages that are never used: org\.apache\.aries\.subsystem\.api.*\.impl
Classpath: Jar:.,Jar:org.apache.aries.util,Jar:org.osgi.core

[INFO] [ianal:verify-legal-files {execution: default}]
[INFO] Checking legal files in: org.apache.aries.subsystem.api-1.0.0-SNAPSHOT.jar
[INFO] [install:install {execution: default-install}]
[INFO] Installing <https://builds.apache.org/job/Aries/ws/aries/subsystem/subsystem-api/target/org.apache.aries.subsystem.api-1.0.0-SNAPSHOT.jar>
to /home/hudson/hudson-slave/maven-repositories/0/org/apache/aries/subsystem/org.apache.aries.subsystem.api/1.0.0-SNAPSHOT/org.apache.aries.subsystem.api-1.0.0-SNAPSHOT.jar

[INFO] [bundle:install {execution: default-install}]
[INFO] Installing org/apache/aries/subsystem/org.apache.aries.subsystem.api/1.0.0-SNAPSHOT/org.apache.aries.subsystem.api-1.0.0-SNAPSHOT.jar
[INFO] Writing OBR metadata
[JENKINS] Archiving <https://builds.apache.org/job/Aries/ws/aries/subsystem/subsystem-api/pom.xml>
to /home/hudson/hudson/jobs/Aries/modules/org.apache.aries.subsystem$org.apache.aries.subsystem.api/builds/2012-11-21_16-56-08/archive/org.apache.aries.subsystem/org.apache.aries.subsystem.api/1.0.0-SNAPSHOT/org.apache.aries.subsystem.api-1.0.0-SNAPSHOT.pom
[JENKINS] Archiving <https://builds.apache.org/job/Aries/ws/aries/subsystem/subsystem-api/target/org.apache.aries.subsystem.api-1.0.0-SNAPSHOT.jar>
to /home/hudson/hudson/jobs/Aries/modules/org.apache.aries.subsystem$org.apache.aries.subsystem.api/builds/2012-11-21_16-56-08/archive/org.apache.aries.subsystem/org.apache.aries.subsystem.api/1.0.0-SNAPSHOT/org.apache.aries.subsystem.api-1.0.0-SNAPSHOT.jar
[INFO] ------------------------------------------------------------------------
[INFO] Building Apache Aries Subsystem Core
[INFO]    task-segment: [clean, install]
[INFO] ------------------------------------------------------------------------
[INFO] [clean:clean {execution: default-clean}]
[WARNING] POM for 'org.osgi:org.osgi.enterprise:pom:5.0.0:provided' is invalid.

Its dependencies (if any) will NOT be available to the current build.
[INFO] snapshot org.apache.aries.subsystem:org.apache.aries.subsystem.api:1.0.0-SNAPSHOT:
checking for updates from codehaus.snapshots
[INFO] snapshot org.apache.aries.subsystem:org.apache.aries.subsystem.api:1.0.0-SNAPSHOT:
checking for updates from EclipseLink Repo
[INFO] snapshot org.apache.aries.subsystem:org.apache.aries.subsystem.api:1.0.0-SNAPSHOT:
checking for updates from apache.snapshots
[INFO] [enforcer:enforce {execution: default}]
[INFO] [remote-resources:process {execution: default}]
[WARNING] POM for 'org.osgi:org.osgi.enterprise:pom:5.0.0:provided' is invalid.

Its dependencies (if any) will NOT be available to the current build.
[INFO] [resources:resources {execution: default-resources}]
[INFO] Using 'UTF-8' encoding to copy filtered resources.
[INFO] skip non existing resourceDirectory <https://builds.apache.org/job/Aries/ws/aries/subsystem/subsystem-core/src/main/resources>
[INFO] skip non existing resourceDirectory <https://builds.apache.org/job/Aries/ws/aries/subsystem/subsystem-core/src/main/filtered-resources>
[INFO] Copying 0 resource
[INFO] Copying 3 resources
[INFO] [compiler:compile {execution: default-compile}]
[INFO] Compiling 126 source files to <https://builds.apache.org/job/Aries/ws/aries/subsystem/subsystem-core/target/classes>
[WARNING] <https://builds.apache.org/job/Aries/ws/aries/subsystem/subsystem-core/src/main/java/org/apache/aries/subsystem/core/internal/SubsystemUri.java>:[90,29]
[deprecation] encode(java.lang.String) in java.net.URLEncoder has been deprecated

[INFO] [resources:testResources {execution: default-testResources}]
[INFO] Using 'UTF-8' encoding to copy filtered resources.
[INFO] skip non existing resourceDirectory <https://builds.apache.org/job/Aries/ws/aries/subsystem/subsystem-core/src/test/resources>
[INFO] skip non existing resourceDirectory <https://builds.apache.org/job/Aries/ws/aries/subsystem/subsystem-core/src/test/filtered-resources>
[INFO] Copying 3 resources
[INFO] [compiler:testCompile {execution: default-testCompile}]
[INFO] Compiling 2 source files to <https://builds.apache.org/job/Aries/ws/aries/subsystem/subsystem-core/target/test-classes>
[INFO] [surefire:test {execution: default-test}]
[INFO] Surefire report directory: <https://builds.apache.org/job/Aries/ws/aries/subsystem/subsystem-core/target/surefire-reports>

-------------------------------------------------------
 T E S T S
-------------------------------------------------------
Running org.apache.aries.subsystem.core.archive.ImportPackageHeaderTest
Tests run: 2, Failures: 0, Errors: 0, Skipped: 0, Time elapsed: 0.033 sec
Running org.apache.aries.subsystem.core.internal.LocationTest
Tests run: 1, Failures: 0, Errors: 0, Skipped: 0, Time elapsed: 0.01 sec

Results :

Tests run: 3, Failures: 0, Errors: 0, Skipped: 0

[JENKINS] Recording test results
[INFO] [bundle:bundle {execution: default-bundle}]
[WARNING] Warning building bundle org.apache.aries.subsystem:org.apache.aries.subsystem.core:bundle:1.0.0-SNAPSHOT
: Instructions in Private-Package, or -testpackages that are never used: org\.apache\.aries\.subsystem\.core
Classpath: Jar:.,Jar:org.apache.aries.subsystem.api,Jar:org.apache.aries.util,Jar:org.apache.aries.application.api,Jar:org.apache.aries.application.utils,Jar:org.osgi.core,Jar:org.osgi.enterprise,Jar:org.eclipse.equinox.coordinator,Jar:org.eclipse.equinox.region,Jar:slf4j-api

[INFO] [ianal:verify-legal-files {execution: default}]
[INFO] Checking legal files in: org.apache.aries.subsystem.core-1.0.0-SNAPSHOT.jar
[INFO] [install:install {execution: default-install}]
[INFO] Installing <https://builds.apache.org/job/Aries/ws/aries/subsystem/subsystem-core/target/org.apache.aries.subsystem.core-1.0.0-SNAPSHOT.jar>
to /home/hudson/hudson-slave/maven-repositories/0/org/apache/aries/subsystem/org.apache.aries.subsystem.core/1.0.0-SNAPSHOT/org.apache.aries.subsystem.core-1.0.0-SNAPSHOT.jar
[INFO] [bundle:install {execution: default-install}]
[INFO] Installing org/apache/aries/subsystem/org.apache.aries.subsystem.core/1.0.0-SNAPSHOT/org.apache.aries.subsystem.core-1.0.0-SNAPSHOT.jar
[INFO] Writing OBR metadata
[JENKINS] Archiving <https://builds.apache.org/job/Aries/ws/aries/subsystem/subsystem-core/pom.xml>
to /home/hudson/hudson/jobs/Aries/modules/org.apache.aries.subsystem$org.apache.aries.subsystem.core/builds/2012-11-21_16-56-08/archive/org.apache.aries.subsystem/org.apache.aries.subsystem.core/1.0.0-SNAPSHOT/org.apache.aries.subsystem.core-1.0.0-SNAPSHOT.pom
[JENKINS] Archiving <https://builds.apache.org/job/Aries/ws/aries/subsystem/subsystem-core/target/org.apache.aries.subsystem.core-1.0.0-SNAPSHOT.jar>
to /home/hudson/hudson/jobs/Aries/modules/org.apache.aries.subsystem$org.apache.aries.subsystem.core/builds/2012-11-21_16-56-08/archive/org.apache.aries.subsystem/org.apache.aries.subsystem.core/1.0.0-SNAPSHOT/org.apache.aries.subsystem.core-1.0.0-SNAPSHOT.jar
[INFO] ------------------------------------------------------------------------
[INFO] Building Apache Aries Subsystem iTests interfaces bundle
[INFO]    task-segment: [clean, install]
[INFO] ------------------------------------------------------------------------
[INFO] [clean:clean {execution: default-clean}]
[INFO] [enforcer:enforce {execution: default}]
[INFO] [remote-resources:process {execution: default}]
[INFO] [resources:resources {execution: default-resources}]
[INFO] Using 'UTF-8' encoding to copy filtered resources.
[INFO] skip non existing resourceDirectory <https://builds.apache.org/job/Aries/ws/aries/subsystem/subsystem-itests-api-bundle/src/main/resources>
[INFO] skip non existing resourceDirectory <https://builds.apache.org/job/Aries/ws/aries/subsystem/subsystem-itests-api-bundle/src/main/filtered-resources>
[INFO] Copying 0 resource
[INFO] Copying 3 resources
[INFO] [compiler:compile {execution: default-compile}]
[INFO] Compiling 1 source file to <https://builds.apache.org/job/Aries/ws/aries/subsystem/subsystem-itests-api-bundle/target/classes>
[INFO] [resources:testResources {execution: default-testResources}]
[INFO] Using 'UTF-8' encoding to copy filtered resources.
[INFO] skip non existing resourceDirectory <https://builds.apache.org/job/Aries/ws/aries/subsystem/subsystem-itests-api-bundle/src/test/resources>
[INFO] skip non existing resourceDirectory <https://builds.apache.org/job/Aries/ws/aries/subsystem/subsystem-itests-api-bundle/src/test/filtered-resources>
[INFO] Copying 3 resources
[INFO] [compiler:testCompile {execution: default-testCompile}]
[INFO] No sources to compile
[INFO] [surefire:test {execution: default-test}]
[INFO] Surefire report directory: <https://builds.apache.org/job/Aries/ws/aries/subsystem/subsystem-itests-api-bundle/target/surefire-reports>

-------------------------------------------------------
 T E S T S
-------------------------------------------------------
There are no tests to run.

Results :

Tests run: 0, Failures: 0, Errors: 0, Skipped: 0

[INFO] [bundle:bundle {execution: default-bundle}]
[JENKINS] Recording test results[WARNING] Warning building bundle org.apache.aries.subsystem:org.apache.aries.subsystem.itest.interfaces:bundle:1.0.0-SNAPSHOT
: Did not find matching referal for org.apache.aries.*
[INFO] [ianal:verify-legal-files {execution: default}]
[INFO] Checking legal files in: org.apache.aries.subsystem.itest.interfaces-1.0.0-SNAPSHOT.jar
[INFO] [install:install {execution: default-install}]
[INFO] Installing <https://builds.apache.org/job/Aries/ws/aries/subsystem/subsystem-itests-api-bundle/target/org.apache.aries.subsystem.itest.interfaces-1.0.0-SNAPSHOT.jar>
to /home/hudson/hudson-slave/maven-repositories/0/org/apache/aries/subsystem/org.apache.aries.subsystem.itest.interfaces/1.0.0-SNAPSHOT/org.apache.aries.subsystem.itest.interfaces-1.0.0-SNAPSHOT.jar
[INFO] [bundle:install {execution: default-install}]

[INFO] Installing org/apache/aries/subsystem/org.apache.aries.subsystem.itest.interfaces/1.0.0-SNAPSHOT/org.apache.aries.subsystem.itest.interfaces-1.0.0-SNAPSHOT.jar
[INFO] Writing OBR metadata
[JENKINS] Archiving <https://builds.apache.org/job/Aries/ws/aries/subsystem/subsystem-itests-api-bundle/pom.xml>
to /home/hudson/hudson/jobs/Aries/modules/org.apache.aries.subsystem$org.apache.aries.subsystem.itest.interfaces/builds/2012-11-21_16-56-08/archive/org.apache.aries.subsystem/org.apache.aries.subsystem.itest.interfaces/1.0.0-SNAPSHOT/org.apache.aries.subsystem.itest.interfaces-1.0.0-SNAPSHOT.pom
[JENKINS] Archiving <https://builds.apache.org/job/Aries/ws/aries/subsystem/subsystem-itests-api-bundle/target/org.apache.aries.subsystem.itest.interfaces-1.0.0-SNAPSHOT.jar>
to /home/hudson/hudson/jobs/Aries/modules/org.apache.aries.subsystem$org.apache.aries.subsystem.itest.interfaces/builds/2012-11-21_16-56-08/archive/org.apache.aries.subsystem/org.apache.aries.subsystem.itest.interfaces/1.0.0-SNAPSHOT/org.apache.aries.subsystem.itest.interfaces-1.0.0-SNAPSHOT.jar
[INFO] ------------------------------------------------------------------------
[INFO] Building Apache Aries Subsystem iTests
[INFO]    task-segment: [clean, install]
[INFO] ------------------------------------------------------------------------
[INFO] [clean:clean {execution: default-clean}]
[INFO] snapshot org.apache.felix:org.apache.felix.resolver:0.1.0-SNAPSHOT: checking for updates
from codehaus.snapshots
[INFO] snapshot org.apache.felix:org.apache.felix.resolver:0.1.0-SNAPSHOT: checking for updates
from EclipseLink Repo
[INFO] snapshot org.apache.felix:org.apache.felix.resolver:0.1.0-SNAPSHOT: checking for updates
from apache.snapshots
[INFO] snapshot org.apache.aries.subsystem:org.apache.aries.subsystem.core:1.0.0-SNAPSHOT:
checking for updates from codehaus.snapshots
[INFO] snapshot org.apache.aries.proxy:org.apache.aries.proxy:1.0.1-SNAPSHOT: checking for
updates from codehaus.snapshots
[INFO] snapshot org.apache.aries.subsystem:org.apache.aries.subsystem.core:1.0.0-SNAPSHOT:
checking for updates from EclipseLink Repo
[INFO] snapshot org.apache.aries.proxy:org.apache.aries.proxy:1.0.1-SNAPSHOT: checking for
updates from EclipseLink Repo
[INFO] snapshot org.apache.aries.subsystem:org.apache.aries.subsystem.core:1.0.0-SNAPSHOT:
checking for updates from apache.snapshots
[INFO] snapshot org.apache.aries.proxy:org.apache.aries.proxy:1.0.1-SNAPSHOT: checking for
updates from apache.snapshots
[INFO] snapshot org.apache.aries.subsystem:org.apache.aries.subsystem.itest.interfaces:1.0.0-SNAPSHOT:
checking for updates from codehaus.snapshots
[INFO] snapshot org.apache.aries.subsystem:org.apache.aries.subsystem.itest.interfaces:1.0.0-SNAPSHOT:
checking for updates from EclipseLink Repo
[INFO] snapshot org.apache.aries.subsystem:org.apache.aries.subsystem.itest.interfaces:1.0.0-SNAPSHOT:
checking for updates from apache.snapshots
[INFO] [enforcer:enforce {execution: default}]
[INFO] [build-helper:add-test-source {execution: add-source-tb1}]
[INFO] Test Source directory: <https://builds.apache.org/job/Aries/ws/aries/subsystem/subsystem-itests/src/test/bundles/tb1>
added.
[INFO] [build-helper:add-test-source {execution: add-source-tb2}]
[INFO] Test Source directory: <https://builds.apache.org/job/Aries/ws/aries/subsystem/subsystem-itests/src/test/bundles/tb2>
added.
[INFO] [build-helper:add-test-source {execution: add-source-tb3}]
[INFO] Test Source directory: <https://builds.apache.org/job/Aries/ws/aries/subsystem/subsystem-itests/src/test/bundles/tb3>
added.
[INFO] [build-helper:add-test-source {execution: add-source-helloImpl}]
[INFO] Test Source directory: <https://builds.apache.org/job/Aries/ws/aries/subsystem/subsystem-itests/src/test/bundles/helloImpl>
added.
[INFO] [build-helper:add-test-source {execution: add-source-dynamicImport}]
[INFO] Test Source directory: <https://builds.apache.org/job/Aries/ws/aries/subsystem/subsystem-itests/src/test/bundles/dynamicImport>
added.
[INFO] [build-helper:add-test-source {execution: add-source-blueprint}]
[INFO] Test Source directory: <https://builds.apache.org/job/Aries/ws/aries/subsystem/subsystem-itests/src/test/bundles/blueprint>
added.
[INFO] [remote-resources:process {execution: default}]
[INFO] [paxexam:generate-depends-file {execution: generate-config}]
[INFO] Created: <https://builds.apache.org/job/Aries/ws/aries/subsystem/subsystem-itests/target/test-classes/META-INF/maven/dependencies.properties>
[INFO] [paxexam:generate-config {execution: generate-config}]
[INFO] Adding dependencies in scope provided
[INFO] Generated configuration as Pax Runner arguments file <https://builds.apache.org/job/Aries/ws/aries/subsystem/subsystem-itests/target/test-classes/META-INF/maven/paxexam-config.args>
[INFO] [resources:resources {execution: default-resources}]
[INFO] Using 'UTF-8' encoding to copy filtered resources.
[INFO] skip non existing resourceDirectory <https://builds.apache.org/job/Aries/ws/aries/subsystem/subsystem-itests/src/main/resources>
[INFO] skip non existing resourceDirectory <https://builds.apache.org/job/Aries/ws/aries/subsystem/subsystem-itests/src/main/filtered-resources>
[INFO] skip non existing resourceDirectory <https://builds.apache.org/job/Aries/ws/aries/subsystem/subsystem-itests/src/main/java>
[INFO] Copying 3 resources
[INFO] [compiler:compile {execution: default-compile}]
[INFO] No sources to compile
[INFO] [resources:testResources {execution: default-testResources}]
[INFO] Using 'UTF-8' encoding to copy filtered resources.
[INFO] Copying 28 resources
[INFO] skip non existing resourceDirectory <https://builds.apache.org/job/Aries/ws/aries/subsystem/subsystem-itests/src/test/filtered-resources>
[INFO] Copying 3 resources
[INFO] [compiler:testCompile {execution: default-testCompile}]
[INFO] Compiling 56 source files to <https://builds.apache.org/job/Aries/ws/aries/subsystem/subsystem-itests/target/test-classes>
[INFO] [jar:jar {execution: tb1-application1}]
[INFO] Building jar: <https://builds.apache.org/job/Aries/ws/aries/subsystem/subsystem-itests/target/test-classes/application1/tb1.jar>
[INFO] [jar:jar {execution: tb1-feature1}]
[INFO] Building jar: <https://builds.apache.org/job/Aries/ws/aries/subsystem/subsystem-itests/target/test-classes/feature1/tb1.jar>
[INFO] [jar:jar {execution: tb2-feature2}]
[INFO] Building jar: <https://builds.apache.org/job/Aries/ws/aries/subsystem/subsystem-itests/target/test-classes/feature2/tb2.jar>
[INFO] [jar:jar {execution: tb3-feature1}]
[INFO] Building jar: <https://builds.apache.org/job/Aries/ws/aries/subsystem/subsystem-itests/target/test-classes/feature1/tb3.jar>
[INFO] [jar:jar {execution: tb3-feature2}]
[INFO] Building jar: <https://builds.apache.org/job/Aries/ws/aries/subsystem/subsystem-itests/target/test-classes/feature2/tb3.jar>
[INFO] [jar:jar {execution: tb3-feature3}]
[INFO] Building jar: <https://builds.apache.org/job/Aries/ws/aries/subsystem/subsystem-itests/target/test-classes/feature3/tb3.jar>
[INFO] [jar:jar {execution: hello-impl}]
[INFO] Building jar: <https://builds.apache.org/job/Aries/ws/aries/subsystem/subsystem-itests/target/test-classes/hello/helloImpl.jar>
[INFO] [jar:jar {execution: dynamic-import-impl}]
[INFO] Building jar: <https://builds.apache.org/job/Aries/ws/aries/subsystem/subsystem-itests/target/test-classes/dynamicImport/dynamicImport.jar>
[INFO] [jar:jar {execution: basic-blueprint-application}]
[INFO] Building jar: <https://builds.apache.org/job/Aries/ws/aries/subsystem/subsystem-itests/target/test-classes/blueprint/blueprint.jar>
[INFO] [surefire:test {execution: default-test}]
[INFO] Surefire report directory: <https://builds.apache.org/job/Aries/ws/aries/subsystem/subsystem-itests/target/surefire-reports>
[INFO] ------------------------------------------------------------------------
[ERROR] BUILD FAILURE
[INFO] ------------------------------------------------------------------------
[INFO] <https://builds.apache.org/job/Aries/ws/aries/subsystem/subsystem-itests/pom.xml>
(Too many open files)
[INFO] ------------------------------------------------------------------------
[INFO] Trace
org.apache.maven.BuildFailureException: <https://builds.apache.org/job/Aries/ws/aries/subsystem/subsystem-itests/pom.xml>
(Too many open files)
	at org.apache.maven.lifecycle.LifecycleExecutorInterceptor.execute(LifecycleExecutorInterceptor.java:73)
	at org.apache.maven.DefaultMaven.doExecute(DefaultMaven.java:328)
	at org.apache.maven.DefaultMaven.execute(DefaultMaven.java:138)
	at org.apache.maven.cli.MavenCli.main(MavenCli.java:362)
	at sun.reflect.NativeMethodAccessorImpl.invoke0(Native Method)
	at sun.reflect.NativeMethodAccessorImpl.invoke(NativeMethodAccessorImpl.java:39)
	at sun.reflect.DelegatingMethodAccessorImpl.invoke(DelegatingMethodAccessorImpl.java:25)
	at java.lang.reflect.Method.invoke(Method.java:597)
	at org.codehaus.classworlds.Launcher.launchEnhanced(Launcher.java:315)
	at org.codehaus.classworlds.Launcher.launch(Launcher.java:255)
	at hudson.maven.agent.Main.launch(Main.java:185)
	at hudson.maven.MavenBuilder.call(MavenBuilder.java:151)
	at hudson.maven.Maven2Builder.call(Maven2Builder.java:77)
	at hudson.maven.Maven2Builder.call(Maven2Builder.java:53)
	at hudson.remoting.UserRequest.perform(UserRequest.java:118)
	at hudson.remoting.UserRequest.perform(UserRequest.java:48)
	at hudson.remoting.Request$2.run(Request.java:326)
	at hudson.remoting.InterceptingExecutorService$1.call(InterceptingExecutorService.java:72)
	at java.util.concurrent.FutureTask$Sync.innerRun(FutureTask.java:303)
	at java.util.concurrent.FutureTask.run(FutureTask.java:138)
	at java.util.concurrent.ThreadPoolExecutor$Worker.runTask(ThreadPoolExecutor.java:886)
	at java.util.concurrent.ThreadPoolExecutor$Worker.run(ThreadPoolExecutor.java:908)
	at java.lang.Thread.run(Thread.java:662)
Caused by: java.io.FileNotFoundException: <https://builds.apache.org/job/Aries/ws/aries/subsystem/subsystem-itests/pom.xml>
(Too many open files)
	at java.io.FileInputStream.open(Native Method)
	at java.io.FileInputStream.<init>(FileInputStream.java:120)
	at hudson.maven.reporters.MavenArtifactArchiver.postBuild(MavenArtifactArchiver.java:101)
	at hudson.maven.Maven2Builder.postModule(Maven2Builder.java:127)
	at hudson.maven.MavenBuilder$Adapter.fireLeaveModule(MavenBuilder.java:327)
	at hudson.maven.MavenBuilder$Adapter.postBuild(MavenBuilder.java:285)
	at org.apache.maven.lifecycle.LifecycleExecutorInterceptor.execute(LifecycleExecutorInterceptor.java:68)
	... 22 more
[INFO] ------------------------------------------------------------------------
[INFO] Total time: 21 minutes 20 seconds
[INFO] Finished at: Wed Nov 21 17:18:08 UTC 2012
[INFO] Final Memory: 468M/919M
[INFO] ------------------------------------------------------------------------
Sending e-mails to: dev@aries.apache.org
channel stopped

Mime
View raw message