aries-dev mailing list archives

Site index · List index
Message view « Date » · « Thread »
Top « Date » · « Thread »
From Apache Jenkins Server <jenk...@builds.apache.org>
Subject Build failed in Jenkins: AriesWithSnapshotDependencies #291
Date Wed, 14 Nov 2012 21:11:18 GMT
See <https://builds.apache.org/job/AriesWithSnapshotDependencies/291/changes>

Changes:

[davidb] Fix spurious dependencies on aries 1.0.0-SNAPSHOT components.

------------------------------------------
[...truncated 17311 lines...]
[WARNING] We have a duplicate org/apache/aries/jmx/util/shared/RegistrableStandardEmitterMBean.class
in <https://builds.apache.org/job/AriesWithSnapshotDependencies/ws/.repository/org/apache/aries/jmx/org.apache.aries.jmx.core/1.1.0-SNAPSHOT/org.apache.aries.jmx.core-1.1.0-SNAPSHOT.jar>
[INFO] Replacing original artifact with shaded artifact.
[INFO] Replacing <https://builds.apache.org/job/AriesWithSnapshotDependencies/ws/aries-current-snapshots/jmx/jmx-bundle/target/org.apache.aries.jmx-1.1.0-SNAPSHOT.jar>
with <https://builds.apache.org/job/AriesWithSnapshotDependencies/ws/aries-current-snapshots/jmx/jmx-bundle/target/org.apache.aries.jmx-1.1.0-SNAPSHOT-shaded.jar>
[INFO] [ianal:verify-legal-files {execution: default}]
[INFO] Checking legal files in: org.apache.aries.jmx-1.1.0-SNAPSHOT.jar
[INFO] [install:install {execution: default-install}]
[INFO] Installing <https://builds.apache.org/job/AriesWithSnapshotDependencies/ws/aries-current-snapshots/jmx/jmx-bundle/target/org.apache.aries.jmx-1.1.0-SNAPSHOT.jar>
to <https://builds.apache.org/job/AriesWithSnapshotDependencies/ws/.repository/org/apache/aries/jmx/org.apache.aries.jmx/1.1.0-SNAPSHOT/org.apache.aries.jmx-1.1.0-SNAPSHOT.jar>
[INFO] [bundle:install {execution: default-install}]
[INFO] Installing org/apache/aries/jmx/org.apache.aries.jmx/1.1.0-SNAPSHOT/org.apache.aries.jmx-1.1.0-SNAPSHOT.jar
[INFO] Writing OBR metadata
[INFO] ------------------------------------------------------------------------
[INFO] Building Apache Aries JMX Blueprint Bundle
[INFO]    task-segment: [clean, install]
[INFO] ------------------------------------------------------------------------
[INFO] [clean:clean {execution: default-clean}]
[INFO] snapshot org.apache.aries.jmx:org.apache.aries.jmx.blueprint.core:1.1.0-SNAPSHOT: checking
for updates from codehaus.snapshots
[INFO] snapshot org.apache.aries.jmx:org.apache.aries.jmx.blueprint.core:1.1.0-SNAPSHOT: checking
for updates from EclipseLink Repo
[INFO] snapshot org.apache.aries.jmx:org.apache.aries.jmx.blueprint.core:1.1.0-SNAPSHOT: checking
for updates from apache.snapshots
[INFO] [enforcer:enforce {execution: default}]
[INFO] [remote-resources:process {execution: default}]
[INFO] [resources:resources {execution: default-resources}]
[INFO] Using 'UTF-8' encoding to copy filtered resources.
[INFO] skip non existing resourceDirectory <https://builds.apache.org/job/AriesWithSnapshotDependencies/ws/aries-current-snapshots/jmx/jmx-blueprint-bundle/src/main/resources>
[INFO] skip non existing resourceDirectory <https://builds.apache.org/job/AriesWithSnapshotDependencies/ws/aries-current-snapshots/jmx/jmx-blueprint-bundle/src/main/filtered-resources>
[INFO] skip non existing resourceDirectory <https://builds.apache.org/job/AriesWithSnapshotDependencies/ws/aries-current-snapshots/jmx/jmx-blueprint-bundle/src/main/java>
[INFO] Copying 3 resources
[INFO] [compiler:compile {execution: default-compile}]
[INFO] No sources to compile
[INFO] [resources:testResources {execution: default-testResources}]
[INFO] Using 'UTF-8' encoding to copy filtered resources.
[INFO] skip non existing resourceDirectory <https://builds.apache.org/job/AriesWithSnapshotDependencies/ws/aries-current-snapshots/jmx/jmx-blueprint-bundle/src/test/resources>
[INFO] skip non existing resourceDirectory <https://builds.apache.org/job/AriesWithSnapshotDependencies/ws/aries-current-snapshots/jmx/jmx-blueprint-bundle/src/test/filtered-resources>
[INFO] Copying 3 resources
[INFO] [compiler:testCompile {execution: default-testCompile}]
[INFO] Not compiling test sources
[INFO] [surefire:test {execution: default-test}]
[INFO] Tests are skipped.
[INFO] [enforcer:enforce {execution: check-java15}]
[INFO] Checking unresolved references to org.codehaus.mojo.signature:java15:1.0
[INFO] [bundle:bundle {execution: default-bundle}]
[WARNING] Warning building bundle org.apache.aries.jmx:org.apache.aries.jmx.blueprint:bundle:1.1.0-SNAPSHOT
: Did not find matching referal for !org.apache.aries.jmx*
[INFO] [shade:shade {execution: default}]
[INFO] Including org.apache.aries.jmx:org.apache.aries.jmx.blueprint.api:jar:1.1.0-SNAPSHOT
in the shaded jar.
[INFO] Including org.apache.aries.jmx:org.apache.aries.jmx.blueprint.core:jar:1.1.0-SNAPSHOT
in the shaded jar.
[INFO] Excluding org.apache.aries:org.apache.aries.util:jar:1.0.0 from the shaded jar.
[WARNING] We have a duplicate org/apache/aries/jmx/blueprint/BlueprintMetadataMBean.class
in <https://builds.apache.org/job/AriesWithSnapshotDependencies/ws/.repository/org/apache/aries/jmx/org.apache.aries.jmx.blueprint.api/1.1.0-SNAPSHOT/org.apache.aries.jmx.blueprint.api-1.1.0-SNAPSHOT.jar>
[WARNING] We have a duplicate org/apache/aries/jmx/blueprint/BlueprintStateMBean.class in
<https://builds.apache.org/job/AriesWithSnapshotDependencies/ws/.repository/org/apache/aries/jmx/org.apache.aries.jmx.blueprint.api/1.1.0-SNAPSHOT/org.apache.aries.jmx.blueprint.api-1.1.0-SNAPSHOT.jar>
[WARNING] We have a duplicate org/apache/aries/jmx/blueprint/Item.class in <https://builds.apache.org/job/AriesWithSnapshotDependencies/ws/.repository/org/apache/aries/jmx/org.apache.aries.jmx.blueprint.api/1.1.0-SNAPSHOT/org.apache.aries.jmx.blueprint.api-1.1.0-SNAPSHOT.jar>
[WARNING] We have a duplicate org/apache/aries/jmx/blueprint/JmxConstants.class in <https://builds.apache.org/job/AriesWithSnapshotDependencies/ws/.repository/org/apache/aries/jmx/org.apache.aries.jmx.blueprint.api/1.1.0-SNAPSHOT/org.apache.aries.jmx.blueprint.api-1.1.0-SNAPSHOT.jar>
[WARNING] We have a duplicate org/apache/aries/jmx/blueprint/codec/BPBeanArgument.class in
<https://builds.apache.org/job/AriesWithSnapshotDependencies/ws/.repository/org/apache/aries/jmx/org.apache.aries.jmx.blueprint.core/1.1.0-SNAPSHOT/org.apache.aries.jmx.blueprint.core-1.1.0-SNAPSHOT.jar>
[WARNING] We have a duplicate org/apache/aries/jmx/blueprint/codec/BPBeanMetadata.class in
<https://builds.apache.org/job/AriesWithSnapshotDependencies/ws/.repository/org/apache/aries/jmx/org.apache.aries.jmx.blueprint.core/1.1.0-SNAPSHOT/org.apache.aries.jmx.blueprint.core-1.1.0-SNAPSHOT.jar>
[WARNING] We have a duplicate org/apache/aries/jmx/blueprint/codec/BPBeanProperty.class in
<https://builds.apache.org/job/AriesWithSnapshotDependencies/ws/.repository/org/apache/aries/jmx/org.apache.aries.jmx.blueprint.core/1.1.0-SNAPSHOT/org.apache.aries.jmx.blueprint.core-1.1.0-SNAPSHOT.jar>
[WARNING] We have a duplicate org/apache/aries/jmx/blueprint/codec/BPCollectionMetadata.class
in <https://builds.apache.org/job/AriesWithSnapshotDependencies/ws/.repository/org/apache/aries/jmx/org.apache.aries.jmx.blueprint.core/1.1.0-SNAPSHOT/org.apache.aries.jmx.blueprint.core-1.1.0-SNAPSHOT.jar>
[WARNING] We have a duplicate org/apache/aries/jmx/blueprint/codec/BPComponentMetadata.class
in <https://builds.apache.org/job/AriesWithSnapshotDependencies/ws/.repository/org/apache/aries/jmx/org.apache.aries.jmx.blueprint.core/1.1.0-SNAPSHOT/org.apache.aries.jmx.blueprint.core-1.1.0-SNAPSHOT.jar>
[WARNING] We have a duplicate org/apache/aries/jmx/blueprint/codec/BPIdRefMetadata.class in
<https://builds.apache.org/job/AriesWithSnapshotDependencies/ws/.repository/org/apache/aries/jmx/org.apache.aries.jmx.blueprint.core/1.1.0-SNAPSHOT/org.apache.aries.jmx.blueprint.core-1.1.0-SNAPSHOT.jar>
[WARNING] We have a duplicate org/apache/aries/jmx/blueprint/codec/BPMapEntry.class in <https://builds.apache.org/job/AriesWithSnapshotDependencies/ws/.repository/org/apache/aries/jmx/org.apache.aries.jmx.blueprint.core/1.1.0-SNAPSHOT/org.apache.aries.jmx.blueprint.core-1.1.0-SNAPSHOT.jar>
[WARNING] We have a duplicate org/apache/aries/jmx/blueprint/codec/BPMapMetadata.class in
<https://builds.apache.org/job/AriesWithSnapshotDependencies/ws/.repository/org/apache/aries/jmx/org.apache.aries.jmx.blueprint.core/1.1.0-SNAPSHOT/org.apache.aries.jmx.blueprint.core-1.1.0-SNAPSHOT.jar>
[WARNING] We have a duplicate org/apache/aries/jmx/blueprint/codec/BPMetadata.class in <https://builds.apache.org/job/AriesWithSnapshotDependencies/ws/.repository/org/apache/aries/jmx/org.apache.aries.jmx.blueprint.core/1.1.0-SNAPSHOT/org.apache.aries.jmx.blueprint.core-1.1.0-SNAPSHOT.jar>
[WARNING] We have a duplicate org/apache/aries/jmx/blueprint/codec/BPNonNullMetadata.class
in <https://builds.apache.org/job/AriesWithSnapshotDependencies/ws/.repository/org/apache/aries/jmx/org.apache.aries.jmx.blueprint.core/1.1.0-SNAPSHOT/org.apache.aries.jmx.blueprint.core-1.1.0-SNAPSHOT.jar>
[WARNING] We have a duplicate org/apache/aries/jmx/blueprint/codec/BPNullMetadata.class in
<https://builds.apache.org/job/AriesWithSnapshotDependencies/ws/.repository/org/apache/aries/jmx/org.apache.aries.jmx.blueprint.core/1.1.0-SNAPSHOT/org.apache.aries.jmx.blueprint.core-1.1.0-SNAPSHOT.jar>
[WARNING] We have a duplicate org/apache/aries/jmx/blueprint/codec/BPPropsMetadata.class in
<https://builds.apache.org/job/AriesWithSnapshotDependencies/ws/.repository/org/apache/aries/jmx/org.apache.aries.jmx.blueprint.core/1.1.0-SNAPSHOT/org.apache.aries.jmx.blueprint.core-1.1.0-SNAPSHOT.jar>
[WARNING] We have a duplicate org/apache/aries/jmx/blueprint/codec/BPRefMetadata.class in
<https://builds.apache.org/job/AriesWithSnapshotDependencies/ws/.repository/org/apache/aries/jmx/org.apache.aries.jmx.blueprint.core/1.1.0-SNAPSHOT/org.apache.aries.jmx.blueprint.core-1.1.0-SNAPSHOT.jar>
[WARNING] We have a duplicate org/apache/aries/jmx/blueprint/codec/BPReferenceListMetadata.class
in <https://builds.apache.org/job/AriesWithSnapshotDependencies/ws/.repository/org/apache/aries/jmx/org.apache.aries.jmx.blueprint.core/1.1.0-SNAPSHOT/org.apache.aries.jmx.blueprint.core-1.1.0-SNAPSHOT.jar>
[WARNING] We have a duplicate org/apache/aries/jmx/blueprint/codec/BPReferenceListener.class
in <https://builds.apache.org/job/AriesWithSnapshotDependencies/ws/.repository/org/apache/aries/jmx/org.apache.aries.jmx.blueprint.core/1.1.0-SNAPSHOT/org.apache.aries.jmx.blueprint.core-1.1.0-SNAPSHOT.jar>
[WARNING] We have a duplicate org/apache/aries/jmx/blueprint/codec/BPReferenceMetadata.class
in <https://builds.apache.org/job/AriesWithSnapshotDependencies/ws/.repository/org/apache/aries/jmx/org.apache.aries.jmx.blueprint.core/1.1.0-SNAPSHOT/org.apache.aries.jmx.blueprint.core-1.1.0-SNAPSHOT.jar>
[WARNING] We have a duplicate org/apache/aries/jmx/blueprint/codec/BPRegistrationListener.class
in <https://builds.apache.org/job/AriesWithSnapshotDependencies/ws/.repository/org/apache/aries/jmx/org.apache.aries.jmx.blueprint.core/1.1.0-SNAPSHOT/org.apache.aries.jmx.blueprint.core-1.1.0-SNAPSHOT.jar>
[WARNING] We have a duplicate org/apache/aries/jmx/blueprint/codec/BPServiceMetadata.class
in <https://builds.apache.org/job/AriesWithSnapshotDependencies/ws/.repository/org/apache/aries/jmx/org.apache.aries.jmx.blueprint.core/1.1.0-SNAPSHOT/org.apache.aries.jmx.blueprint.core-1.1.0-SNAPSHOT.jar>
[WARNING] We have a duplicate org/apache/aries/jmx/blueprint/codec/BPServiceReferenceMetadata.class
in <https://builds.apache.org/job/AriesWithSnapshotDependencies/ws/.repository/org/apache/aries/jmx/org.apache.aries.jmx.blueprint.core/1.1.0-SNAPSHOT/org.apache.aries.jmx.blueprint.core-1.1.0-SNAPSHOT.jar>
[WARNING] We have a duplicate org/apache/aries/jmx/blueprint/codec/BPTarget.class in <https://builds.apache.org/job/AriesWithSnapshotDependencies/ws/.repository/org/apache/aries/jmx/org.apache.aries.jmx.blueprint.core/1.1.0-SNAPSHOT/org.apache.aries.jmx.blueprint.core-1.1.0-SNAPSHOT.jar>
[WARNING] We have a duplicate org/apache/aries/jmx/blueprint/codec/BPValueMetadata.class in
<https://builds.apache.org/job/AriesWithSnapshotDependencies/ws/.repository/org/apache/aries/jmx/org.apache.aries.jmx.blueprint.core/1.1.0-SNAPSHOT/org.apache.aries.jmx.blueprint.core-1.1.0-SNAPSHOT.jar>
[WARNING] We have a duplicate org/apache/aries/jmx/blueprint/codec/OSGiBlueprintEvent.class
in <https://builds.apache.org/job/AriesWithSnapshotDependencies/ws/.repository/org/apache/aries/jmx/org.apache.aries.jmx.blueprint.core/1.1.0-SNAPSHOT/org.apache.aries.jmx.blueprint.core-1.1.0-SNAPSHOT.jar>
[WARNING] We have a duplicate org/apache/aries/jmx/blueprint/codec/TransferObject.class in
<https://builds.apache.org/job/AriesWithSnapshotDependencies/ws/.repository/org/apache/aries/jmx/org.apache.aries.jmx.blueprint.core/1.1.0-SNAPSHOT/org.apache.aries.jmx.blueprint.core-1.1.0-SNAPSHOT.jar>
[WARNING] We have a duplicate org/apache/aries/jmx/blueprint/codec/Util.class in <https://builds.apache.org/job/AriesWithSnapshotDependencies/ws/.repository/org/apache/aries/jmx/org.apache.aries.jmx.blueprint.core/1.1.0-SNAPSHOT/org.apache.aries.jmx.blueprint.core-1.1.0-SNAPSHOT.jar>
[WARNING] We have a duplicate org/apache/aries/jmx/blueprint/impl/Activator$1.class in <https://builds.apache.org/job/AriesWithSnapshotDependencies/ws/.repository/org/apache/aries/jmx/org.apache.aries.jmx.blueprint.core/1.1.0-SNAPSHOT/org.apache.aries.jmx.blueprint.core-1.1.0-SNAPSHOT.jar>
[WARNING] We have a duplicate org/apache/aries/jmx/blueprint/impl/Activator$2.class in <https://builds.apache.org/job/AriesWithSnapshotDependencies/ws/.repository/org/apache/aries/jmx/org.apache.aries.jmx.blueprint.core/1.1.0-SNAPSHOT/org.apache.aries.jmx.blueprint.core-1.1.0-SNAPSHOT.jar>
[WARNING] We have a duplicate org/apache/aries/jmx/blueprint/impl/Activator$MBeanServerServiceTracker.class
in <https://builds.apache.org/job/AriesWithSnapshotDependencies/ws/.repository/org/apache/aries/jmx/org.apache.aries.jmx.blueprint.core/1.1.0-SNAPSHOT/org.apache.aries.jmx.blueprint.core-1.1.0-SNAPSHOT.jar>
[WARNING] We have a duplicate org/apache/aries/jmx/blueprint/impl/Activator.class in <https://builds.apache.org/job/AriesWithSnapshotDependencies/ws/.repository/org/apache/aries/jmx/org.apache.aries.jmx.blueprint.core/1.1.0-SNAPSHOT/org.apache.aries.jmx.blueprint.core-1.1.0-SNAPSHOT.jar>
[WARNING] We have a duplicate org/apache/aries/jmx/blueprint/impl/BlueprintMetadata.class
in <https://builds.apache.org/job/AriesWithSnapshotDependencies/ws/.repository/org/apache/aries/jmx/org.apache.aries.jmx.blueprint.core/1.1.0-SNAPSHOT/org.apache.aries.jmx.blueprint.core-1.1.0-SNAPSHOT.jar>
[WARNING] We have a duplicate org/apache/aries/jmx/blueprint/impl/BlueprintState$1.class in
<https://builds.apache.org/job/AriesWithSnapshotDependencies/ws/.repository/org/apache/aries/jmx/org.apache.aries.jmx.blueprint.core/1.1.0-SNAPSHOT/org.apache.aries.jmx.blueprint.core-1.1.0-SNAPSHOT.jar>
[WARNING] We have a duplicate org/apache/aries/jmx/blueprint/impl/BlueprintState$BlueprintStateListener.class
in <https://builds.apache.org/job/AriesWithSnapshotDependencies/ws/.repository/org/apache/aries/jmx/org.apache.aries.jmx.blueprint.core/1.1.0-SNAPSHOT/org.apache.aries.jmx.blueprint.core-1.1.0-SNAPSHOT.jar>
[WARNING] We have a duplicate org/apache/aries/jmx/blueprint/impl/BlueprintState$JMXThreadFactory.class
in <https://builds.apache.org/job/AriesWithSnapshotDependencies/ws/.repository/org/apache/aries/jmx/org.apache.aries.jmx.blueprint.core/1.1.0-SNAPSHOT/org.apache.aries.jmx.blueprint.core-1.1.0-SNAPSHOT.jar>
[WARNING] We have a duplicate org/apache/aries/jmx/blueprint/impl/BlueprintState.class in
<https://builds.apache.org/job/AriesWithSnapshotDependencies/ws/.repository/org/apache/aries/jmx/org.apache.aries.jmx.blueprint.core/1.1.0-SNAPSHOT/org.apache.aries.jmx.blueprint.core-1.1.0-SNAPSHOT.jar>
[WARNING] We have a duplicate org/apache/aries/jmx/blueprint/impl/RegistrableStandardEmitterMBean.class
in <https://builds.apache.org/job/AriesWithSnapshotDependencies/ws/.repository/org/apache/aries/jmx/org.apache.aries.jmx.blueprint.core/1.1.0-SNAPSHOT/org.apache.aries.jmx.blueprint.core-1.1.0-SNAPSHOT.jar>
[INFO] Replacing original artifact with shaded artifact.
[INFO] Replacing <https://builds.apache.org/job/AriesWithSnapshotDependencies/ws/aries-current-snapshots/jmx/jmx-blueprint-bundle/target/org.apache.aries.jmx.blueprint-1.1.0-SNAPSHOT.jar>
with <https://builds.apache.org/job/AriesWithSnapshotDependencies/ws/aries-current-snapshots/jmx/jmx-blueprint-bundle/target/org.apache.aries.jmx.blueprint-1.1.0-SNAPSHOT-shaded.jar>
[INFO] [ianal:verify-legal-files {execution: default}]
[INFO] Checking legal files in: org.apache.aries.jmx.blueprint-1.1.0-SNAPSHOT.jar
[INFO] [install:install {execution: default-install}]
[INFO] Installing <https://builds.apache.org/job/AriesWithSnapshotDependencies/ws/aries-current-snapshots/jmx/jmx-blueprint-bundle/target/org.apache.aries.jmx.blueprint-1.1.0-SNAPSHOT.jar>
to <https://builds.apache.org/job/AriesWithSnapshotDependencies/ws/.repository/org/apache/aries/jmx/org.apache.aries.jmx.blueprint/1.1.0-SNAPSHOT/org.apache.aries.jmx.blueprint-1.1.0-SNAPSHOT.jar>
[INFO] [bundle:install {execution: default-install}]
[INFO] Installing org/apache/aries/jmx/org.apache.aries.jmx.blueprint/1.1.0-SNAPSHOT/org.apache.aries.jmx.blueprint-1.1.0-SNAPSHOT.jar
[INFO] Writing OBR metadata
[INFO] ------------------------------------------------------------------------
[INFO] Building Apache Aries JMX integration tests
[INFO]    task-segment: [clean, install]
[INFO] ------------------------------------------------------------------------
[INFO] [clean:clean {execution: default-clean}]
[INFO] snapshot org.apache.aries.blueprint:org.apache.aries.blueprint:1.0.0-SNAPSHOT: checking
for updates from codehaus.snapshots
[INFO] snapshot org.apache.aries.blueprint:org.apache.aries.blueprint:1.0.0-SNAPSHOT: checking
for updates from EclipseLink Repo
[INFO] snapshot org.apache.aries.blueprint:org.apache.aries.blueprint:1.0.0-SNAPSHOT: checking
for updates from apache.snapshots
Downloading: http://snapshots.repository.codehaus.org/org/apache/aries/blueprint/org.apache.aries.blueprint/1.0.0-SNAPSHOT/org.apache.aries.blueprint-1.0.0-SNAPSHOT.pom
[INFO] Unable to find resource 'org.apache.aries.blueprint:org.apache.aries.blueprint:pom:1.0.0-SNAPSHOT'
in repository codehaus.snapshots (http://snapshots.repository.codehaus.org)
Downloading: http://download.eclipse.org/rt/eclipselink/maven.repo//org/apache/aries/blueprint/org.apache.aries.blueprint/1.0.0-SNAPSHOT/org.apache.aries.blueprint-1.0.0-SNAPSHOT.pom
[INFO] Unable to find resource 'org.apache.aries.blueprint:org.apache.aries.blueprint:pom:1.0.0-SNAPSHOT'
in repository EclipseLink Repo (http://download.eclipse.org/rt/eclipselink/maven.repo/)
Downloading: http://repository.apache.org/snapshots/org/apache/aries/blueprint/org.apache.aries.blueprint/1.0.0-SNAPSHOT/org.apache.aries.blueprint-1.0.0-SNAPSHOT.pom
[INFO] Unable to find resource 'org.apache.aries.blueprint:org.apache.aries.blueprint:pom:1.0.0-SNAPSHOT'
in repository apache.snapshots (http://repository.apache.org/snapshots)
[INFO] snapshot org.apache.aries.jmx:org.apache.aries.jmx:1.1.0-SNAPSHOT: checking for updates
from codehaus.snapshots
Downloading: http://snapshots.repository.codehaus.org/org/apache/aries/blueprint/org.apache.aries.blueprint/1.0.0-SNAPSHOT/org.apache.aries.blueprint-1.0.0-SNAPSHOT.jar
[INFO] Unable to find resource 'org.apache.aries.blueprint:org.apache.aries.blueprint:jar:1.0.0-SNAPSHOT'
in repository codehaus.snapshots (http://snapshots.repository.codehaus.org)
[INFO] snapshot org.apache.aries.jmx:org.apache.aries.jmx:1.1.0-SNAPSHOT: checking for updates
from EclipseLink Repo
Downloading: http://download.eclipse.org/rt/eclipselink/maven.repo//org/apache/aries/blueprint/org.apache.aries.blueprint/1.0.0-SNAPSHOT/org.apache.aries.blueprint-1.0.0-SNAPSHOT.jar
[INFO] Unable to find resource 'org.apache.aries.blueprint:org.apache.aries.blueprint:jar:1.0.0-SNAPSHOT'
in repository EclipseLink Repo (http://download.eclipse.org/rt/eclipselink/maven.repo/)
Downloading: http://repository.apache.org/snapshots/org/apache/aries/blueprint/org.apache.aries.blueprint/1.0.0-SNAPSHOT/org.apache.aries.blueprint-1.0.0-SNAPSHOT.jar
[INFO] snapshot org.apache.aries.jmx:org.apache.aries.jmx:1.1.0-SNAPSHOT: checking for updates
from apache.snapshots
[INFO] Unable to find resource 'org.apache.aries.blueprint:org.apache.aries.blueprint:jar:1.0.0-SNAPSHOT'
in repository apache.snapshots (http://repository.apache.org/snapshots)
[INFO] snapshot org.apache.aries.jmx:org.apache.aries.jmx.blueprint:1.1.0-SNAPSHOT: checking
for updates from codehaus.snapshots
[INFO] snapshot org.apache.aries.jmx:org.apache.aries.jmx.blueprint:1.1.0-SNAPSHOT: checking
for updates from EclipseLink Repo
[INFO] snapshot org.apache.aries.jmx:org.apache.aries.jmx.blueprint:1.1.0-SNAPSHOT: checking
for updates from apache.snapshots
[INFO] snapshot org.apache.aries.jmx:org.apache.aries.jmx.whiteboard:1.1.0-SNAPSHOT: checking
for updates from codehaus.snapshots
[INFO] snapshot org.apache.aries.jmx:org.apache.aries.jmx.whiteboard:1.1.0-SNAPSHOT: checking
for updates from EclipseLink Repo
[INFO] snapshot org.apache.aries.jmx:org.apache.aries.jmx.whiteboard:1.1.0-SNAPSHOT: checking
for updates from apache.snapshots
[INFO] snapshot org.apache.aries.jmx:org.apache.aries.jmx.core.whiteboard:1.1.0-SNAPSHOT:
checking for updates from codehaus.snapshots
[INFO] snapshot org.apache.aries.jmx:org.apache.aries.jmx.core.whiteboard:1.1.0-SNAPSHOT:
checking for updates from EclipseLink Repo
[INFO] snapshot org.apache.aries.jmx:org.apache.aries.jmx.core.whiteboard:1.1.0-SNAPSHOT:
checking for updates from apache.snapshots
[INFO] ------------------------------------------------------------------------
[ERROR] BUILD ERROR
[INFO] ------------------------------------------------------------------------
[INFO] Failed to resolve artifact.

Missing:
----------
1) org.apache.aries.blueprint:org.apache.aries.blueprint:jar:1.0.0-SNAPSHOT

  Try downloading the file manually from the project website.

  Then, install it using the command: 
      mvn install:install-file -DgroupId=org.apache.aries.blueprint -DartifactId=org.apache.aries.blueprint
-Dversion=1.0.0-SNAPSHOT -Dpackaging=jar -Dfile=/path/to/file

  Alternatively, if you host your own repository you can deploy the file there: 
      mvn deploy:deploy-file -DgroupId=org.apache.aries.blueprint -DartifactId=org.apache.aries.blueprint
-Dversion=1.0.0-SNAPSHOT -Dpackaging=jar -Dfile=/path/to/file -Durl=[url] -DrepositoryId=[id]

  Path to dependency: 
  	1) org.apache.aries.jmx:org.apache.aries.jmx.itests:jar:1.1.0-SNAPSHOT
  	2) org.apache.aries.blueprint:org.apache.aries.blueprint:jar:1.0.0-SNAPSHOT

----------
1 required artifact is missing.

for artifact: 
  org.apache.aries.jmx:org.apache.aries.jmx.itests:jar:1.1.0-SNAPSHOT

from the specified remote repositories:
  codehaus.snapshots (http://snapshots.repository.codehaus.org),
  central (http://repo1.maven.org/maven2),
  Nexus (http://repository.apache.org/snapshots),
  EclipseLink Repo (http://download.eclipse.org/rt/eclipselink/maven.repo/)



[INFO] ------------------------------------------------------------------------
[INFO] Trace
org.apache.maven.lifecycle.LifecycleExecutionException: Missing:
----------
1) org.apache.aries.blueprint:org.apache.aries.blueprint:jar:1.0.0-SNAPSHOT

  Try downloading the file manually from the project website.

  Then, install it using the command: 
      mvn install:install-file -DgroupId=org.apache.aries.blueprint -DartifactId=org.apache.aries.blueprint
-Dversion=1.0.0-SNAPSHOT -Dpackaging=jar -Dfile=/path/to/file

  Alternatively, if you host your own repository you can deploy the file there: 
      mvn deploy:deploy-file -DgroupId=org.apache.aries.blueprint -DartifactId=org.apache.aries.blueprint
-Dversion=1.0.0-SNAPSHOT -Dpackaging=jar -Dfile=/path/to/file -Durl=[url] -DrepositoryId=[id]

  Path to dependency: 
  	1) org.apache.aries.jmx:org.apache.aries.jmx.itests:jar:1.1.0-SNAPSHOT
  	2) org.apache.aries.blueprint:org.apache.aries.blueprint:jar:1.0.0-SNAPSHOT

----------
1 required artifact is missing.

for artifact: 
  org.apache.aries.jmx:org.apache.aries.jmx.itests:jar:1.1.0-SNAPSHOT

from the specified remote repositories:
  codehaus.snapshots (http://snapshots.repository.codehaus.org),
  central (http://repo1.maven.org/maven2),
  Nexus (http://repository.apache.org/snapshots),
  EclipseLink Repo (http://download.eclipse.org/rt/eclipselink/maven.repo/)


	at org.apache.maven.lifecycle.DefaultLifecycleExecutor.executeGoals(DefaultLifecycleExecutor.java:711)
	at org.apache.maven.lifecycle.DefaultLifecycleExecutor.executeGoalWithLifecycle(DefaultLifecycleExecutor.java:556)
	at org.apache.maven.lifecycle.DefaultLifecycleExecutor.executeGoal(DefaultLifecycleExecutor.java:535)
	at org.apache.maven.lifecycle.DefaultLifecycleExecutor.executeGoalAndHandleFailures(DefaultLifecycleExecutor.java:387)
	at org.apache.maven.lifecycle.DefaultLifecycleExecutor.executeTaskSegments(DefaultLifecycleExecutor.java:348)
	at org.apache.maven.lifecycle.DefaultLifecycleExecutor.execute(DefaultLifecycleExecutor.java:180)
	at org.apache.maven.DefaultMaven.doExecute(DefaultMaven.java:328)
	at org.apache.maven.DefaultMaven.execute(DefaultMaven.java:138)
	at org.apache.maven.cli.MavenCli.main(MavenCli.java:362)
	at org.apache.maven.cli.compat.CompatibleMain.main(CompatibleMain.java:60)
	at sun.reflect.NativeMethodAccessorImpl.invoke0(Native Method)
	at sun.reflect.NativeMethodAccessorImpl.invoke(NativeMethodAccessorImpl.java:39)
	at sun.reflect.DelegatingMethodAccessorImpl.invoke(DelegatingMethodAccessorImpl.java:25)
	at java.lang.reflect.Method.invoke(Method.java:597)
	at org.codehaus.classworlds.Launcher.launchEnhanced(Launcher.java:315)
	at org.codehaus.classworlds.Launcher.launch(Launcher.java:255)
	at org.codehaus.classworlds.Launcher.mainWithExitCode(Launcher.java:430)
	at org.codehaus.classworlds.Launcher.main(Launcher.java:375)
Caused by: org.apache.maven.artifact.resolver.MultipleArtifactsNotFoundException: Missing:
----------
1) org.apache.aries.blueprint:org.apache.aries.blueprint:jar:1.0.0-SNAPSHOT

  Try downloading the file manually from the project website.

  Then, install it using the command: 
      mvn install:install-file -DgroupId=org.apache.aries.blueprint -DartifactId=org.apache.aries.blueprint
-Dversion=1.0.0-SNAPSHOT -Dpackaging=jar -Dfile=/path/to/file

  Alternatively, if you host your own repository you can deploy the file there: 
      mvn deploy:deploy-file -DgroupId=org.apache.aries.blueprint -DartifactId=org.apache.aries.blueprint
-Dversion=1.0.0-SNAPSHOT -Dpackaging=jar -Dfile=/path/to/file -Durl=[url] -DrepositoryId=[id]

  Path to dependency: 
  	1) org.apache.aries.jmx:org.apache.aries.jmx.itests:jar:1.1.0-SNAPSHOT
  	2) org.apache.aries.blueprint:org.apache.aries.blueprint:jar:1.0.0-SNAPSHOT

----------
1 required artifact is missing.

for artifact: 
  org.apache.aries.jmx:org.apache.aries.jmx.itests:jar:1.1.0-SNAPSHOT

from the specified remote repositories:
  codehaus.snapshots (http://snapshots.repository.codehaus.org),
  central (http://repo1.maven.org/maven2),
  Nexus (http://repository.apache.org/snapshots),
  EclipseLink Repo (http://download.eclipse.org/rt/eclipselink/maven.repo/)


	at org.apache.maven.artifact.resolver.DefaultArtifactResolver.resolveTransitively(DefaultArtifactResolver.java:360)
	at org.apache.maven.artifact.resolver.DefaultArtifactResolver.resolveTransitively(DefaultArtifactResolver.java:304)
	at org.apache.maven.plugin.DefaultPluginManager.resolveTransitiveDependencies(DefaultPluginManager.java:1499)
	at org.apache.maven.plugin.DefaultPluginManager.executeMojo(DefaultPluginManager.java:442)
	at org.apache.maven.lifecycle.DefaultLifecycleExecutor.executeGoals(DefaultLifecycleExecutor.java:694)
	... 17 more
[INFO] ------------------------------------------------------------------------
[INFO] Total time: 8 minutes 10 seconds
[INFO] Finished at: Wed Nov 14 21:11:15 UTC 2012
[INFO] Final Memory: 379M/827M
[INFO] ------------------------------------------------------------------------
Build step 'Invoke top-level Maven targets' marked build as failure

Mime
View raw message