aries-dev mailing list archives

Site index · List index
Message view « Date » · « Thread »
Top « Date » · « Thread »
From Apache Jenkins Server <jenk...@builds.apache.org>
Subject Build failed in Jenkins: AriesWithSnapshotDependencies #348
Date Fri, 01 Feb 2013 18:47:28 GMT
See <https://builds.apache.org/job/AriesWithSnapshotDependencies/348/changes>

Changes:

[dkulp] [ARIES-1013] Fix import version ranges in JMX
Patch from Jean-Baptiste Onofré applied

[dkulp] Update rest of poms to check against latest release

------------------------------------------
[...truncated 50506 lines...]
[JENKINS] Archiving <https://builds.apache.org/job/AriesWithSnapshotDependencies/ws/aries-current-snapshots/spi-fly/spi-fly-examples/spi-fly-example-client2-bundle/pom.xml> to /home/hudson/hudson/jobs/AriesWithSnapshotDependencies/modules/org.apache.aries.spifly.examples$org.apache.aries.spifly.examples.client2.bundle/builds/2013-02-01_18-00-58/archive/org.apache.aries.spifly.examples/org.apache.aries.spifly.examples.client2.bundle/1.0.0-SNAPSHOT/org.apache.aries.spifly.examples.client2.bundle-1.0.0-SNAPSHOT.pom
[JENKINS] Archiving <https://builds.apache.org/job/AriesWithSnapshotDependencies/ws/aries-current-snapshots/subsystem/subsystem-api/pom.xml> to /home/hudson/hudson/jobs/AriesWithSnapshotDependencies/modules/org.apache.aries.subsystem$org.apache.aries.subsystem.api/builds/2013-02-01_18-00-56/archive/org.apache.aries.subsystem/org.apache.aries.subsystem.api/1.0.0-SNAPSHOT/org.apache.aries.subsystem.api-1.0.0-SNAPSHOT.pom
[JENKINS] Archiving <https://builds.apache.org/job/AriesWithSnapshotDependencies/ws/aries-current-snapshots/subsystem/subsystem-api/target/org.apache.aries.subsystem.api-1.0.0-SNAPSHOT.jar> to /home/hudson/hudson/jobs/AriesWithSnapshotDependencies/modules/org.apache.aries.subsystem$org.apache.aries.subsystem.api/builds/2013-02-01_18-00-56/archive/org.apache.aries.subsystem/org.apache.aries.subsystem.api/1.0.0-SNAPSHOT/org.apache.aries.subsystem.api-1.0.0-SNAPSHOT.jar
[JENKINS] Archiving <https://builds.apache.org/job/AriesWithSnapshotDependencies/ws/aries-current-snapshots/jndi/jndi-rmi/pom.xml> to /home/hudson/hudson/jobs/AriesWithSnapshotDependencies/modules/org.apache.aries.jndi$org.apache.aries.jndi.rmi/builds/2013-02-01_18-00-53/archive/org.apache.aries.jndi/org.apache.aries.jndi.rmi/1.0.1-SNAPSHOT/org.apache.aries.jndi.rmi-1.0.1-SNAPSHOT.pom
[JENKINS] Archiving <https://builds.apache.org/job/AriesWithSnapshotDependencies/ws/aries-current-snapshots/jndi/jndi-rmi/target/org.apache.aries.jndi.rmi-1.0.1-SNAPSHOT.jar> to /home/hudson/hudson/jobs/AriesWithSnapshotDependencies/modules/org.apache.aries.jndi$org.apache.aries.jndi.rmi/builds/2013-02-01_18-00-53/archive/org.apache.aries.jndi/org.apache.aries.jndi.rmi/1.0.1-SNAPSHOT/org.apache.aries.jndi.rmi-1.0.1-SNAPSHOT.jar
[JENKINS] Archiving <https://builds.apache.org/job/AriesWithSnapshotDependencies/ws/aries-current-snapshots/samples/blog/blog-datasource/pom.xml> to /home/hudson/hudson/jobs/AriesWithSnapshotDependencies/modules/org.apache.aries.samples.blog$org.apache.aries.samples.blog.datasource/builds/2013-02-01_18-00-59/archive/org.apache.aries.samples.blog/org.apache.aries.samples.blog.datasource/1.0.1-SNAPSHOT/org.apache.aries.samples.blog.datasource-1.0.1-SNAPSHOT.pom
[JENKINS] Archiving <https://builds.apache.org/job/AriesWithSnapshotDependencies/ws/aries-current-snapshots/samples/blueprint/pom.xml> to /home/hudson/hudson/jobs/AriesWithSnapshotDependencies/modules/org.apache.aries.samples$blueprint/builds/2013-02-01_18-01-00/archive/org.apache.aries.samples/blueprint/1.0.1-SNAPSHOT/blueprint-1.0.1-SNAPSHOT.pom
[JENKINS] Archiving <https://builds.apache.org/job/AriesWithSnapshotDependencies/ws/aries-current-snapshots/application/application-obr-resolver/pom.xml> to /home/hudson/hudson/jobs/AriesWithSnapshotDependencies/modules/org.apache.aries.application$org.apache.aries.application.resolver.obr/builds/2013-02-01_18-00-55/archive/org.apache.aries.application/org.apache.aries.application.resolver.obr/1.0.1-SNAPSHOT/org.apache.aries.application.resolver.obr-1.0.1-SNAPSHOT.pom
[JENKINS] Archiving <https://builds.apache.org/job/AriesWithSnapshotDependencies/ws/aries-current-snapshots/application/application-obr-resolver/target/org.apache.aries.application.resolver.obr-1.0.1-SNAPSHOT.jar> to /home/hudson/hudson/jobs/AriesWithSnapshotDependencies/modules/org.apache.aries.application$org.apache.aries.application.resolver.obr/builds/2013-02-01_18-00-55/archive/org.apache.aries.application/org.apache.aries.application.resolver.obr/1.0.1-SNAPSHOT/org.apache.aries.application.resolver.obr-1.0.1-SNAPSHOT.jar
[JENKINS] Archiving <https://builds.apache.org/job/AriesWithSnapshotDependencies/ws/aries-current-snapshots/blueprint/blueprint-compatibility/pom.xml> to /home/hudson/hudson/jobs/AriesWithSnapshotDependencies/modules/org.apache.aries.blueprint$org.apache.aries.blueprint.compatibility/builds/2013-02-01_18-00-51/archive/org.apache.aries.blueprint/org.apache.aries.blueprint.compatibility/1.0.1-SNAPSHOT/org.apache.aries.blueprint.compatibility-1.0.1-SNAPSHOT.pom
[JENKINS] Archiving <https://builds.apache.org/job/AriesWithSnapshotDependencies/ws/aries-current-snapshots/blueprint/blueprint-compatibility/target/org.apache.aries.blueprint.compatibility-1.0.1-SNAPSHOT.jar> to /home/hudson/hudson/jobs/AriesWithSnapshotDependencies/modules/org.apache.aries.blueprint$org.apache.aries.blueprint.compatibility/builds/2013-02-01_18-00-51/archive/org.apache.aries.blueprint/org.apache.aries.blueprint.compatibility/1.0.1-SNAPSHOT/org.apache.aries.blueprint.compatibility-1.0.1-SNAPSHOT.jar
[JENKINS] Archiving <https://builds.apache.org/job/AriesWithSnapshotDependencies/ws/aries-current-snapshots/application/application-runtime-framework/pom.xml> to /home/hudson/hudson/jobs/AriesWithSnapshotDependencies/modules/org.apache.aries.application$org.apache.aries.application.runtime.framework/builds/2013-02-01_18-00-55/archive/org.apache.aries.application/org.apache.aries.application.runtime.framework/1.0.1-SNAPSHOT/org.apache.aries.application.runtime.framework-1.0.1-SNAPSHOT.pom
[JENKINS] Archiving <https://builds.apache.org/job/AriesWithSnapshotDependencies/ws/aries-current-snapshots/application/application-runtime-framework/target/org.apache.aries.application.runtime.framework-1.0.1-SNAPSHOT.jar> to /home/hudson/hudson/jobs/AriesWithSnapshotDependencies/modules/org.apache.aries.application$org.apache.aries.application.runtime.framework/builds/2013-02-01_18-00-55/archive/org.apache.aries.application/org.apache.aries.application.runtime.framework/1.0.1-SNAPSHOT/org.apache.aries.application.runtime.framework-1.0.1-SNAPSHOT.jar
[JENKINS] Archiving <https://builds.apache.org/job/AriesWithSnapshotDependencies/ws/aries-current-snapshots/transaction/transaction-blueprint/pom.xml> to /home/hudson/hudson/jobs/AriesWithSnapshotDependencies/modules/org.apache.aries.transaction$org.apache.aries.transaction.blueprint/builds/2013-02-01_18-00-53/archive/org.apache.aries.transaction/org.apache.aries.transaction.blueprint/1.0.2-SNAPSHOT/org.apache.aries.transaction.blueprint-1.0.2-SNAPSHOT.pom
[JENKINS] Archiving <https://builds.apache.org/job/AriesWithSnapshotDependencies/ws/aries-current-snapshots/transaction/transaction-blueprint/target/org.apache.aries.transaction.blueprint-1.0.2-SNAPSHOT.jar> to /home/hudson/hudson/jobs/AriesWithSnapshotDependencies/modules/org.apache.aries.transaction$org.apache.aries.transaction.blueprint/builds/2013-02-01_18-00-53/archive/org.apache.aries.transaction/org.apache.aries.transaction.blueprint/1.0.2-SNAPSHOT/org.apache.aries.transaction.blueprint-1.0.2-SNAPSHOT.jar
[JENKINS] Archiving <https://builds.apache.org/job/AriesWithSnapshotDependencies/ws/aries-current-snapshots/jmx/jmx-core/pom.xml> to /home/hudson/hudson/jobs/AriesWithSnapshotDependencies/modules/org.apache.aries.jmx$org.apache.aries.jmx.core/builds/2013-02-01_18-00-56/archive/org.apache.aries.jmx/org.apache.aries.jmx.core/1.1.1-SNAPSHOT/org.apache.aries.jmx.core-1.1.1-SNAPSHOT.pom
[JENKINS] Archiving <https://builds.apache.org/job/AriesWithSnapshotDependencies/ws/aries-current-snapshots/jmx/jmx-core/target/org.apache.aries.jmx.core-1.1.1-SNAPSHOT.jar> to /home/hudson/hudson/jobs/AriesWithSnapshotDependencies/modules/org.apache.aries.jmx$org.apache.aries.jmx.core/builds/2013-02-01_18-00-56/archive/org.apache.aries.jmx/org.apache.aries.jmx.core/1.1.1-SNAPSHOT/org.apache.aries.jmx.core-1.1.1-SNAPSHOT.jar
[JENKINS] Archiving <https://builds.apache.org/job/AriesWithSnapshotDependencies/ws/aries-current-snapshots/jmx/pom.xml> to /home/hudson/hudson/jobs/AriesWithSnapshotDependencies/modules/org.apache.aries.jmx$jmx/builds/2013-02-01_18-00-56/archive/org.apache.aries.jmx/jmx/1.1.0-SNAPSHOT/jmx-1.1.0-SNAPSHOT.pom
[JENKINS] Archiving <https://builds.apache.org/job/AriesWithSnapshotDependencies/ws/aries-current-snapshots/spi-fly/spi-fly-examples/spi-fly-example-provider1-jar/pom.xml> to /home/hudson/hudson/jobs/AriesWithSnapshotDependencies/modules/org.apache.aries.spifly.examples$org.apache.aries.spifly.examples.provider1.jar/builds/2013-02-01_18-00-58/archive/org.apache.aries.spifly.examples/org.apache.aries.spifly.examples.provider1.jar/1.0.0-SNAPSHOT/org.apache.aries.spifly.examples.provider1.jar-1.0.0-SNAPSHOT.pom
[JENKINS] Archiving <https://builds.apache.org/job/AriesWithSnapshotDependencies/ws/aries-current-snapshots/blueprint/blueprint-cm/pom.xml> to /home/hudson/hudson/jobs/AriesWithSnapshotDependencies/modules/org.apache.aries.blueprint$org.apache.aries.blueprint.cm/builds/2013-02-01_18-00-51/archive/org.apache.aries.blueprint/org.apache.aries.blueprint.cm/1.0.2-SNAPSHOT/org.apache.aries.blueprint.cm-1.0.2-SNAPSHOT.pom
[JENKINS] Archiving <https://builds.apache.org/job/AriesWithSnapshotDependencies/ws/aries-current-snapshots/blueprint/blueprint-cm/target/org.apache.aries.blueprint.cm-1.0.2-SNAPSHOT.jar> to /home/hudson/hudson/jobs/AriesWithSnapshotDependencies/modules/org.apache.aries.blueprint$org.apache.aries.blueprint.cm/builds/2013-02-01_18-00-51/archive/org.apache.aries.blueprint/org.apache.aries.blueprint.cm/1.0.2-SNAPSHOT/org.apache.aries.blueprint.cm-1.0.2-SNAPSHOT.jar
[JENKINS] Archiving <https://builds.apache.org/job/AriesWithSnapshotDependencies/ws/aries-current-snapshots/samples/blog/blog-itests/pom.xml> to /home/hudson/hudson/jobs/AriesWithSnapshotDependencies/modules/org.apache.aries.samples.blog$org.apache.aries.samples.blog.itests/builds/2013-02-01_18-00-59/archive/org.apache.aries.samples.blog/org.apache.aries.samples.blog.itests/1.0.1-SNAPSHOT/org.apache.aries.samples.blog.itests-1.0.1-SNAPSHOT.pom
[JENKINS] Archiving <https://builds.apache.org/job/AriesWithSnapshotDependencies/ws/aries-current-snapshots/samples/ariestrader/modules/ariestrader-web/pom.xml> to /home/hudson/hudson/jobs/AriesWithSnapshotDependencies/modules/org.apache.aries.samples.ariestrader$org.apache.aries.samples.ariestrader.web/builds/2013-02-01_18-01-00/archive/org.apache.aries.samples.ariestrader/org.apache.aries.samples.ariestrader.web/1.0.1-SNAPSHOT/org.apache.aries.samples.ariestrader.web-1.0.1-SNAPSHOT.pom
[JENKINS] Archiving <https://builds.apache.org/job/AriesWithSnapshotDependencies/ws/aries-current-snapshots/ejb/ejb-modeller/pom.xml> to /home/hudson/hudson/jobs/AriesWithSnapshotDependencies/modules/org.apache.aries.ejb$org.apache.aries.ejb.modeller/builds/2013-02-01_18-00-56/archive/org.apache.aries.ejb/org.apache.aries.ejb.modeller/1.0.1-SNAPSHOT/org.apache.aries.ejb.modeller-1.0.1-SNAPSHOT.pom
[JENKINS] Archiving <https://builds.apache.org/job/AriesWithSnapshotDependencies/ws/aries-current-snapshots/ejb/ejb-modeller/target/org.apache.aries.ejb.modeller-1.0.1-SNAPSHOT.jar> to /home/hudson/hudson/jobs/AriesWithSnapshotDependencies/modules/org.apache.aries.ejb$org.apache.aries.ejb.modeller/builds/2013-02-01_18-00-56/archive/org.apache.aries.ejb/org.apache.aries.ejb.modeller/1.0.1-SNAPSHOT/org.apache.aries.ejb.modeller-1.0.1-SNAPSHOT.jar
[JENKINS] Archiving <https://builds.apache.org/job/AriesWithSnapshotDependencies/ws/aries-current-snapshots/samples/twitter/pom.xml> to /home/hudson/hudson/jobs/AriesWithSnapshotDependencies/modules/org.apache.aries.samples.twitter$twitter/builds/2013-02-01_18-01-01/archive/org.apache.aries.samples.twitter/twitter/1.0.1-SNAPSHOT/twitter-1.0.1-SNAPSHOT.pom
[JENKINS] Archiving <https://builds.apache.org/job/AriesWithSnapshotDependencies/ws/aries-current-snapshots/transaction/transaction-testbundle/pom.xml> to /home/hudson/hudson/jobs/AriesWithSnapshotDependencies/modules/org.apache.aries.transaction$org.apache.aries.transaction.testbundle/builds/2013-02-01_18-00-54/archive/org.apache.aries.transaction/org.apache.aries.transaction.testbundle/1.0.1-SNAPSHOT/org.apache.aries.transaction.testbundle-1.0.1-SNAPSHOT.pom
[JENKINS] Archiving <https://builds.apache.org/job/AriesWithSnapshotDependencies/ws/aries-current-snapshots/transaction/transaction-testbundle/target/org.apache.aries.transaction.testbundle-1.0.1-SNAPSHOT.jar> to /home/hudson/hudson/jobs/AriesWithSnapshotDependencies/modules/org.apache.aries.transaction$org.apache.aries.transaction.testbundle/builds/2013-02-01_18-00-54/archive/org.apache.aries.transaction/org.apache.aries.transaction.testbundle/1.0.1-SNAPSHOT/org.apache.aries.transaction.testbundle-1.0.1-SNAPSHOT.jar
[JENKINS] Archiving <https://builds.apache.org/job/AriesWithSnapshotDependencies/ws/aries-current-snapshots/spi-fly/spi-fly-dynamic-bundle/pom.xml> to /home/hudson/hudson/jobs/AriesWithSnapshotDependencies/modules/org.apache.aries.spifly$org.apache.aries.spifly.dynamic.bundle/builds/2013-02-01_18-00-58/archive/org.apache.aries.spifly/org.apache.aries.spifly.dynamic.bundle/1.0.0-SNAPSHOT/org.apache.aries.spifly.dynamic.bundle-1.0.0-SNAPSHOT.pom
[JENKINS] Archiving <https://builds.apache.org/job/AriesWithSnapshotDependencies/ws/aries-current-snapshots/web/pom.xml> to /home/hudson/hudson/jobs/AriesWithSnapshotDependencies/modules/org.apache.aries.web$web/builds/2013-02-01_18-00-54/archive/org.apache.aries.web/web/1.0.0-SNAPSHOT/web-1.0.0-SNAPSHOT.pom
[JENKINS] Archiving <https://builds.apache.org/job/AriesWithSnapshotDependencies/ws/aries-current-snapshots/blueprint/blueprint-jexl-evaluator/pom.xml> to /home/hudson/hudson/jobs/AriesWithSnapshotDependencies/modules/org.apache.aries.blueprint$org.apache.aries.blueprint.jexl.evaluator/builds/2013-02-01_18-00-52/archive/org.apache.aries.blueprint/org.apache.aries.blueprint.jexl.evaluator/1.0.1-SNAPSHOT/org.apache.aries.blueprint.jexl.evaluator-1.0.1-SNAPSHOT.pom
[JENKINS] Archiving <https://builds.apache.org/job/AriesWithSnapshotDependencies/ws/aries-current-snapshots/blueprint/blueprint-jexl-evaluator/target/org.apache.aries.blueprint.jexl.evaluator-1.0.1-SNAPSHOT.jar> to /home/hudson/hudson/jobs/AriesWithSnapshotDependencies/modules/org.apache.aries.blueprint$org.apache.aries.blueprint.jexl.evaluator/builds/2013-02-01_18-00-52/archive/org.apache.aries.blueprint/org.apache.aries.blueprint.jexl.evaluator/1.0.1-SNAPSHOT/org.apache.aries.blueprint.jexl.evaluator-1.0.1-SNAPSHOT.jar
[JENKINS] Archiving <https://builds.apache.org/job/AriesWithSnapshotDependencies/ws/aries-current-snapshots/versioning/versioning-plugin/pom.xml> to /home/hudson/hudson/jobs/AriesWithSnapshotDependencies/modules/org.apache.aries.versioning$org.apache.aries.versioning.plugin/builds/2013-02-01_18-00-50/archive/org.apache.aries.versioning/org.apache.aries.versioning.plugin/0.2.0-SNAPSHOT/org.apache.aries.versioning.plugin-0.2.0-SNAPSHOT.pom
[JENKINS] Archiving <https://builds.apache.org/job/AriesWithSnapshotDependencies/ws/aries-current-snapshots/versioning/versioning-plugin/target/org.apache.aries.versioning.plugin-0.2.0-SNAPSHOT.jar> to /home/hudson/hudson/jobs/AriesWithSnapshotDependencies/modules/org.apache.aries.versioning$org.apache.aries.versioning.plugin/builds/2013-02-01_18-00-50/archive/org.apache.aries.versioning/org.apache.aries.versioning.plugin/0.2.0-SNAPSHOT/org.apache.aries.versioning.plugin-0.2.0-SNAPSHOT.jar
[JENKINS] Archiving <https://builds.apache.org/job/AriesWithSnapshotDependencies/ws/aries-current-snapshots/application/application-distro/pom.xml> to /home/hudson/hudson/jobs/AriesWithSnapshotDependencies/modules/org.apache.aries.application$org.apache.aries.application-distro/builds/2013-02-01_18-00-55/archive/org.apache.aries.application/org.apache.aries.application-distro/1.0.0-SNAPSHOT/org.apache.aries.application-distro-1.0.0-SNAPSHOT.pom
[JENKINS] Archiving <https://builds.apache.org/job/AriesWithSnapshotDependencies/ws/aries-current-snapshots/application/application-distro/target/org.apache.aries.application-distro-1.0.0-SNAPSHOT.zip> to /home/hudson/hudson/jobs/AriesWithSnapshotDependencies/modules/org.apache.aries.application$org.apache.aries.application-distro/builds/2013-02-01_18-00-55/archive/org.apache.aries.application/org.apache.aries.application-distro/1.0.0-SNAPSHOT/org.apache.aries.application-distro-1.0.0-SNAPSHOT.zip
[JENKINS] Archiving <https://builds.apache.org/job/AriesWithSnapshotDependencies/ws/aries-current-snapshots/samples/twitter/twitter-eba/pom.xml> to /home/hudson/hudson/jobs/AriesWithSnapshotDependencies/modules/org.apache.aries.samples.twitter$org.apache.aries.samples.twitter.eba/builds/2013-02-01_18-01-01/archive/org.apache.aries.samples.twitter/org.apache.aries.samples.twitter.eba/1.0.1-SNAPSHOT/org.apache.aries.samples.twitter.eba-1.0.1-SNAPSHOT.pom
[JENKINS] Archiving <https://builds.apache.org/job/AriesWithSnapshotDependencies/ws/aries-current-snapshots/samples/blueprint/helloworld/helloworld-assembly/pom.xml> to /home/hudson/hudson/jobs/AriesWithSnapshotDependencies/modules/org.apache.aries.samples.blueprint.helloworld$org.apache.aries.samples.blueprint.helloworld.assembly/builds/2013-02-01_18-01-01/archive/org.apache.aries.samples.blueprint.helloworld/org.apache.aries.samples.blueprint.helloworld.assembly/1.0.1-SNAPSHOT/org.apache.aries.samples.blueprint.helloworld.assembly-1.0.1-SNAPSHOT.pom
[JENKINS] Archiving <https://builds.apache.org/job/AriesWithSnapshotDependencies/ws/aries-current-snapshots/blueprint/blueprint-parser/pom.xml> to /home/hudson/hudson/jobs/AriesWithSnapshotDependencies/modules/org.apache.aries.blueprint$blueprint-parser/builds/2013-02-01_18-00-51/archive/org.apache.aries.blueprint/blueprint-parser/1.0.1-SNAPSHOT/blueprint-parser-1.0.1-SNAPSHOT.pom
[JENKINS] Archiving <https://builds.apache.org/job/AriesWithSnapshotDependencies/ws/aries-current-snapshots/blueprint/blueprint-parser/target/blueprint-parser-1.0.1-SNAPSHOT.jar> to /home/hudson/hudson/jobs/AriesWithSnapshotDependencies/modules/org.apache.aries.blueprint$blueprint-parser/builds/2013-02-01_18-00-51/archive/org.apache.aries.blueprint/blueprint-parser/1.0.1-SNAPSHOT/blueprint-parser-1.0.1-SNAPSHOT.jar
[JENKINS] Archiving <https://builds.apache.org/job/AriesWithSnapshotDependencies/ws/aries-current-snapshots/spi-fly/spi-fly-examples/spi-fly-example-client1-bundle/pom.xml> to /home/hudson/hudson/jobs/AriesWithSnapshotDependencies/modules/org.apache.aries.spifly.examples$org.apache.aries.spifly.examples.client1.bundle/builds/2013-02-01_18-00-58/archive/org.apache.aries.spifly.examples/org.apache.aries.spifly.examples.client1.bundle/1.0.0-SNAPSHOT/org.apache.aries.spifly.examples.client1.bundle-1.0.0-SNAPSHOT.pom
[JENKINS] Archiving <https://builds.apache.org/job/AriesWithSnapshotDependencies/ws/aries-current-snapshots/application/application-tooling-repository-generator/pom.xml> to /home/hudson/hudson/jobs/AriesWithSnapshotDependencies/modules/org.apache.aries.application$org.apache.aries.application.tooling.repository.generator/builds/2013-02-01_18-00-55/archive/org.apache.aries.application/org.apache.aries.application.tooling.repository.generator/1.0.1-SNAPSHOT/org.apache.aries.application.tooling.repository.generator-1.0.1-SNAPSHOT.pom
[JENKINS] Archiving <https://builds.apache.org/job/AriesWithSnapshotDependencies/ws/aries-current-snapshots/application/application-tooling-repository-generator/target/org.apache.aries.application.tooling.repository.generator-1.0.1-SNAPSHOT.jar> to /home/hudson/hudson/jobs/AriesWithSnapshotDependencies/modules/org.apache.aries.application$org.apache.aries.application.tooling.repository.generator/builds/2013-02-01_18-00-55/archive/org.apache.aries.application/org.apache.aries.application.tooling.repository.generator/1.0.1-SNAPSHOT/org.apache.aries.application.tooling.repository.generator-1.0.1-SNAPSHOT.jar
[JENKINS] Archiving <https://builds.apache.org/job/AriesWithSnapshotDependencies/ws/aries-current-snapshots/application/application-tooling-repository-generator/target/org.apache.aries.application.tooling.repository.generator-1.0.1-SNAPSHOT-bin.zip> to /home/hudson/hudson/jobs/AriesWithSnapshotDependencies/modules/org.apache.aries.application$org.apache.aries.application.tooling.repository.generator/builds/2013-02-01_18-00-55/archive/org.apache.aries.application/org.apache.aries.application.tooling.repository.generator/1.0.1-SNAPSHOT/org.apache.aries.application.tooling.repository.generator-1.0.1-SNAPSHOT-bin.zip
[JENKINS] Archiving <https://builds.apache.org/job/AriesWithSnapshotDependencies/ws/aries-current-snapshots/jmx/jmx-itests/pom.xml> to /home/hudson/hudson/jobs/AriesWithSnapshotDependencies/modules/org.apache.aries.jmx$org.apache.aries.jmx.itests/builds/2013-02-01_18-00-57/archive/org.apache.aries.jmx/org.apache.aries.jmx.itests/1.1.0-SNAPSHOT/org.apache.aries.jmx.itests-1.1.0-SNAPSHOT.pom
[JENKINS] Archiving <https://builds.apache.org/job/AriesWithSnapshotDependencies/ws/aries-current-snapshots/spi-fly/spi-fly-static-tool/pom.xml> to /home/hudson/hudson/jobs/AriesWithSnapshotDependencies/modules/org.apache.aries.spifly$org.apache.aries.spifly.static.tool/builds/2013-02-01_18-00-58/archive/org.apache.aries.spifly/org.apache.aries.spifly.static.tool/1.0.0-SNAPSHOT/org.apache.aries.spifly.static.tool-1.0.0-SNAPSHOT.pom
[JENKINS] Archiving <https://builds.apache.org/job/AriesWithSnapshotDependencies/ws/aries-current-snapshots/transaction/transaction-jms/pom.xml> to /home/hudson/hudson/jobs/AriesWithSnapshotDependencies/modules/org.apache.aries.transaction$org.apache.aries.transaction.jms/builds/2013-02-01_18-00-53/archive/org.apache.aries.transaction/org.apache.aries.transaction.jms/1.0.1-SNAPSHOT/org.apache.aries.transaction.jms-1.0.1-SNAPSHOT.pom
[JENKINS] Archiving <https://builds.apache.org/job/AriesWithSnapshotDependencies/ws/aries-current-snapshots/transaction/transaction-jms/target/org.apache.aries.transaction.jms-1.0.1-SNAPSHOT.jar> to /home/hudson/hudson/jobs/AriesWithSnapshotDependencies/modules/org.apache.aries.transaction$org.apache.aries.transaction.jms/builds/2013-02-01_18-00-53/archive/org.apache.aries.transaction/org.apache.aries.transaction.jms/1.0.1-SNAPSHOT/org.apache.aries.transaction.jms-1.0.1-SNAPSHOT.jar
[JENKINS] Archiving <https://builds.apache.org/job/AriesWithSnapshotDependencies/ws/aries-current-snapshots/transaction/transaction-jms/target/xbean/org.apache.aries.transaction.jms.xsd> to /home/hudson/hudson/jobs/AriesWithSnapshotDependencies/modules/org.apache.aries.transaction$org.apache.aries.transaction.jms/builds/2013-02-01_18-00-53/archive/org.apache.aries.transaction/org.apache.aries.transaction.jms/1.0.1-SNAPSHOT/org.apache.aries.transaction.jms-1.0.1-SNAPSHOT.xsd
[JENKINS] Archiving <https://builds.apache.org/job/AriesWithSnapshotDependencies/ws/aries-current-snapshots/transaction/transaction-jms/target/xbean/org.apache.aries.transaction.jms.xsd.html> to /home/hudson/hudson/jobs/AriesWithSnapshotDependencies/modules/org.apache.aries.transaction$org.apache.aries.transaction.jms/builds/2013-02-01_18-00-53/archive/org.apache.aries.transaction/org.apache.aries.transaction.jms/1.0.1-SNAPSHOT/org.apache.aries.transaction.jms-1.0.1-SNAPSHOT-schema.html
[JENKINS] Archiving <https://builds.apache.org/job/AriesWithSnapshotDependencies/ws/aries-current-snapshots/samples/blog/blog-api/pom.xml> to /home/hudson/hudson/jobs/AriesWithSnapshotDependencies/modules/org.apache.aries.samples.blog$org.apache.aries.samples.blog.api/builds/2013-02-01_18-00-59/archive/org.apache.aries.samples.blog/org.apache.aries.samples.blog.api/1.0.1-SNAPSHOT/org.apache.aries.samples.blog.api-1.0.1-SNAPSHOT.pom
[JENKINS] Archiving <https://builds.apache.org/job/AriesWithSnapshotDependencies/ws/aries-current-snapshots/samples/ariestrader/modules/ariestrader-persist-jpa-cm/pom.xml> to /home/hudson/hudson/jobs/AriesWithSnapshotDependencies/modules/org.apache.aries.samples.ariestrader$org.apache.aries.samples.ariestrader.persist.jpa.cm/builds/2013-02-01_18-01-00/archive/org.apache.aries.samples.ariestrader/org.apache.aries.samples.ariestrader.persist.jpa.cm/1.0.1-SNAPSHOT/org.apache.aries.samples.ariestrader.persist.jpa.cm-1.0.1-SNAPSHOT.pom
[JENKINS] Archiving <https://builds.apache.org/job/AriesWithSnapshotDependencies/ws/aries-current-snapshots/jmx/jmx-bundle/pom.xml> to /home/hudson/hudson/jobs/AriesWithSnapshotDependencies/modules/org.apache.aries.jmx$org.apache.aries.jmx/builds/2013-02-01_18-00-57/archive/org.apache.aries.jmx/org.apache.aries.jmx/1.1.1-SNAPSHOT/org.apache.aries.jmx-1.1.1-SNAPSHOT.pom
[JENKINS] Archiving <https://builds.apache.org/job/AriesWithSnapshotDependencies/ws/aries-current-snapshots/samples/ariestrader/assemblies/equinox-test-harness/pom.xml> to /home/hudson/hudson/jobs/AriesWithSnapshotDependencies/modules/org.apache.aries.samples.ariestrader$equinox-test-harness/builds/2013-02-01_18-01-00/archive/org.apache.aries.samples.ariestrader/equinox-test-harness/1.0.1-SNAPSHOT/equinox-test-harness-1.0.1-SNAPSHOT.pom
[JENKINS] Archiving <https://builds.apache.org/job/AriesWithSnapshotDependencies/ws/aries-current-snapshots/jmx/jmx-blueprint-api/pom.xml> to /home/hudson/hudson/jobs/AriesWithSnapshotDependencies/modules/org.apache.aries.jmx$org.apache.aries.jmx.blueprint.api/builds/2013-02-01_18-00-56/archive/org.apache.aries.jmx/org.apache.aries.jmx.blueprint.api/1.1.1-SNAPSHOT/org.apache.aries.jmx.blueprint.api-1.1.1-SNAPSHOT.pom
[JENKINS] Archiving <https://builds.apache.org/job/AriesWithSnapshotDependencies/ws/aries-current-snapshots/jmx/jmx-blueprint-api/target/org.apache.aries.jmx.blueprint.api-1.1.1-SNAPSHOT.jar> to /home/hudson/hudson/jobs/AriesWithSnapshotDependencies/modules/org.apache.aries.jmx$org.apache.aries.jmx.blueprint.api/builds/2013-02-01_18-00-56/archive/org.apache.aries.jmx/org.apache.aries.jmx.blueprint.api/1.1.1-SNAPSHOT/org.apache.aries.jmx.blueprint.api-1.1.1-SNAPSHOT.jar
[JENKINS] Archiving <https://builds.apache.org/job/AriesWithSnapshotDependencies/ws/aries-current-snapshots/jndi/pom.xml> to /home/hudson/hudson/jobs/AriesWithSnapshotDependencies/modules/org.apache.aries.jndi$jndi/builds/2013-02-01_18-00-52/archive/org.apache.aries.jndi/jndi/1.0.0-SNAPSHOT/jndi-1.0.0-SNAPSHOT.pom
[JENKINS] Archiving <https://builds.apache.org/job/AriesWithSnapshotDependencies/ws/aries-current-snapshots/samples/ariestrader/modules/ariestrader-core/pom.xml> to /home/hudson/hudson/jobs/AriesWithSnapshotDependencies/modules/org.apache.aries.samples.ariestrader$org.apache.aries.samples.ariestrader.core/builds/2013-02-01_18-00-59/archive/org.apache.aries.samples.ariestrader/org.apache.aries.samples.ariestrader.core/1.0.1-SNAPSHOT/org.apache.aries.samples.ariestrader.core-1.0.1-SNAPSHOT.pom
[JENKINS] Archiving <https://builds.apache.org/job/AriesWithSnapshotDependencies/ws/aries-current-snapshots/samples/blueprint/idverifier/idverifier-assembly/pom.xml> to /home/hudson/hudson/jobs/AriesWithSnapshotDependencies/modules/org.apache.aries.samples.blueprint.idverifier$org.apache.aries.samples.blueprint.idverifier.assembly/builds/2013-02-01_18-01-01/archive/org.apache.aries.samples.blueprint.idverifier/org.apache.aries.samples.blueprint.idverifier.assembly/1.0.1-SNAPSHOT/org.apache.aries.samples.blueprint.idverifier.assembly-1.0.1-SNAPSHOT.pom
[JENKINS] Archiving <https://builds.apache.org/job/AriesWithSnapshotDependencies/ws/aries-current-snapshots/eba-maven-plugin/pom.xml> to /home/hudson/hudson/jobs/AriesWithSnapshotDependencies/modules/org.apache.aries$eba-maven-plugin/builds/2013-02-01_18-00-49/archive/org.apache.aries/eba-maven-plugin/1.0.1-SNAPSHOT/eba-maven-plugin-1.0.1-SNAPSHOT.pom
[JENKINS] Archiving <https://builds.apache.org/job/AriesWithSnapshotDependencies/ws/aries-current-snapshots/eba-maven-plugin/target/eba-maven-plugin-1.0.1-SNAPSHOT.jar> to /home/hudson/hudson/jobs/AriesWithSnapshotDependencies/modules/org.apache.aries$eba-maven-plugin/builds/2013-02-01_18-00-49/archive/org.apache.aries/eba-maven-plugin/1.0.1-SNAPSHOT/eba-maven-plugin-1.0.1-SNAPSHOT.jar
[JENKINS] Archiving <https://builds.apache.org/job/AriesWithSnapshotDependencies/ws/aries-current-snapshots/samples/blog/blog-biz/pom.xml> to /home/hudson/hudson/jobs/AriesWithSnapshotDependencies/modules/org.apache.aries.samples.blog$org.apache.aries.samples.blog.biz/builds/2013-02-01_18-00-59/archive/org.apache.aries.samples.blog/org.apache.aries.samples.blog.biz/1.0.1-SNAPSHOT/org.apache.aries.samples.blog.biz-1.0.1-SNAPSHOT.pom
[JENKINS] Archiving <https://builds.apache.org/job/AriesWithSnapshotDependencies/ws/aries-current-snapshots/proxy/proxy-itests/pom.xml> to /home/hudson/hudson/jobs/AriesWithSnapshotDependencies/modules/org.apache.aries.proxy$org.apache.aries.proxy.itests/builds/2013-02-01_18-00-50/archive/org.apache.aries.proxy/org.apache.aries.proxy.itests/1.0.1-SNAPSHOT/org.apache.aries.proxy.itests-1.0.1-SNAPSHOT.pom
[JENKINS] Archiving <https://builds.apache.org/job/AriesWithSnapshotDependencies/ws/aries-current-snapshots/proxy/proxy-itests/target/org.apache.aries.proxy.itests-1.0.1-SNAPSHOT.jar> to /home/hudson/hudson/jobs/AriesWithSnapshotDependencies/modules/org.apache.aries.proxy$org.apache.aries.proxy.itests/builds/2013-02-01_18-00-50/archive/org.apache.aries.proxy/org.apache.aries.proxy.itests/1.0.1-SNAPSHOT/org.apache.aries.proxy.itests-1.0.1-SNAPSHOT.jar
[JENKINS] Archiving <https://builds.apache.org/job/AriesWithSnapshotDependencies/ws/aries-current-snapshots/transaction/transaction-testds/pom.xml> to /home/hudson/hudson/jobs/AriesWithSnapshotDependencies/modules/org.apache.aries.transaction$org.apache.aries.transaction.testds/builds/2013-02-01_18-00-54/archive/org.apache.aries.transaction/org.apache.aries.transaction.testds/1.0.1-SNAPSHOT/org.apache.aries.transaction.testds-1.0.1-SNAPSHOT.pom
[JENKINS] Archiving <https://builds.apache.org/job/AriesWithSnapshotDependencies/ws/aries-current-snapshots/transaction/transaction-testds/target/org.apache.aries.transaction.testds-1.0.1-SNAPSHOT.jar> to /home/hudson/hudson/jobs/AriesWithSnapshotDependencies/modules/org.apache.aries.transaction$org.apache.aries.transaction.testds/builds/2013-02-01_18-00-54/archive/org.apache.aries.transaction/org.apache.aries.transaction.testds/1.0.1-SNAPSHOT/org.apache.aries.transaction.testds-1.0.1-SNAPSHOT.jar
[JENKINS] Archiving <https://builds.apache.org/job/AriesWithSnapshotDependencies/ws/aries-current-snapshots/blueprint/blueprint-testbundleb/pom.xml> to /home/hudson/hudson/jobs/AriesWithSnapshotDependencies/modules/org.apache.aries.blueprint$org.apache.aries.blueprint.testbundleb/builds/2013-02-01_18-00-52/archive/org.apache.aries.blueprint/org.apache.aries.blueprint.testbundleb/1.0.2-SNAPSHOT/org.apache.aries.blueprint.testbundleb-1.0.2-SNAPSHOT.pom
[JENKINS] Archiving <https://builds.apache.org/job/AriesWithSnapshotDependencies/ws/aries-current-snapshots/blueprint/blueprint-testbundleb/target/org.apache.aries.blueprint.testbundleb-1.0.2-SNAPSHOT.jar> to /home/hudson/hudson/jobs/AriesWithSnapshotDependencies/modules/org.apache.aries.blueprint$org.apache.aries.blueprint.testbundleb/builds/2013-02-01_18-00-52/archive/org.apache.aries.blueprint/org.apache.aries.blueprint.testbundleb/1.0.2-SNAPSHOT/org.apache.aries.blueprint.testbundleb-1.0.2-SNAPSHOT.jar
[JENKINS] Archiving <https://builds.apache.org/job/AriesWithSnapshotDependencies/ws/aries-current-snapshots/blueprint/blueprint-testquiescebundle/pom.xml> to /home/hudson/hudson/jobs/AriesWithSnapshotDependencies/modules/org.apache.aries.blueprint$org.apache.aries.blueprint.testquiescebundle/builds/2013-02-01_18-00-52/archive/org.apache.aries.blueprint/org.apache.aries.blueprint.testquiescebundle/1.0.1-SNAPSHOT/org.apache.aries.blueprint.testquiescebundle-1.0.1-SNAPSHOT.pom
[JENKINS] Archiving <https://builds.apache.org/job/AriesWithSnapshotDependencies/ws/aries-current-snapshots/blueprint/blueprint-testquiescebundle/target/org.apache.aries.blueprint.testquiescebundle-1.0.1-SNAPSHOT.jar> to /home/hudson/hudson/jobs/AriesWithSnapshotDependencies/modules/org.apache.aries.blueprint$org.apache.aries.blueprint.testquiescebundle/builds/2013-02-01_18-00-52/archive/org.apache.aries.blueprint/org.apache.aries.blueprint.testquiescebundle/1.0.1-SNAPSHOT/org.apache.aries.blueprint.testquiescebundle-1.0.1-SNAPSHOT.jar
[JENKINS] Archiving <https://builds.apache.org/job/AriesWithSnapshotDependencies/ws/aries-current-snapshots/samples/blog/pom.xml> to /home/hudson/hudson/jobs/AriesWithSnapshotDependencies/modules/org.apache.aries.samples.blog$blog/builds/2013-02-01_18-00-59/archive/org.apache.aries.samples.blog/blog/1.0.1-SNAPSHOT/blog-1.0.1-SNAPSHOT.pom
[JENKINS] Archiving <https://builds.apache.org/job/AriesWithSnapshotDependencies/ws/aries-current-snapshots/blueprint/pom.xml> to /home/hudson/hudson/jobs/AriesWithSnapshotDependencies/modules/org.apache.aries.blueprint$blueprint/builds/2013-02-01_18-00-51/archive/org.apache.aries.blueprint/blueprint/1.0.0-SNAPSHOT/blueprint-1.0.0-SNAPSHOT.pom
[JENKINS] Archiving <https://builds.apache.org/job/AriesWithSnapshotDependencies/ws/aries-current-snapshots/jndi/jndi-core/pom.xml> to /home/hudson/hudson/jobs/AriesWithSnapshotDependencies/modules/org.apache.aries.jndi$org.apache.aries.jndi.core/builds/2013-02-01_18-00-52/archive/org.apache.aries.jndi/org.apache.aries.jndi.core/1.0.1-SNAPSHOT/org.apache.aries.jndi.core-1.0.1-SNAPSHOT.pom
[JENKINS] Archiving <https://builds.apache.org/job/AriesWithSnapshotDependencies/ws/aries-current-snapshots/jndi/jndi-core/target/org.apache.aries.jndi.core-1.0.1-SNAPSHOT.jar> to /home/hudson/hudson/jobs/AriesWithSnapshotDependencies/modules/org.apache.aries.jndi$org.apache.aries.jndi.core/builds/2013-02-01_18-00-52/archive/org.apache.aries.jndi/org.apache.aries.jndi.core/1.0.1-SNAPSHOT/org.apache.aries.jndi.core-1.0.1-SNAPSHOT.jar
[JENKINS] Archiving <https://builds.apache.org/job/AriesWithSnapshotDependencies/ws/aries-current-snapshots/subsystem/subsystem-core/pom.xml> to /home/hudson/hudson/jobs/AriesWithSnapshotDependencies/modules/org.apache.aries.subsystem$org.apache.aries.subsystem.core/builds/2013-02-01_18-00-56/archive/org.apache.aries.subsystem/org.apache.aries.subsystem.core/1.0.0-SNAPSHOT/org.apache.aries.subsystem.core-1.0.0-SNAPSHOT.pom
[JENKINS] Archiving <https://builds.apache.org/job/AriesWithSnapshotDependencies/ws/aries-current-snapshots/subsystem/subsystem-core/target/org.apache.aries.subsystem.core-1.0.0-SNAPSHOT.jar> to /home/hudson/hudson/jobs/AriesWithSnapshotDependencies/modules/org.apache.aries.subsystem$org.apache.aries.subsystem.core/builds/2013-02-01_18-00-56/archive/org.apache.aries.subsystem/org.apache.aries.subsystem.core/1.0.0-SNAPSHOT/org.apache.aries.subsystem.core-1.0.0-SNAPSHOT.jar
[JENKINS] Archiving <https://builds.apache.org/job/AriesWithSnapshotDependencies/ws/aries-current-snapshots/spi-fly/spi-fly-examples/spi-fly-example-resource-provider-bundle/pom.xml> to /home/hudson/hudson/jobs/AriesWithSnapshotDependencies/modules/org.apache.aries.spifly.examples$org.apache.aries.spifly.examples.resource.provider.bundle/builds/2013-02-01_18-00-58/archive/org.apache.aries.spifly.examples/org.apache.aries.spifly.examples.resource.provider.bundle/1.0.0-SNAPSHOT/org.apache.aries.spifly.examples.resource.provider.bundle-1.0.0-SNAPSHOT.pom
[JENKINS] Archiving <https://builds.apache.org/job/AriesWithSnapshotDependencies/ws/aries-current-snapshots/proxy/pom.xml> to /home/hudson/hudson/jobs/AriesWithSnapshotDependencies/modules/org.apache.aries.proxy$proxy/builds/2013-02-01_18-00-50/archive/org.apache.aries.proxy/proxy/1.0.0-SNAPSHOT/proxy-1.0.0-SNAPSHOT.pom
[JENKINS] Archiving <https://builds.apache.org/job/AriesWithSnapshotDependencies/ws/aries-current-snapshots/samples/ariestrader/pom.xml> to /home/hudson/hudson/jobs/AriesWithSnapshotDependencies/modules/org.apache.aries.samples.ariestrader$ariestrader/builds/2013-02-01_18-00-59/archive/org.apache.aries.samples.ariestrader/ariestrader/1.0.1-SNAPSHOT/ariestrader-1.0.1-SNAPSHOT.pom
[JENKINS] Archiving <https://builds.apache.org/job/AriesWithSnapshotDependencies/ws/aries-current-snapshots/quiesce/quiesce-api/pom.xml> to /home/hudson/hudson/jobs/AriesWithSnapshotDependencies/modules/org.apache.aries.quiesce$org.apache.aries.quiesce.api/builds/2013-02-01_18-00-50/archive/org.apache.aries.quiesce/org.apache.aries.quiesce.api/1.0.1-SNAPSHOT/org.apache.aries.quiesce.api-1.0.1-SNAPSHOT.pom
[JENKINS] Archiving <https://builds.apache.org/job/AriesWithSnapshotDependencies/ws/aries-current-snapshots/quiesce/quiesce-api/target/org.apache.aries.quiesce.api-1.0.1-SNAPSHOT.jar> to /home/hudson/hudson/jobs/AriesWithSnapshotDependencies/modules/org.apache.aries.quiesce$org.apache.aries.quiesce.api/builds/2013-02-01_18-00-50/archive/org.apache.aries.quiesce/org.apache.aries.quiesce.api/1.0.1-SNAPSHOT/org.apache.aries.quiesce.api-1.0.1-SNAPSHOT.jar
[JENKINS] Archiving <https://builds.apache.org/job/AriesWithSnapshotDependencies/ws/aries-current-snapshots/ejb/openejb-extender-itest/pom.xml> to /home/hudson/hudson/jobs/AriesWithSnapshotDependencies/modules/org.apache.aries.ejb$org.apache.aries.ejb.openejb.extender.itest/builds/2013-02-01_18-00-56/archive/org.apache.aries.ejb/org.apache.aries.ejb.openejb.extender.itest/1.0.1-SNAPSHOT/org.apache.aries.ejb.openejb.extender.itest-1.0.1-SNAPSHOT.pom
[JENKINS] Archiving <https://builds.apache.org/job/AriesWithSnapshotDependencies/ws/aries-current-snapshots/ejb/openejb-extender-itest/target/org.apache.aries.ejb.openejb.extender.itest-1.0.1-SNAPSHOT.jar> to /home/hudson/hudson/jobs/AriesWithSnapshotDependencies/modules/org.apache.aries.ejb$org.apache.aries.ejb.openejb.extender.itest/builds/2013-02-01_18-00-56/archive/org.apache.aries.ejb/org.apache.aries.ejb.openejb.extender.itest/1.0.1-SNAPSHOT/org.apache.aries.ejb.openejb.extender.itest-1.0.1-SNAPSHOT.jar
[JENKINS] Archiving <https://builds.apache.org/job/AriesWithSnapshotDependencies/ws/aries-current-snapshots/spi-fly/spi-fly-examples/spi-fly-example-spi-bundle/pom.xml> to /home/hudson/hudson/jobs/AriesWithSnapshotDependencies/modules/org.apache.aries.spifly.examples$org.apache.aries.spifly.examples.spi.bundle/builds/2013-02-01_18-00-58/archive/org.apache.aries.spifly.examples/org.apache.aries.spifly.examples.spi.bundle/1.0.0-SNAPSHOT/org.apache.aries.spifly.examples.spi.bundle-1.0.0-SNAPSHOT.pom
[JENKINS] Archiving <https://builds.apache.org/job/AriesWithSnapshotDependencies/ws/aries-current-snapshots/application/application-runtime-framework-management/pom.xml> to /home/hudson/hudson/jobs/AriesWithSnapshotDependencies/modules/org.apache.aries.application$org.apache.aries.application.runtime.framework.management/builds/2013-02-01_18-00-55/archive/org.apache.aries.application/org.apache.aries.application.runtime.framework.management/1.0.1-SNAPSHOT/org.apache.aries.application.runtime.framework.management-1.0.1-SNAPSHOT.pom
[JENKINS] Archiving <https://builds.apache.org/job/AriesWithSnapshotDependencies/ws/aries-current-snapshots/application/application-runtime-framework-management/target/org.apache.aries.application.runtime.framework.management-1.0.1-SNAPSHOT.jar> to /home/hudson/hudson/jobs/AriesWithSnapshotDependencies/modules/org.apache.aries.application$org.apache.aries.application.runtime.framework.management/builds/2013-02-01_18-00-55/archive/org.apache.aries.application/org.apache.aries.application.runtime.framework.management/1.0.1-SNAPSHOT/org.apache.aries.application.runtime.framework.management-1.0.1-SNAPSHOT.jar
[JENKINS] Archiving <https://builds.apache.org/job/AriesWithSnapshotDependencies/ws/aries-current-snapshots/blueprint/blueprint-sample/pom.xml> to /home/hudson/hudson/jobs/AriesWithSnapshotDependencies/modules/org.apache.aries.blueprint$org.apache.aries.blueprint.sample/builds/2013-02-01_18-00-52/archive/org.apache.aries.blueprint/org.apache.aries.blueprint.sample/1.0.1-SNAPSHOT/org.apache.aries.blueprint.sample-1.0.1-SNAPSHOT.pom
[JENKINS] Archiving <https://builds.apache.org/job/AriesWithSnapshotDependencies/ws/aries-current-snapshots/blueprint/blueprint-sample/target/org.apache.aries.blueprint.sample-1.0.1-SNAPSHOT.jar> to /home/hudson/hudson/jobs/AriesWithSnapshotDependencies/modules/org.apache.aries.blueprint$org.apache.aries.blueprint.sample/builds/2013-02-01_18-00-52/archive/org.apache.aries.blueprint/org.apache.aries.blueprint.sample/1.0.1-SNAPSHOT/org.apache.aries.blueprint.sample-1.0.1-SNAPSHOT.jar
[JENKINS] Archiving <https://builds.apache.org/job/AriesWithSnapshotDependencies/ws/aries-current-snapshots/samples/ariestrader/modules/ariestrader-api/pom.xml> to /home/hudson/hudson/jobs/AriesWithSnapshotDependencies/modules/org.apache.aries.samples.ariestrader$org.apache.aries.samples.ariestrader.api/builds/2013-02-01_18-00-59/archive/org.apache.aries.samples.ariestrader/org.apache.aries.samples.ariestrader.api/1.0.1-SNAPSHOT/org.apache.aries.samples.ariestrader.api-1.0.1-SNAPSHOT.pom
[JENKINS] Archiving <https://builds.apache.org/job/AriesWithSnapshotDependencies/ws/aries-current-snapshots/spi-fly/spi-fly-examples/spi-fly-example-provider1-bundle/pom.xml> to /home/hudson/hudson/jobs/AriesWithSnapshotDependencies/modules/org.apache.aries.spifly.examples$org.apache.aries.spifly.examples.provider1.bundle/builds/2013-02-01_18-00-58/archive/org.apache.aries.spifly.examples/org.apache.aries.spifly.examples.provider1.bundle/1.0.0-SNAPSHOT/org.apache.aries.spifly.examples.provider1.bundle-1.0.0-SNAPSHOT.pom
[JENKINS] Archiving <https://builds.apache.org/job/AriesWithSnapshotDependencies/ws/aries-current-snapshots/application/application-runtime-isolated/pom.xml> to /home/hudson/hudson/jobs/AriesWithSnapshotDependencies/modules/org.apache.aries.application$org.apache.aries.application.runtime.isolated/builds/2013-02-01_18-00-55/archive/org.apache.aries.application/org.apache.aries.application.runtime.isolated/1.0.1-SNAPSHOT/org.apache.aries.application.runtime.isolated-1.0.1-SNAPSHOT.pom
[JENKINS] Archiving <https://builds.apache.org/job/AriesWithSnapshotDependencies/ws/aries-current-snapshots/application/application-runtime-isolated/target/org.apache.aries.application.runtime.isolated-1.0.1-SNAPSHOT.jar> to /home/hudson/hudson/jobs/AriesWithSnapshotDependencies/modules/org.apache.aries.application$org.apache.aries.application.runtime.isolated/builds/2013-02-01_18-00-55/archive/org.apache.aries.application/org.apache.aries.application.runtime.isolated/1.0.1-SNAPSHOT/org.apache.aries.application.runtime.isolated-1.0.1-SNAPSHOT.jar
[JENKINS] Archiving <https://builds.apache.org/job/AriesWithSnapshotDependencies/ws/aries-current-snapshots/application/application-modeller/pom.xml> to /home/hudson/hudson/jobs/AriesWithSnapshotDependencies/modules/org.apache.aries.application$org.apache.aries.application.modeller/builds/2013-02-01_18-00-55/archive/org.apache.aries.application/org.apache.aries.application.modeller/1.0.1-SNAPSHOT/org.apache.aries.application.modeller-1.0.1-SNAPSHOT.pom
[JENKINS] Archiving <https://builds.apache.org/job/AriesWithSnapshotDependencies/ws/aries-current-snapshots/application/application-modeller/target/org.apache.aries.application.modeller-1.0.1-SNAPSHOT.jar> to /home/hudson/hudson/jobs/AriesWithSnapshotDependencies/modules/org.apache.aries.application$org.apache.aries.application.modeller/builds/2013-02-01_18-00-55/archive/org.apache.aries.application/org.apache.aries.application.modeller/1.0.1-SNAPSHOT/org.apache.aries.application.modeller-1.0.1-SNAPSHOT.jar
[JENKINS] Archiving <https://builds.apache.org/job/AriesWithSnapshotDependencies/ws/aries-current-snapshots/blueprint/blueprint-annotation-api/pom.xml> to /home/hudson/hudson/jobs/AriesWithSnapshotDependencies/modules/org.apache.aries.blueprint$org.apache.aries.blueprint.annotation.api/builds/2013-02-01_18-00-52/archive/org.apache.aries.blueprint/org.apache.aries.blueprint.annotation.api/1.0.1-SNAPSHOT/org.apache.aries.blueprint.annotation.api-1.0.1-SNAPSHOT.pom
[JENKINS] Archiving <https://builds.apache.org/job/AriesWithSnapshotDependencies/ws/aries-current-snapshots/blueprint/blueprint-annotation-api/target/org.apache.aries.blueprint.annotation.api-1.0.1-SNAPSHOT.jar> to /home/hudson/hudson/jobs/AriesWithSnapshotDependencies/modules/org.apache.aries.blueprint$org.apache.aries.blueprint.annotation.api/builds/2013-02-01_18-00-52/archive/org.apache.aries.blueprint/org.apache.aries.blueprint.annotation.api/1.0.1-SNAPSHOT/org.apache.aries.blueprint.annotation.api-1.0.1-SNAPSHOT.jar
[JENKINS] Archiving <https://builds.apache.org/job/AriesWithSnapshotDependencies/ws/aries-current-snapshots/application/application-itests/pom.xml> to /home/hudson/hudson/jobs/AriesWithSnapshotDependencies/modules/org.apache.aries.application$org.apache.aries.application.runtime.isolated.itests/builds/2013-02-01_18-00-54/archive/org.apache.aries.application/org.apache.aries.application.runtime.isolated.itests/1.0.1-SNAPSHOT/org.apache.aries.application.runtime.isolated.itests-1.0.1-SNAPSHOT.pom
[JENKINS] Archiving <https://builds.apache.org/job/AriesWithSnapshotDependencies/ws/aries-current-snapshots/application/application-itests/target/org.apache.aries.application.runtime.isolated.itests-1.0.1-SNAPSHOT.jar> to /home/hudson/hudson/jobs/AriesWithSnapshotDependencies/modules/org.apache.aries.application$org.apache.aries.application.runtime.isolated.itests/builds/2013-02-01_18-00-54/archive/org.apache.aries.application/org.apache.aries.application.runtime.isolated.itests/1.0.1-SNAPSHOT/org.apache.aries.application.runtime.isolated.itests-1.0.1-SNAPSHOT.jar
[JENKINS] Archiving <https://builds.apache.org/job/AriesWithSnapshotDependencies/ws/aries-current-snapshots/versioning/versioning-checker/pom.xml> to /home/hudson/hudson/jobs/AriesWithSnapshotDependencies/modules/org.apache.aries.versioning$org.apache.aries.versioning.checker/builds/2013-02-01_18-00-50/archive/org.apache.aries.versioning/org.apache.aries.versioning.checker/0.2.0-SNAPSHOT/org.apache.aries.versioning.checker-0.2.0-SNAPSHOT.pom
[JENKINS] Archiving <https://builds.apache.org/job/AriesWithSnapshotDependencies/ws/aries-current-snapshots/versioning/versioning-checker/target/org.apache.aries.versioning.checker-0.2.0-SNAPSHOT.jar> to /home/hudson/hudson/jobs/AriesWithSnapshotDependencies/modules/org.apache.aries.versioning$org.apache.aries.versioning.checker/builds/2013-02-01_18-00-50/archive/org.apache.aries.versioning/org.apache.aries.versioning.checker/0.2.0-SNAPSHOT/org.apache.aries.versioning.checker-0.2.0-SNAPSHOT.jar
[JENKINS] Archiving <https://builds.apache.org/job/AriesWithSnapshotDependencies/ws/aries-current-snapshots/subsystem/subsystem-itests-api-bundle/pom.xml> to /home/hudson/hudson/jobs/AriesWithSnapshotDependencies/modules/org.apache.aries.subsystem$org.apache.aries.subsystem.itest.interfaces/builds/2013-02-01_18-00-56/archive/org.apache.aries.subsystem/org.apache.aries.subsystem.itest.interfaces/1.0.0-SNAPSHOT/org.apache.aries.subsystem.itest.interfaces-1.0.0-SNAPSHOT.pom
[JENKINS] Archiving <https://builds.apache.org/job/AriesWithSnapshotDependencies/ws/aries-current-snapshots/subsystem/subsystem-itests-api-bundle/target/org.apache.aries.subsystem.itest.interfaces-1.0.0-SNAPSHOT.jar> to /home/hudson/hudson/jobs/AriesWithSnapshotDependencies/modules/org.apache.aries.subsystem$org.apache.aries.subsystem.itest.interfaces/builds/2013-02-01_18-00-56/archive/org.apache.aries.subsystem/org.apache.aries.subsystem.itest.interfaces/1.0.0-SNAPSHOT/org.apache.aries.subsystem.itest.interfaces-1.0.0-SNAPSHOT.jar
[JENKINS] Archiving <https://builds.apache.org/job/AriesWithSnapshotDependencies/ws/aries-current-snapshots/parent/default-parent/java5-parent/pom.xml> to /home/hudson/hudson/jobs/AriesWithSnapshotDependencies/modules/org.apache.aries$java5-parent/builds/2013-02-01_18-00-49/archive/org.apache.aries/java5-parent/1.0.1-SNAPSHOT/java5-parent-1.0.1-SNAPSHOT.pom
[JENKINS] Archiving <https://builds.apache.org/job/AriesWithSnapshotDependencies/ws/aries-current-snapshots/jpa/pom.xml> to /home/hudson/hudson/jobs/AriesWithSnapshotDependencies/modules/org.apache.aries.jpa$jpa/builds/2013-02-01_18-00-57/archive/org.apache.aries.jpa/jpa/1.0.0-SNAPSHOT/jpa-1.0.0-SNAPSHOT.pom
[JENKINS] Archiving <https://builds.apache.org/job/AriesWithSnapshotDependencies/ws/aries-current-snapshots/jndi/jndi-bundle/pom.xml> to /home/hudson/hudson/jobs/AriesWithSnapshotDependencies/modules/org.apache.aries.jndi$org.apache.aries.jndi/builds/2013-02-01_18-00-53/archive/org.apache.aries.jndi/org.apache.aries.jndi/1.0.1-SNAPSHOT/org.apache.aries.jndi-1.0.1-SNAPSHOT.pom
[JENKINS] Archiving <https://builds.apache.org/job/AriesWithSnapshotDependencies/ws/aries-current-snapshots/jndi/jndi-bundle/target/org.apache.aries.jndi-1.0.1-SNAPSHOT.jar> to /home/hudson/hudson/jobs/AriesWithSnapshotDependencies/modules/org.apache.aries.jndi$org.apache.aries.jndi/builds/2013-02-01_18-00-53/archive/org.apache.aries.jndi/org.apache.aries.jndi/1.0.1-SNAPSHOT/org.apache.aries.jndi-1.0.1-SNAPSHOT.jar
[JENKINS] Archiving <https://builds.apache.org/job/AriesWithSnapshotDependencies/ws/aries-current-snapshots/proxy/proxy-bundle/pom.xml> to /home/hudson/hudson/jobs/AriesWithSnapshotDependencies/modules/org.apache.aries.proxy$org.apache.aries.proxy/builds/2013-02-01_18-00-50/archive/org.apache.aries.proxy/org.apache.aries.proxy/1.0.2-SNAPSHOT/org.apache.aries.proxy-1.0.2-SNAPSHOT.pom
[JENKINS] Archiving <https://builds.apache.org/job/AriesWithSnapshotDependencies/ws/aries-current-snapshots/proxy/proxy-bundle/target/org.apache.aries.proxy-1.0.2-SNAPSHOT.jar> to /home/hudson/hudson/jobs/AriesWithSnapshotDependencies/modules/org.apache.aries.proxy$org.apache.aries.proxy/builds/2013-02-01_18-00-50/archive/org.apache.aries.proxy/org.apache.aries.proxy/1.0.2-SNAPSHOT/org.apache.aries.proxy-1.0.2-SNAPSHOT.jar
[JENKINS] Archiving <https://builds.apache.org/job/AriesWithSnapshotDependencies/ws/aries-current-snapshots/jpa/jpa-container-advancedtestbundle/pom.xml> to /home/hudson/hudson/jobs/AriesWithSnapshotDependencies/modules/org.apache.aries.jpa$org.apache.aries.jpa.container.advanced.itest.bundle/builds/2013-02-01_18-00-57/archive/org.apache.aries.jpa/org.apache.aries.jpa.container.advanced.itest.bundle/1.0.1-SNAPSHOT/org.apache.aries.jpa.container.advanced.itest.bundle-1.0.1-SNAPSHOT.pom
[JENKINS] Archiving <https://builds.apache.org/job/AriesWithSnapshotDependencies/ws/aries-current-snapshots/application/application-resolve-transform-cm-itests/pom.xml> to /home/hudson/hudson/jobs/AriesWithSnapshotDependencies/modules/org.apache.aries.application$org.apache.aries.application.resolve.transform.cm.itests/builds/2013-02-01_18-00-55/archive/org.apache.aries.application/org.apache.aries.application.resolve.transform.cm.itests/1.0.1-SNAPSHOT/org.apache.aries.application.resolve.transform.cm.itests-1.0.1-SNAPSHOT.pom
[JENKINS] Archiving <https://builds.apache.org/job/AriesWithSnapshotDependencies/ws/aries-current-snapshots/application/application-resolve-transform-cm-itests/target/org.apache.aries.application.resolve.transform.cm.itests-1.0.1-SNAPSHOT.jar> to /home/hudson/hudson/jobs/AriesWithSnapshotDependencies/modules/org.apache.aries.application$org.apache.aries.application.resolve.transform.cm.itests/builds/2013-02-01_18-00-55/archive/org.apache.aries.application/org.apache.aries.application.resolve.transform.cm.itests/1.0.1-SNAPSHOT/org.apache.aries.application.resolve.transform.cm.itests-1.0.1-SNAPSHOT.jar
[JENKINS] Archiving <https://builds.apache.org/job/AriesWithSnapshotDependencies/ws/aries-current-snapshots/application/application-utils/pom.xml> to /home/hudson/hudson/jobs/AriesWithSnapshotDependencies/modules/org.apache.aries.application$org.apache.aries.application.utils/builds/2013-02-01_18-00-54/archive/org.apache.aries.application/org.apache.aries.application.utils/1.0.1-SNAPSHOT/org.apache.aries.application.utils-1.0.1-SNAPSHOT.pom
[JENKINS] Archiving <https://builds.apache.org/job/AriesWithSnapshotDependencies/ws/aries-current-snapshots/application/application-utils/target/org.apache.aries.application.utils-1.0.1-SNAPSHOT.jar> to /home/hudson/hudson/jobs/AriesWithSnapshotDependencies/modules/org.apache.aries.application$org.apache.aries.application.utils/builds/2013-02-01_18-00-54/archive/org.apache.aries.application/org.apache.aries.application.utils/1.0.1-SNAPSHOT/org.apache.aries.application.utils-1.0.1-SNAPSHOT.jar
[JENKINS] Archiving <https://builds.apache.org/job/AriesWithSnapshotDependencies/ws/aries-current-snapshots/samples/blog/blog-persistence-jdbc/pom.xml> to /home/hudson/hudson/jobs/AriesWithSnapshotDependencies/modules/org.apache.aries.samples.blog$org.apache.aries.samples.blog.persistence.jdbc/builds/2013-02-01_18-00-59/archive/org.apache.aries.samples.blog/org.apache.aries.samples.blog.persistence.jdbc/1.0.1-SNAPSHOT/org.apache.aries.samples.blog.persistence.jdbc-1.0.1-SNAPSHOT.pom
[JENKINS] Archiving <https://builds.apache.org/job/AriesWithSnapshotDependencies/ws/aries-current-snapshots/application/application-converters/pom.xml> to /home/hudson/hudson/jobs/AriesWithSnapshotDependencies/modules/org.apache.aries.application$org.apache.aries.application.converters/builds/2013-02-01_18-00-54/archive/org.apache.aries.application/org.apache.aries.application.converters/1.0.1-SNAPSHOT/org.apache.aries.application.converters-1.0.1-SNAPSHOT.pom
[JENKINS] Archiving <https://builds.apache.org/job/AriesWithSnapshotDependencies/ws/aries-current-snapshots/application/application-converters/target/org.apache.aries.application.converters-1.0.1-SNAPSHOT.jar> to /home/hudson/hudson/jobs/AriesWithSnapshotDependencies/modules/org.apache.aries.application$org.apache.aries.application.converters/builds/2013-02-01_18-00-54/archive/org.apache.aries.application/org.apache.aries.application.converters/1.0.1-SNAPSHOT/org.apache.aries.application.converters-1.0.1-SNAPSHOT.jar
[JENKINS] Archiving <https://builds.apache.org/job/AriesWithSnapshotDependencies/ws/aries-current-snapshots/ejb/pom.xml> to /home/hudson/hudson/jobs/AriesWithSnapshotDependencies/modules/org.apache.aries.ejb$ejb/builds/2013-02-01_18-00-56/archive/org.apache.aries.ejb/ejb/1.0.0-SNAPSHOT/ejb-1.0.0-SNAPSHOT.pom
[JENKINS] Archiving <https://builds.apache.org/job/AriesWithSnapshotDependencies/ws/aries-current-snapshots/subsystem/subsystem-itests/pom.xml> to /home/hudson/hudson/jobs/AriesWithSnapshotDependencies/modules/org.apache.aries.subsystem$org.apache.aries.subsystem.itests/builds/2013-02-01_18-00-56/archive/org.apache.aries.subsystem/org.apache.aries.subsystem.itests/1.0.0-SNAPSHOT/org.apache.aries.subsystem.itests-1.0.0-SNAPSHOT.pom
[JENKINS] Archiving <https://builds.apache.org/job/AriesWithSnapshotDependencies/ws/aries-current-snapshots/subsystem/subsystem-itests/target/org.apache.aries.subsystem.itests-1.0.0-SNAPSHOT.jar> to /home/hudson/hudson/jobs/AriesWithSnapshotDependencies/modules/org.apache.aries.subsystem$org.apache.aries.subsystem.itests/builds/2013-02-01_18-00-56/archive/org.apache.aries.subsystem/org.apache.aries.subsystem.itests/1.0.0-SNAPSHOT/org.apache.aries.subsystem.itests-1.0.0-SNAPSHOT.jar
[JENKINS] Archiving <https://builds.apache.org/job/AriesWithSnapshotDependencies/ws/aries-current-snapshots/blueprint/blueprint-itests/pom.xml> to /home/hudson/hudson/jobs/AriesWithSnapshotDependencies/modules/org.apache.aries.blueprint$org.apache.aries.blueprint.itests/builds/2013-02-01_18-00-52/archive/org.apache.aries.blueprint/org.apache.aries.blueprint.itests/1.0.2-SNAPSHOT/org.apache.aries.blueprint.itests-1.0.2-SNAPSHOT.pom
[JENKINS] Archiving <https://builds.apache.org/job/AriesWithSnapshotDependencies/ws/aries-current-snapshots/blueprint/blueprint-itests/target/org.apache.aries.blueprint.itests-1.0.2-SNAPSHOT.jar> to /home/hudson/hudson/jobs/AriesWithSnapshotDependencies/modules/org.apache.aries.blueprint$org.apache.aries.blueprint.itests/builds/2013-02-01_18-00-52/archive/org.apache.aries.blueprint/org.apache.aries.blueprint.itests/1.0.2-SNAPSHOT/org.apache.aries.blueprint.itests-1.0.2-SNAPSHOT.jar
[JENKINS] Archiving <https://builds.apache.org/job/AriesWithSnapshotDependencies/ws/aries-current-snapshots/samples/blueprint/helloworld/helloworld-eba/pom.xml> to /home/hudson/hudson/jobs/AriesWithSnapshotDependencies/modules/org.apache.aries.samples.blueprint.helloworld$org.apache.aries.samples.blueprint.helloworld.eba/builds/2013-02-01_18-01-01/archive/org.apache.aries.samples.blueprint.helloworld/org.apache.aries.samples.blueprint.helloworld.eba/1.0.1-SNAPSHOT/org.apache.aries.samples.blueprint.helloworld.eba-1.0.1-SNAPSHOT.pom
[JENKINS] Archiving <https://builds.apache.org/job/AriesWithSnapshotDependencies/ws/aries-current-snapshots/jpa/jpa-api/pom.xml> to /home/hudson/hudson/jobs/AriesWithSnapshotDependencies/modules/org.apache.aries.jpa$org.apache.aries.jpa.api/builds/2013-02-01_18-00-57/archive/org.apache.aries.jpa/org.apache.aries.jpa.api/1.0.1-SNAPSHOT/org.apache.aries.jpa.api-1.0.1-SNAPSHOT.pom
[JENKINS] Archiving <https://builds.apache.org/job/AriesWithSnapshotDependencies/ws/aries-current-snapshots/jpa/jpa-api/target/org.apache.aries.jpa.api-1.0.1-SNAPSHOT.jar> to /home/hudson/hudson/jobs/AriesWithSnapshotDependencies/modules/org.apache.aries.jpa$org.apache.aries.jpa.api/builds/2013-02-01_18-00-57/archive/org.apache.aries.jpa/org.apache.aries.jpa.api/1.0.1-SNAPSHOT/org.apache.aries.jpa.api-1.0.1-SNAPSHOT.jar
[JENKINS] Archiving <https://builds.apache.org/job/AriesWithSnapshotDependencies/ws/aries-current-snapshots/subsystem/subsystem-obr/pom.xml> to /home/hudson/hudson/jobs/AriesWithSnapshotDependencies/modules/org.apache.aries.subsystem$org.apache.aries.subsystem.obr/builds/2013-02-01_18-00-56/archive/org.apache.aries.subsystem/org.apache.aries.subsystem.obr/1.0.0-SNAPSHOT/org.apache.aries.subsystem.obr-1.0.0-SNAPSHOT.pom
[JENKINS] Archiving <https://builds.apache.org/job/AriesWithSnapshotDependencies/ws/aries-current-snapshots/subsystem/subsystem-obr/target/org.apache.aries.subsystem.obr-1.0.0-SNAPSHOT.jar> to /home/hudson/hudson/jobs/AriesWithSnapshotDependencies/modules/org.apache.aries.subsystem$org.apache.aries.subsystem.obr/builds/2013-02-01_18-00-56/archive/org.apache.aries.subsystem/org.apache.aries.subsystem.obr/1.0.0-SNAPSHOT/org.apache.aries.subsystem.obr-1.0.0-SNAPSHOT.jar
[JENKINS] Archiving <https://builds.apache.org/job/AriesWithSnapshotDependencies/ws/aries-current-snapshots/jmx/jmx-whiteboard/pom.xml> to /home/hudson/hudson/jobs/AriesWithSnapshotDependencies/modules/org.apache.aries.jmx$org.apache.aries.jmx.whiteboard/builds/2013-02-01_18-00-57/archive/org.apache.aries.jmx/org.apache.aries.jmx.whiteboard/1.1.0-SNAPSHOT/org.apache.aries.jmx.whiteboard-1.1.0-SNAPSHOT.pom
[JENKINS] Archiving <https://builds.apache.org/job/AriesWithSnapshotDependencies/ws/aries-current-snapshots/jndi/jndi-url-itest/pom.xml> to /home/hudson/hudson/jobs/AriesWithSnapshotDependencies/modules/org.apache.aries.jndi$org.apache.aries.jndi.url.itest/builds/2013-02-01_18-00-53/archive/org.apache.aries.jndi/org.apache.aries.jndi.url.itest/1.0.1-SNAPSHOT/org.apache.aries.jndi.url.itest-1.0.1-SNAPSHOT.pom
[JENKINS] Archiving <https://builds.apache.org/job/AriesWithSnapshotDependencies/ws/aries-current-snapshots/jndi/jndi-url-itest/target/org.apache.aries.jndi.url.itest-1.0.1-SNAPSHOT.jar> to /home/hudson/hudson/jobs/AriesWithSnapshotDependencies/modules/org.apache.aries.jndi$org.apache.aries.jndi.url.itest/builds/2013-02-01_18-00-53/archive/org.apache.aries.jndi/org.apache.aries.jndi.url.itest/1.0.1-SNAPSHOT/org.apache.aries.jndi.url.itest-1.0.1-SNAPSHOT.jar
[JENKINS] Archiving <https://builds.apache.org/job/AriesWithSnapshotDependencies/ws/aries-current-snapshots/versioning/pom.xml> to /home/hudson/hudson/jobs/AriesWithSnapshotDependencies/modules/org.apache.aries.versioning$org.apache.aries.versioning/builds/2013-02-01_18-00-50/archive/org.apache.aries.versioning/org.apache.aries.versioning/0.1.0-SNAPSHOT/org.apache.aries.versioning-0.1.0-SNAPSHOT.pom
[JENKINS] Archiving <https://builds.apache.org/job/AriesWithSnapshotDependencies/ws/aries-current-snapshots/parent/default-parent/pom.xml> to /home/hudson/hudson/jobs/AriesWithSnapshotDependencies/modules/org.apache.aries$default-parent/builds/2013-02-01_18-00-49/archive/org.apache.aries/default-parent/1.0.1-SNAPSHOT/default-parent-1.0.1-SNAPSHOT.pom
[JENKINS] Archiving <https://builds.apache.org/job/AriesWithSnapshotDependencies/ws/aries-current-snapshots/samples/ariestrader/modules/ariestrader-persist-jdbc/pom.xml> to /home/hudson/hudson/jobs/AriesWithSnapshotDependencies/modules/org.apache.aries.samples.ariestrader$org.apache.aries.samples.ariestrader.persist.jdbc/builds/2013-02-01_18-01-00/archive/org.apache.aries.samples.ariestrader/org.apache.aries.samples.ariestrader.persist.jdbc/1.0.1-SNAPSHOT/org.apache.aries.samples.ariestrader.persist.jdbc-1.0.1-SNAPSHOT.pom
[JENKINS] Archiving <https://builds.apache.org/job/AriesWithSnapshotDependencies/ws/aries-current-snapshots/samples/twitter/twitter-itests/pom.xml> to /home/hudson/hudson/jobs/AriesWithSnapshotDependencies/modules/org.apache.aries.samples.twitter$org.apache.aries.samples.twitter.itests/builds/2013-02-01_18-01-01/archive/org.apache.aries.samples.twitter/org.apache.aries.samples.twitter.itests/1.0.1-SNAPSHOT/org.apache.aries.samples.twitter.itests-1.0.1-SNAPSHOT.pom
[JENKINS] Archiving <https://builds.apache.org/job/AriesWithSnapshotDependencies/ws/aries-current-snapshots/jpa/jpa-blueprint-testbundle/pom.xml> to /home/hudson/hudson/jobs/AriesWithSnapshotDependencies/modules/org.apache.aries.jpa$org.apache.aries.jpa.blueprint.itest.bundle/builds/2013-02-01_18-00-57/archive/org.apache.aries.jpa/org.apache.aries.jpa.blueprint.itest.bundle/1.0.1-SNAPSHOT/org.apache.aries.jpa.blueprint.itest.bundle-1.0.1-SNAPSHOT.pom
[JENKINS] Archiving <https://builds.apache.org/job/AriesWithSnapshotDependencies/ws/aries-current-snapshots/transaction/transaction-itests/pom.xml> to /home/hudson/hudson/jobs/AriesWithSnapshotDependencies/modules/org.apache.aries.transaction$org.apache.aries.transaction.itests/builds/2013-02-01_18-00-53/archive/org.apache.aries.transaction/org.apache.aries.transaction.itests/1.0.1-SNAPSHOT/org.apache.aries.transaction.itests-1.0.1-SNAPSHOT.pom
[JENKINS] Archiving <https://builds.apache.org/job/AriesWithSnapshotDependencies/ws/aries-current-snapshots/transaction/transaction-itests/target/org.apache.aries.transaction.itests-1.0.1-SNAPSHOT.jar> to /home/hudson/hudson/jobs/AriesWithSnapshotDependencies/modules/org.apache.aries.transaction$org.apache.aries.transaction.itests/builds/2013-02-01_18-00-53/archive/org.apache.aries.transaction/org.apache.aries.transaction.itests/1.0.1-SNAPSHOT/org.apache.aries.transaction.itests-1.0.1-SNAPSHOT.jar
[JENKINS] Archiving <https://builds.apache.org/job/AriesWithSnapshotDependencies/ws/aries-current-snapshots/samples/ariestrader/assemblies/ariestrader-jdbc-eba/pom.xml> to /home/hudson/hudson/jobs/AriesWithSnapshotDependencies/modules/org.apache.aries.samples.ariestrader$org.apache.aries.samples.ariestrader.jdbc/builds/2013-02-01_18-01-00/archive/org.apache.aries.samples.ariestrader/org.apache.aries.samples.ariestrader.jdbc/1.0.1-SNAPSHOT/org.apache.aries.samples.ariestrader.jdbc-1.0.1-SNAPSHOT.pom
[JENKINS] Archiving <https://builds.apache.org/job/AriesWithSnapshotDependencies/ws/aries-current-snapshots/jmx/jmx-api/pom.xml> to /home/hudson/hudson/jobs/AriesWithSnapshotDependencies/modules/org.apache.aries.jmx$org.apache.aries.jmx.api/builds/2013-02-01_18-00-56/archive/org.apache.aries.jmx/org.apache.aries.jmx.api/1.1.1-SNAPSHOT/org.apache.aries.jmx.api-1.1.1-SNAPSHOT.pom
[JENKINS] Archiving <https://builds.apache.org/job/AriesWithSnapshotDependencies/ws/aries-current-snapshots/jmx/jmx-api/target/org.apache.aries.jmx.api-1.1.1-SNAPSHOT.jar> to /home/hudson/hudson/jobs/AriesWithSnapshotDependencies/modules/org.apache.aries.jmx$org.apache.aries.jmx.api/builds/2013-02-01_18-00-56/archive/org.apache.aries.jmx/org.apache.aries.jmx.api/1.1.1-SNAPSHOT/org.apache.aries.jmx.api-1.1.1-SNAPSHOT.jar
[JENKINS] Archiving <https://builds.apache.org/job/AriesWithSnapshotDependencies/ws/aries-current-snapshots/jmx/jmx-blueprint-bundle/pom.xml> to /home/hudson/hudson/jobs/AriesWithSnapshotDependencies/modules/org.apache.aries.jmx$org.apache.aries.jmx.blueprint/builds/2013-02-01_18-00-57/archive/org.apache.aries.jmx/org.apache.aries.jmx.blueprint/1.1.1-SNAPSHOT/org.apache.aries.jmx.blueprint-1.1.1-SNAPSHOT.pom
[JENKINS] Archiving <https://builds.apache.org/job/AriesWithSnapshotDependencies/ws/aries-current-snapshots/blueprint/blueprint-annotation-itest/pom.xml> to /home/hudson/hudson/jobs/AriesWithSnapshotDependencies/modules/org.apache.aries.blueprint$org.apache.aries.blueprint.annotation.itests/builds/2013-02-01_18-00-52/archive/org.apache.aries.blueprint/org.apache.aries.blueprint.annotation.itests/1.0.1-SNAPSHOT/org.apache.aries.blueprint.annotation.itests-1.0.1-SNAPSHOT.pom
[JENKINS] Archiving <https://builds.apache.org/job/AriesWithSnapshotDependencies/ws/aries-current-snapshots/blueprint/blueprint-annotation-itest/target/org.apache.aries.blueprint.annotation.itests-1.0.1-SNAPSHOT.jar> to /home/hudson/hudson/jobs/AriesWithSnapshotDependencies/modules/org.apache.aries.blueprint$org.apache.aries.blueprint.annotation.itests/builds/2013-02-01_18-00-52/archive/org.apache.aries.blueprint/org.apache.aries.blueprint.annotation.itests/1.0.1-SNAPSHOT/org.apache.aries.blueprint.annotation.itests-1.0.1-SNAPSHOT.jar
[JENKINS] Archiving <https://builds.apache.org/job/AriesWithSnapshotDependencies/ws/aries-current-snapshots/proxy/proxy-api/pom.xml> to /home/hudson/hudson/jobs/AriesWithSnapshotDependencies/modules/org.apache.aries.proxy$org.apache.aries.proxy.api/builds/2013-02-01_18-00-50/archive/org.apache.aries.proxy/org.apache.aries.proxy.api/1.0.1-SNAPSHOT/org.apache.aries.proxy.api-1.0.1-SNAPSHOT.pom
[JENKINS] Archiving <https://builds.apache.org/job/AriesWithSnapshotDependencies/ws/aries-current-snapshots/proxy/proxy-api/target/org.apache.aries.proxy.api-1.0.1-SNAPSHOT.jar> to /home/hudson/hudson/jobs/AriesWithSnapshotDependencies/modules/org.apache.aries.proxy$org.apache.aries.proxy.api/builds/2013-02-01_18-00-50/archive/org.apache.aries.proxy/org.apache.aries.proxy.api/1.0.1-SNAPSHOT/org.apache.aries.proxy.api-1.0.1-SNAPSHOT.jar
[JENKINS] Archiving <https://builds.apache.org/job/AriesWithSnapshotDependencies/ws/aries-current-snapshots/application/application-noop-resolver/pom.xml> to /home/hudson/hudson/jobs/AriesWithSnapshotDependencies/modules/org.apache.aries.application$org.apache.aries.application.resolver.noop/builds/2013-02-01_18-00-55/archive/org.apache.aries.application/org.apache.aries.application.resolver.noop/1.0.1-SNAPSHOT/org.apache.aries.application.resolver.noop-1.0.1-SNAPSHOT.pom
[JENKINS] Archiving <https://builds.apache.org/job/AriesWithSnapshotDependencies/ws/aries-current-snapshots/application/application-noop-resolver/target/org.apache.aries.application.resolver.noop-1.0.1-SNAPSHOT.jar> to /home/hudson/hudson/jobs/AriesWithSnapshotDependencies/modules/org.apache.aries.application$org.apache.aries.application.resolver.noop/builds/2013-02-01_18-00-55/archive/org.apache.aries.application/org.apache.aries.application.resolver.noop/1.0.1-SNAPSHOT/org.apache.aries.application.resolver.noop-1.0.1-SNAPSHOT.jar
[JENKINS] Archiving <https://builds.apache.org/job/AriesWithSnapshotDependencies/ws/aries-current-snapshots/testsupport/pom.xml> to /home/hudson/hudson/jobs/AriesWithSnapshotDependencies/modules/org.apache.aries.testsupport$testsupport/builds/2013-02-01_18-00-49/archive/org.apache.aries.testsupport/testsupport/1.0.0-SNAPSHOT/testsupport-1.0.0-SNAPSHOT.pom
[JENKINS] Archiving <https://builds.apache.org/job/AriesWithSnapshotDependencies/ws/aries-current-snapshots/util/pom.xml> to /home/hudson/hudson/jobs/AriesWithSnapshotDependencies/modules/org.apache.aries$org.apache.aries.util-parent/builds/2013-02-01_18-00-50/archive/org.apache.aries/org.apache.aries.util-parent/1.2.0-SNAPSHOT/org.apache.aries.util-parent-1.2.0-SNAPSHOT.pom
[JENKINS] Archiving <https://builds.apache.org/job/AriesWithSnapshotDependencies/ws/aries-current-snapshots/spi-fly/pom.xml> to /home/hudson/hudson/jobs/AriesWithSnapshotDependencies/modules/org.apache.aries.spifly$spifly/builds/2013-02-01_18-00-57/archive/org.apache.aries.spifly/spifly/1.0.0-SNAPSHOT/spifly-1.0.0-SNAPSHOT.pom
[JENKINS] Archiving <https://builds.apache.org/job/AriesWithSnapshotDependencies/ws/aries-current-snapshots/spi-fly/spi-fly-weaver/pom.xml> to /home/hudson/hudson/jobs/AriesWithSnapshotDependencies/modules/org.apache.aries.spifly$org.apache.aries.spifly.weaver-internal/builds/2013-02-01_18-00-58/archive/org.apache.aries.spifly/org.apache.aries.spifly.weaver-internal/1.0.0-SNAPSHOT/org.apache.aries.spifly.weaver-internal-1.0.0-SNAPSHOT.pom
[JENKINS] Archiving <https://builds.apache.org/job/AriesWithSnapshotDependencies/ws/aries-current-snapshots/pom.xml> to /home/hudson/hudson/jobs/AriesWithSnapshotDependencies/modules/org.apache.aries$aries/builds/2013-02-01_18-00-49/archive/org.apache.aries/aries/1.0.0-SNAPSHOT/aries-1.0.0-SNAPSHOT.pom
[JENKINS] Archiving <https://builds.apache.org/job/AriesWithSnapshotDependencies/ws/aries-current-snapshots/samples/ariestrader/modules/ariestrader-beans/pom.xml> to /home/hudson/hudson/jobs/AriesWithSnapshotDependencies/modules/org.apache.aries.samples.ariestrader$org.apache.aries.samples.ariestrader.beans/builds/2013-02-01_18-01-00/archive/org.apache.aries.samples.ariestrader/org.apache.aries.samples.ariestrader.beans/1.0.1-SNAPSHOT/org.apache.aries.samples.ariestrader.beans-1.0.1-SNAPSHOT.pom
[JENKINS] Archiving <https://builds.apache.org/job/AriesWithSnapshotDependencies/ws/aries-current-snapshots/samples/ariestrader/assemblies/ariestrader-all-eba/pom.xml> to /home/hudson/hudson/jobs/AriesWithSnapshotDependencies/modules/org.apache.aries.samples.ariestrader$org.apache.aries.samples.ariestrader.all/builds/2013-02-01_18-01-00/archive/org.apache.aries.samples.ariestrader/org.apache.aries.samples.ariestrader.all/1.0.1-SNAPSHOT/org.apache.aries.samples.ariestrader.all-1.0.1-SNAPSHOT.pom
[JENKINS] Archiving <https://builds.apache.org/job/AriesWithSnapshotDependencies/ws/aries-current-snapshots/spi-fly/spi-fly-examples/pom.xml> to /home/hudson/hudson/jobs/AriesWithSnapshotDependencies/modules/org.apache.aries.spifly.examples$examples/builds/2013-02-01_18-00-58/archive/org.apache.aries.spifly.examples/examples/1.0.0-SNAPSHOT/examples-1.0.0-SNAPSHOT.pom
[JENKINS] Archiving <https://builds.apache.org/job/AriesWithSnapshotDependencies/ws/aries-current-snapshots/samples/ariestrader/modules/ariestrader-persist-jpa-am/pom.xml> to /home/hudson/hudson/jobs/AriesWithSnapshotDependencies/modules/org.apache.aries.samples.ariestrader$org.apache.aries.samples.ariestrader.persist.jpa.am/builds/2013-02-01_18-01-00/archive/org.apache.aries.samples.ariestrader/org.apache.aries.samples.ariestrader.persist.jpa.am/1.0.1-SNAPSHOT/org.apache.aries.samples.ariestrader.persist.jpa.am-1.0.1-SNAPSHOT.pom
[JENKINS] Archiving <https://builds.apache.org/job/AriesWithSnapshotDependencies/ws/aries-current-snapshots/samples/pom.xml> to /home/hudson/hudson/jobs/AriesWithSnapshotDependencies/modules/org.apache.aries.samples$samples/builds/2013-02-01_18-00-58/archive/org.apache.aries.samples/samples/1.0.1-SNAPSHOT/samples-1.0.1-SNAPSHOT.pom
[JENKINS] Archiving <https://builds.apache.org/job/AriesWithSnapshotDependencies/ws/aries-current-snapshots/jpa/jpa-container/pom.xml> to /home/hudson/hudson/jobs/AriesWithSnapshotDependencies/modules/org.apache.aries.jpa$org.apache.aries.jpa.container/builds/2013-02-01_18-00-57/archive/org.apache.aries.jpa/org.apache.aries.jpa.container/1.0.1-SNAPSHOT/org.apache.aries.jpa.container-1.0.1-SNAPSHOT.pom
[JENKINS] Archiving <https://builds.apache.org/job/AriesWithSnapshotDependencies/ws/aries-current-snapshots/jpa/jpa-container/target/org.apache.aries.jpa.container-1.0.1-SNAPSHOT.jar> to /home/hudson/hudson/jobs/AriesWithSnapshotDependencies/modules/org.apache.aries.jpa$org.apache.aries.jpa.container/builds/2013-02-01_18-00-57/archive/org.apache.aries.jpa/org.apache.aries.jpa.container/1.0.1-SNAPSHOT/org.apache.aries.jpa.container-1.0.1-SNAPSHOT.jar
[JENKINS] Archiving <https://builds.apache.org/job/AriesWithSnapshotDependencies/ws/aries-current-snapshots/samples/blueprint/helloworld/pom.xml> to /home/hudson/hudson/jobs/AriesWithSnapshotDependencies/modules/org.apache.aries.samples$helloworld/builds/2013-02-01_18-01-00/archive/org.apache.aries.samples/helloworld/1.0.1-SNAPSHOT/helloworld-1.0.1-SNAPSHOT.pom
[JENKINS] Archiving <https://builds.apache.org/job/AriesWithSnapshotDependencies/ws/aries-current-snapshots/ejb/openejb-extender/pom.xml> to /home/hudson/hudson/jobs/AriesWithSnapshotDependencies/modules/org.apache.aries.ejb$org.apache.aries.ejb.openejb.extender/builds/2013-02-01_18-00-56/archive/org.apache.aries.ejb/org.apache.aries.ejb.openejb.extender/1.0.1-SNAPSHOT/org.apache.aries.ejb.openejb.extender-1.0.1-SNAPSHOT.pom
[JENKINS] Archiving <https://builds.apache.org/job/AriesWithSnapshotDependencies/ws/aries-current-snapshots/ejb/openejb-extender/target/org.apache.aries.ejb.openejb.extender-1.0.1-SNAPSHOT.jar> to /home/hudson/hudson/jobs/AriesWithSnapshotDependencies/modules/org.apache.aries.ejb$org.apache.aries.ejb.openejb.extender/builds/2013-02-01_18-00-56/archive/org.apache.aries.ejb/org.apache.aries.ejb.openejb.extender/1.0.1-SNAPSHOT/org.apache.aries.ejb.openejb.extender-1.0.1-SNAPSHOT.jar
[JENKINS] Archiving <https://builds.apache.org/job/AriesWithSnapshotDependencies/ws/aries-current-snapshots/samples/ariestrader/modules/ariestrader-util/pom.xml> to /home/hudson/hudson/jobs/AriesWithSnapshotDependencies/modules/org.apache.aries.samples.ariestrader$org.apache.aries.samples.ariestrader.util/builds/2013-02-01_18-00-59/archive/org.apache.aries.samples.ariestrader/org.apache.aries.samples.ariestrader.util/1.0.1-SNAPSHOT/org.apache.aries.samples.ariestrader.util-1.0.1-SNAPSHOT.pom
[JENKINS] Archiving <https://builds.apache.org/job/AriesWithSnapshotDependencies/ws/aries-current-snapshots/application/application-runtime/pom.xml> to /home/hudson/hudson/jobs/AriesWithSnapshotDependencies/modules/org.apache.aries.application$org.apache.aries.application.runtime/builds/2013-02-01_18-00-55/archive/org.apache.aries.application/org.apache.aries.application.runtime/1.0.1-SNAPSHOT/org.apache.aries.application.runtime-1.0.1-SNAPSHOT.pom
[JENKINS] Archiving <https://builds.apache.org/job/AriesWithSnapshotDependencies/ws/aries-current-snapshots/application/application-runtime/target/org.apache.aries.application.runtime-1.0.1-SNAPSHOT.jar> to /home/hudson/hudson/jobs/AriesWithSnapshotDependencies/modules/org.apache.aries.application$org.apache.aries.application.runtime/builds/2013-02-01_18-00-55/archive/org.apache.aries.application/org.apache.aries.application.runtime/1.0.1-SNAPSHOT/org.apache.aries.application.runtime-1.0.1-SNAPSHOT.jar
[JENKINS] Archiving <https://builds.apache.org/job/AriesWithSnapshotDependencies/ws/aries-current-snapshots/jpa/jpa-container-itest/pom.xml> to /home/hudson/hudson/jobs/AriesWithSnapshotDependencies/modules/org.apache.aries.jpa$org.apache.aries.jpa.container.itest/builds/2013-02-01_18-00-57/archive/org.apache.aries.jpa/org.apache.aries.jpa.container.itest/1.0.1-SNAPSHOT/org.apache.aries.jpa.container.itest-1.0.1-SNAPSHOT.pom
[JENKINS] Archiving <https://builds.apache.org/job/AriesWithSnapshotDependencies/ws/aries-current-snapshots/quiesce/quiesce-manager-itest/pom.xml> to /home/hudson/hudson/jobs/AriesWithSnapshotDependencies/modules/org.apache.aries.quiesce$org.apache.aries.quiesce.manager.itest/builds/2013-02-01_18-00-51/archive/org.apache.aries.quiesce/org.apache.aries.quiesce.manager.itest/1.0.1-SNAPSHOT/org.apache.aries.quiesce.manager.itest-1.0.1-SNAPSHOT.pom
[JENKINS] Archiving <https://builds.apache.org/job/AriesWithSnapshotDependencies/ws/aries-current-snapshots/quiesce/quiesce-manager-itest/target/org.apache.aries.quiesce.manager.itest-1.0.1-SNAPSHOT.jar> to /home/hudson/hudson/jobs/AriesWithSnapshotDependencies/modules/org.apache.aries.quiesce$org.apache.aries.quiesce.manager.itest/builds/2013-02-01_18-00-51/archive/org.apache.aries.quiesce/org.apache.aries.quiesce.manager.itest/1.0.1-SNAPSHOT/org.apache.aries.quiesce.manager.itest-1.0.1-SNAPSHOT.jar
[JENKINS] Archiving <https://builds.apache.org/job/AriesWithSnapshotDependencies/ws/aries-current-snapshots/transaction/transaction-jdbc/pom.xml> to /home/hudson/hudson/jobs/AriesWithSnapshotDependencies/modules/org.apache.aries.transaction$org.apache.aries.transaction.jdbc/builds/2013-02-01_18-00-53/archive/org.apache.aries.transaction/org.apache.aries.transaction.jdbc/1.0.1-SNAPSHOT/org.apache.aries.transaction.jdbc-1.0.1-SNAPSHOT.pom
[JENKINS] Archiving <https://builds.apache.org/job/AriesWithSnapshotDependencies/ws/aries-current-snapshots/transaction/transaction-jdbc/target/org.apache.aries.transaction.jdbc-1.0.1-SNAPSHOT.jar> to /home/hudson/hudson/jobs/AriesWithSnapshotDependencies/modules/org.apache.aries.transaction$org.apache.aries.transaction.jdbc/builds/2013-02-01_18-00-53/archive/org.apache.aries.transaction/org.apache.aries.transaction.jdbc/1.0.1-SNAPSHOT/org.apache.aries.transaction.jdbc-1.0.1-SNAPSHOT.jar
[JENKINS] Archiving <https://builds.apache.org/job/AriesWithSnapshotDependencies/ws/aries-current-snapshots/transaction/transaction-jdbc/target/xbean/org.apache.aries.transaction.jdbc.xsd> to /home/hudson/hudson/jobs/AriesWithSnapshotDependencies/modules/org.apache.aries.transaction$org.apache.aries.transaction.jdbc/builds/2013-02-01_18-00-53/archive/org.apache.aries.transaction/org.apache.aries.transaction.jdbc/1.0.1-SNAPSHOT/org.apache.aries.transaction.jdbc-1.0.1-SNAPSHOT.xsd
[JENKINS] Archiving <https://builds.apache.org/job/AriesWithSnapshotDependencies/ws/aries-current-snapshots/transaction/transaction-jdbc/target/xbean/org.apache.aries.transaction.jdbc.xsd.html> to /home/hudson/hudson/jobs/AriesWithSnapshotDependencies/modules/org.apache.aries.transaction$org.apache.aries.transaction.jdbc/builds/2013-02-01_18-00-53/archive/org.apache.aries.transaction/org.apache.aries.transaction.jdbc/1.0.1-SNAPSHOT/org.apache.aries.transaction.jdbc-1.0.1-SNAPSHOT-schema.html
[JENKINS] Archiving <https://builds.apache.org/job/AriesWithSnapshotDependencies/ws/aries-current-snapshots/samples/blueprint/idverifier/pom.xml> to /home/hudson/hudson/jobs/AriesWithSnapshotDependencies/modules/org.apache.aries.samples.blueprint.idverifier$idverifier/builds/2013-02-01_18-01-01/archive/org.apache.aries.samples.blueprint.idverifier/idverifier/1.0.1-SNAPSHOT/idverifier-1.0.1-SNAPSHOT.pom
[JENKINS] Archiving <https://builds.apache.org/job/AriesWithSnapshotDependencies/ws/aries-current-snapshots/blueprint/blueprint-annotation-impl/pom.xml> to /home/hudson/hudson/jobs/AriesWithSnapshotDependencies/modules/org.apache.aries.blueprint$org.apache.aries.blueprint.annotation.impl/builds/2013-02-01_18-00-52/archive/org.apache.aries.blueprint/org.apache.aries.blueprint.annotation.impl/1.0.1-SNAPSHOT/org.apache.aries.blueprint.annotation.impl-1.0.1-SNAPSHOT.pom
[JENKINS] Archiving <https://builds.apache.org/job/AriesWithSnapshotDependencies/ws/aries-current-snapshots/blueprint/blueprint-annotation-impl/target/org.apache.aries.blueprint.annotation.impl-1.0.1-SNAPSHOT.jar> to /home/hudson/hudson/jobs/AriesWithSnapshotDependencies/modules/org.apache.aries.blueprint$org.apache.aries.blueprint.annotation.impl/builds/2013-02-01_18-00-52/archive/org.apache.aries.blueprint/org.apache.aries.blueprint.annotation.impl/1.0.1-SNAPSHOT/org.apache.aries.blueprint.annotation.impl-1.0.1-SNAPSHOT.jar
[JENKINS] Archiving <https://builds.apache.org/job/AriesWithSnapshotDependencies/ws/aries-current-snapshots/application/application-modeller-standalone/pom.xml> to /home/hudson/hudson/jobs/AriesWithSnapshotDependencies/modules/org.apache.aries.application$application-modeller-standalone/builds/2013-02-01_18-00-55/archive/org.apache.aries.application/application-modeller-standalone/1.0.1-SNAPSHOT/application-modeller-standalone-1.0.1-SNAPSHOT.pom
[JENKINS] Archiving <https://builds.apache.org/job/AriesWithSnapshotDependencies/ws/aries-current-snapshots/application/application-modeller-standalone/target/application-modeller-standalone-1.0.1-SNAPSHOT.jar> to /home/hudson/hudson/jobs/AriesWithSnapshotDependencies/modules/org.apache.aries.application$application-modeller-standalone/builds/2013-02-01_18-00-55/archive/org.apache.aries.application/application-modeller-standalone/1.0.1-SNAPSHOT/application-modeller-standalone-1.0.1-SNAPSHOT.jar
[JENKINS] Archiving <https://builds.apache.org/job/AriesWithSnapshotDependencies/ws/aries-current-snapshots/application/application-modeller-standalone/target/application-modeller-standalone-1.0.1-SNAPSHOT-jar-with-dependencies.jar> to /home/hudson/hudson/jobs/AriesWithSnapshotDependencies/modules/org.apache.aries.application$application-modeller-standalone/builds/2013-02-01_18-00-55/archive/org.apache.aries.application/application-modeller-standalone/1.0.1-SNAPSHOT/application-modeller-standalone-1.0.1-SNAPSHOT-jar-with-dependencies.jar
[JENKINS] Archiving <https://builds.apache.org/job/AriesWithSnapshotDependencies/ws/aries-current-snapshots/jmx/jmx-blueprint-core/pom.xml> to /home/hudson/hudson/jobs/AriesWithSnapshotDependencies/modules/org.apache.aries.jmx$org.apache.aries.jmx.blueprint.core/builds/2013-02-01_18-00-57/archive/org.apache.aries.jmx/org.apache.aries.jmx.blueprint.core/1.1.1-SNAPSHOT/org.apache.aries.jmx.blueprint.core-1.1.1-SNAPSHOT.pom
[JENKINS] Archiving <https://builds.apache.org/job/AriesWithSnapshotDependencies/ws/aries-current-snapshots/samples/blog/blog-comment-ejb/pom.xml> to /home/hudson/hudson/jobs/AriesWithSnapshotDependencies/modules/org.apache.aries.samples.blog$org.apache.aries.samples.blog.comment.ejb/builds/2013-02-01_18-00-59/archive/org.apache.aries.samples.blog/org.apache.aries.samples.blog.comment.ejb/1.0.1-SNAPSHOT/org.apache.aries.samples.blog.comment.ejb-1.0.1-SNAPSHOT.pom
[JENKINS] Archiving <https://builds.apache.org/job/AriesWithSnapshotDependencies/ws/aries-current-snapshots/application/application-default-local-platform/pom.xml> to /home/hudson/hudson/jobs/AriesWithSnapshotDependencies/modules/org.apache.aries.application$org.apache.aries.application.default.local.platform/builds/2013-02-01_18-00-54/archive/org.apache.aries.application/org.apache.aries.application.default.local.platform/1.0.1-SNAPSHOT/org.apache.aries.application.default.local.platform-1.0.1-SNAPSHOT.pom
[JENKINS] Archiving <https://builds.apache.org/job/AriesWithSnapshotDependencies/ws/aries-current-snapshots/application/application-default-local-platform/target/org.apache.aries.application.default.local.platform-1.0.1-SNAPSHOT.jar> to /home/hudson/hudson/jobs/AriesWithSnapshotDependencies/modules/org.apache.aries.application$org.apache.aries.application.default.local.platform/builds/2013-02-01_18-00-54/archive/org.apache.aries.application/org.apache.aries.application.default.local.platform/1.0.1-SNAPSHOT/org.apache.aries.application.default.local.platform-1.0.1-SNAPSHOT.jar
[JENKINS] Archiving <https://builds.apache.org/job/AriesWithSnapshotDependencies/ws/aries-current-snapshots/blueprint/blueprint-core-compatibility/pom.xml> to /home/hudson/hudson/jobs/AriesWithSnapshotDependencies/modules/org.apache.aries.blueprint$org.apache.aries.blueprint.core.compatibility/builds/2013-02-01_18-00-51/archive/org.apache.aries.blueprint/org.apache.aries.blueprint.core.compatibility/1.0.1-SNAPSHOT/org.apache.aries.blueprint.core.compatibility-1.0.1-SNAPSHOT.pom
[JENKINS] Archiving <https://builds.apache.org/job/AriesWithSnapshotDependencies/ws/aries-current-snapshots/blueprint/blueprint-core-compatibility/target/org.apache.aries.blueprint.core.compatibility-1.0.1-SNAPSHOT.jar> to /home/hudson/hudson/jobs/AriesWithSnapshotDependencies/modules/org.apache.aries.blueprint$org.apache.aries.blueprint.core.compatibility/builds/2013-02-01_18-00-51/archive/org.apache.aries.blueprint/org.apache.aries.blueprint.core.compatibility/1.0.1-SNAPSHOT/org.apache.aries.blueprint.core.compatibility-1.0.1-SNAPSHOT.jar
[JENKINS] Archiving <https://builds.apache.org/job/AriesWithSnapshotDependencies/ws/aries-current-snapshots/blueprint/blueprint-core/pom.xml> to /home/hudson/hudson/jobs/AriesWithSnapshotDependencies/modules/org.apache.aries.blueprint$org.apache.aries.blueprint.core/builds/2013-02-01_18-00-51/archive/org.apache.aries.blueprint/org.apache.aries.blueprint.core/1.1.1-SNAPSHOT/org.apache.aries.blueprint.core-1.1.1-SNAPSHOT.pom
[JENKINS] Archiving <https://builds.apache.org/job/AriesWithSnapshotDependencies/ws/aries-current-snapshots/blueprint/blueprint-core/target/org.apache.aries.blueprint.core-1.1.1-SNAPSHOT.jar> to /home/hudson/hudson/jobs/AriesWithSnapshotDependencies/modules/org.apache.aries.blueprint$org.apache.aries.blueprint.core/builds/2013-02-01_18-00-51/archive/org.apache.aries.blueprint/org.apache.aries.blueprint.core/1.1.1-SNAPSHOT/org.apache.aries.blueprint.core-1.1.1-SNAPSHOT.jar
[JENKINS] Archiving <https://builds.apache.org/job/AriesWithSnapshotDependencies/ws/aries-current-snapshots/application/application-install/pom.xml> to /home/hudson/hudson/jobs/AriesWithSnapshotDependencies/modules/org.apache.aries.application$org.apache.aries.application.install/builds/2013-02-01_18-00-54/archive/org.apache.aries.application/org.apache.aries.application.install/1.0.1-SNAPSHOT/org.apache.aries.application.install-1.0.1-SNAPSHOT.pom
[JENKINS] Archiving <https://builds.apache.org/job/AriesWithSnapshotDependencies/ws/aries-current-snapshots/application/application-install/target/org.apache.aries.application.install-1.0.1-SNAPSHOT.jar> to /home/hudson/hudson/jobs/AriesWithSnapshotDependencies/modules/org.apache.aries.application$org.apache.aries.application.install/builds/2013-02-01_18-00-54/archive/org.apache.aries.application/org.apache.aries.application.install/1.0.1-SNAPSHOT/org.apache.aries.application.install-1.0.1-SNAPSHOT.jar
[JENKINS] Archiving <https://builds.apache.org/job/AriesWithSnapshotDependencies/ws/aries-current-snapshots/samples/blog/blog-assembly/pom.xml> to /home/hudson/hudson/jobs/AriesWithSnapshotDependencies/modules/org.apache.aries.samples.blog$org.apache.aries.samples.blog.assembly/builds/2013-02-01_18-00-59/archive/org.apache.aries.samples.blog/org.apache.aries.samples.blog.assembly/1.0.1-SNAPSHOT/org.apache.aries.samples.blog.assembly-1.0.1-SNAPSHOT.pom
[JENKINS] Archiving <https://builds.apache.org/job/AriesWithSnapshotDependencies/ws/aries-current-snapshots/jpa/jpa-container-context/pom.xml> to /home/hudson/hudson/jobs/AriesWithSnapshotDependencies/modules/org.apache.aries.jpa$org.apache.aries.jpa.container.context/builds/2013-02-01_18-00-57/archive/org.apache.aries.jpa/org.apache.aries.jpa.container.context/1.0.2-SNAPSHOT/org.apache.aries.jpa.container.context-1.0.2-SNAPSHOT.pom
[JENKINS] Archiving <https://builds.apache.org/job/AriesWithSnapshotDependencies/ws/aries-current-snapshots/jpa/jpa-container-context/target/org.apache.aries.jpa.container.context-1.0.2-SNAPSHOT.jar> to /home/hudson/hudson/jobs/AriesWithSnapshotDependencies/modules/org.apache.aries.jpa$org.apache.aries.jpa.container.context/builds/2013-02-01_18-00-57/archive/org.apache.aries.jpa/org.apache.aries.jpa.container.context/1.0.2-SNAPSHOT/org.apache.aries.jpa.container.context-1.0.2-SNAPSHOT.jar
[JENKINS] Archiving <https://builds.apache.org/job/AriesWithSnapshotDependencies/ws/aries-current-snapshots/blueprint/blueprint-noosgi/dependency-reduced-pom.xml> to /home/hudson/hudson/jobs/AriesWithSnapshotDependencies/modules/org.apache.aries.blueprint$org.apache.aries.blueprint.noosgi/builds/2013-02-01_18-00-52/archive/org.apache.aries.blueprint/org.apache.aries.blueprint.noosgi/1.0.0-SNAPSHOT/org.apache.aries.blueprint.noosgi-1.0.0-SNAPSHOT.pom
[JENKINS] Archiving <https://builds.apache.org/job/AriesWithSnapshotDependencies/ws/aries-current-snapshots/blueprint/blueprint-noosgi/target/org.apache.aries.blueprint.noosgi-1.0.0-SNAPSHOT.jar> to /home/hudson/hudson/jobs/AriesWithSnapshotDependencies/modules/org.apache.aries.blueprint$org.apache.aries.blueprint.noosgi/builds/2013-02-01_18-00-52/archive/org.apache.aries.blueprint/org.apache.aries.blueprint.noosgi/1.0.0-SNAPSHOT/org.apache.aries.blueprint.noosgi-1.0.0-SNAPSHOT.jar
[JENKINS] Archiving <https://builds.apache.org/job/AriesWithSnapshotDependencies/ws/aries-current-snapshots/blueprint/blueprint-sample-annotation/pom.xml> to /home/hudson/hudson/jobs/AriesWithSnapshotDependencies/modules/org.apache.aries.blueprint$org.apache.aries.blueprint.sample-annotation/builds/2013-02-01_18-00-52/archive/org.apache.aries.blueprint/org.apache.aries.blueprint.sample-annotation/1.0.1-SNAPSHOT/org.apache.aries.blueprint.sample-annotation-1.0.1-SNAPSHOT.pom
[JENKINS] Archiving <https://builds.apache.org/job/AriesWithSnapshotDependencies/ws/aries-current-snapshots/blueprint/blueprint-sample-annotation/target/org.apache.aries.blueprint.sample-annotation-1.0.1-SNAPSHOT.jar> to /home/hudson/hudson/jobs/AriesWithSnapshotDependencies/modules/org.apache.aries.blueprint$org.apache.aries.blueprint.sample-annotation/builds/2013-02-01_18-00-52/archive/org.apache.aries.blueprint/org.apache.aries.blueprint.sample-annotation/1.0.1-SNAPSHOT/org.apache.aries.blueprint.sample-annotation-1.0.1-SNAPSHOT.jar
[JENKINS] Archiving <https://builds.apache.org/job/AriesWithSnapshotDependencies/ws/aries-current-snapshots/samples/ariestrader/modules/pom.xml> to /home/hudson/hudson/jobs/AriesWithSnapshotDependencies/modules/org.apache.aries.samples.ariestrader$modules/builds/2013-02-01_18-00-59/archive/org.apache.aries.samples.ariestrader/modules/1.0.1-SNAPSHOT/modules-1.0.1-SNAPSHOT.pom
[JENKINS] Archiving <https://builds.apache.org/job/AriesWithSnapshotDependencies/ws/aries-current-snapshots/jndi/jndi-api/pom.xml> to /home/hudson/hudson/jobs/AriesWithSnapshotDependencies/modules/org.apache.aries.jndi$org.apache.aries.jndi.api/builds/2013-02-01_18-00-52/archive/org.apache.aries.jndi/org.apache.aries.jndi.api/1.0.1-SNAPSHOT/org.apache.aries.jndi.api-1.0.1-SNAPSHOT.pom
[JENKINS] Archiving <https://builds.apache.org/job/AriesWithSnapshotDependencies/ws/aries-current-snapshots/jndi/jndi-api/target/org.apache.aries.jndi.api-1.0.1-SNAPSHOT.jar> to /home/hudson/hudson/jobs/AriesWithSnapshotDependencies/modules/org.apache.aries.jndi$org.apache.aries.jndi.api/builds/2013-02-01_18-00-52/archive/org.apache.aries.jndi/org.apache.aries.jndi.api/1.0.1-SNAPSHOT/org.apache.aries.jndi.api-1.0.1-SNAPSHOT.jar
[JENKINS] Archiving <https://builds.apache.org/job/AriesWithSnapshotDependencies/ws/aries-current-snapshots/parent/default-parent/java6-parent/pom.xml> to /home/hudson/hudson/jobs/AriesWithSnapshotDependencies/modules/org.apache.aries$java6-parent/builds/2013-02-01_18-00-49/archive/org.apache.aries/java6-parent/1.0.1-SNAPSHOT/java6-parent-1.0.1-SNAPSHOT.pom
[JENKINS] Archiving <https://builds.apache.org/job/AriesWithSnapshotDependencies/ws/aries-current-snapshots/quiesce/quiesce-manager/pom.xml> to /home/hudson/hudson/jobs/AriesWithSnapshotDependencies/modules/org.apache.aries.quiesce$org.apache.aries.quiesce.manager/builds/2013-02-01_18-00-51/archive/org.apache.aries.quiesce/org.apache.aries.quiesce.manager/1.0.1-SNAPSHOT/org.apache.aries.quiesce.manager-1.0.1-SNAPSHOT.pom
[JENKINS] Archiving <https://builds.apache.org/job/AriesWithSnapshotDependencies/ws/aries-current-snapshots/quiesce/quiesce-manager/target/org.apache.aries.quiesce.manager-1.0.1-SNAPSHOT.jar> to /home/hudson/hudson/jobs/AriesWithSnapshotDependencies/modules/org.apache.aries.quiesce$org.apache.aries.quiesce.manager/builds/2013-02-01_18-00-51/archive/org.apache.aries.quiesce/org.apache.aries.quiesce.manager/1.0.1-SNAPSHOT/org.apache.aries.quiesce.manager-1.0.1-SNAPSHOT.jar
[JENKINS] Archiving <https://builds.apache.org/job/AriesWithSnapshotDependencies/ws/aries-current-snapshots/parent/pom.xml> to /home/hudson/hudson/jobs/AriesWithSnapshotDependencies/modules/org.apache.aries$parent/builds/2013-02-01_18-00-49/archive/org.apache.aries/parent/1.0.1-SNAPSHOT/parent-1.0.1-SNAPSHOT.pom
[JENKINS] Archiving <https://builds.apache.org/job/AriesWithSnapshotDependencies/ws/aries-current-snapshots/spi-fly/spi-fly-examples/spi-fly-example-provider2-bundle/pom.xml> to /home/hudson/hudson/jobs/AriesWithSnapshotDependencies/modules/org.apache.aries.spifly.examples$org.apache.aries.spifly.examples.provider2.bundle/builds/2013-02-01_18-00-58/archive/org.apache.aries.spifly.examples/org.apache.aries.spifly.examples.provider2.bundle/1.0.0-SNAPSHOT/org.apache.aries.spifly.examples.provider2.bundle-1.0.0-SNAPSHOT.pom
[JENKINS] Archiving <https://builds.apache.org/job/AriesWithSnapshotDependencies/ws/aries-current-snapshots/samples/blog/blog-jdbc-eba/pom.xml> to /home/hudson/hudson/jobs/AriesWithSnapshotDependencies/modules/org.apache.aries.samples.blog$org.apache.aries.samples.blog.jdbc.eba/builds/2013-02-01_18-00-59/archive/org.apache.aries.samples.blog/org.apache.aries.samples.blog.jdbc.eba/1.0.1-SNAPSHOT/org.apache.aries.samples.blog.jdbc.eba-1.0.1-SNAPSHOT.pom
[JENKINS] Archiving <https://builds.apache.org/job/AriesWithSnapshotDependencies/ws/aries-current-snapshots/jndi/jndi-url-itest-biz/pom.xml> to /home/hudson/hudson/jobs/AriesWithSnapshotDependencies/modules/org.apache.aries.jndi$org.apache.aries.jndi.url.itest.biz/builds/2013-02-01_18-00-53/archive/org.apache.aries.jndi/org.apache.aries.jndi.url.itest.biz/1.0.1-SNAPSHOT/org.apache.aries.jndi.url.itest.biz-1.0.1-SNAPSHOT.pom
[JENKINS] Archiving <https://builds.apache.org/job/AriesWithSnapshotDependencies/ws/aries-current-snapshots/jndi/jndi-url-itest-biz/target/org.apache.aries.jndi.url.itest.biz-1.0.1-SNAPSHOT.jar> to /home/hudson/hudson/jobs/AriesWithSnapshotDependencies/modules/org.apache.aries.jndi$org.apache.aries.jndi.url.itest.biz/builds/2013-02-01_18-00-53/archive/org.apache.aries.jndi/org.apache.aries.jndi.url.itest.biz/1.0.1-SNAPSHOT/org.apache.aries.jndi.url.itest.biz-1.0.1-SNAPSHOT.jar
Waiting for Jenkins to finish collecting data
mavenExecutionResult exceptions not empty
message : Failed to execute goal org.apache.aries.versioning:org.apache.aries.versioning.plugin:0.1.0:version-check (default-verify) on project org.apache.aries.jmx.core.whiteboard: Execution default-verify of goal org.apache.aries.versioning:org.apache.aries.versioning.plugin:0.1.0:version-check failed: Semantic Versioning incorrect
cause : Execution default-verify of goal org.apache.aries.versioning:org.apache.aries.versioning.plugin:0.1.0:version-check failed: Semantic Versioning incorrect
Stack trace : 
org.apache.maven.lifecycle.LifecycleExecutionException: Failed to execute goal org.apache.aries.versioning:org.apache.aries.versioning.plugin:0.1.0:version-check (default-verify) on project org.apache.aries.jmx.core.whiteboard: Execution default-verify of goal org.apache.aries.versioning:org.apache.aries.versioning.plugin:0.1.0:version-check failed: Semantic Versioning incorrect
	at org.apache.maven.lifecycle.internal.MojoExecutor.execute(MojoExecutor.java:225)
	at org.apache.maven.lifecycle.internal.MojoExecutor.execute(MojoExecutor.java:153)
	at org.apache.maven.lifecycle.internal.MojoExecutor.execute(MojoExecutor.java:145)
	at org.apache.maven.lifecycle.internal.LifecycleModuleBuilder.buildProject(LifecycleModuleBuilder.java:84)
	at org.apache.maven.lifecycle.internal.LifecycleModuleBuilder.buildProject(LifecycleModuleBuilder.java:59)
	at org.apache.maven.lifecycle.internal.LifecycleStarter.singleThreadedBuild(LifecycleStarter.java:183)
	at org.apache.maven.lifecycle.internal.LifecycleStarter.execute(LifecycleStarter.java:161)
	at org.apache.maven.DefaultMaven.doExecute(DefaultMaven.java:320)
	at org.apache.maven.DefaultMaven.execute(DefaultMaven.java:156)
	at org.jvnet.hudson.maven3.launcher.Maven3Launcher.main(Maven3Launcher.java:79)
	at sun.reflect.NativeMethodAccessorImpl.invoke0(Native Method)
	at sun.reflect.NativeMethodAccessorImpl.invoke(NativeMethodAccessorImpl.java:39)
	at sun.reflect.DelegatingMethodAccessorImpl.invoke(DelegatingMethodAccessorImpl.java:25)
	at java.lang.reflect.Method.invoke(Method.java:597)
	at org.codehaus.plexus.classworlds.launcher.Launcher.launchStandard(Launcher.java:329)
	at org.codehaus.plexus.classworlds.launcher.Launcher.launch(Launcher.java:239)
	at org.jvnet.hudson.maven3.agent.Maven3Main.launch(Maven3Main.java:158)
	at hudson.maven.Maven3Builder.call(Maven3Builder.java:100)
	at hudson.maven.Maven3Builder.call(Maven3Builder.java:66)
	at hudson.remoting.UserRequest.perform(UserRequest.java:118)
	at hudson.remoting.UserRequest.perform(UserRequest.java:48)
	at hudson.remoting.Request$2.run(Request.java:326)
	at hudson.remoting.InterceptingExecutorService$1.call(InterceptingExecutorService.java:72)
	at java.util.concurrent.FutureTask$Sync.innerRun(FutureTask.java:303)
	at java.util.concurrent.FutureTask.run(FutureTask.java:138)
	at java.util.concurrent.ThreadPoolExecutor$Worker.runTask(ThreadPoolExecutor.java:886)
	at java.util.concurrent.ThreadPoolExecutor$Worker.run(ThreadPoolExecutor.java:908)
	at java.lang.Thread.run(Thread.java:662)
Caused by: org.apache.maven.plugin.PluginExecutionException: Execution default-verify of goal org.apache.aries.versioning:org.apache.aries.versioning.plugin:0.1.0:version-check failed: Semantic Versioning incorrect
	at org.apache.maven.plugin.DefaultBuildPluginManager.executeMojo(DefaultBuildPluginManager.java:110)
	at org.apache.maven.lifecycle.internal.MojoExecutor.execute(MojoExecutor.java:209)
	... 27 more
Caused by: java.lang.RuntimeException: Semantic Versioning incorrect
	at org.apache.aries.versioning.mojo.VersionCheckerMojo.execute(VersionCheckerMojo.java:145)
	at org.apache.maven.plugin.DefaultBuildPluginManager.executeMojo(DefaultBuildPluginManager.java:101)
	... 28 more
Maven failed with error.
channel stopped

Mime
View raw message