aries-dev mailing list archives

Site index · List index
Message view « Date » · « Thread »
Top « Date » · « Thread »
From Apache Jenkins Server <jenk...@builds.apache.org>
Subject Build failed in Jenkins: AriesWithSnapshotDependencies #347
Date Fri, 01 Feb 2013 16:58:52 GMT
See <https://builds.apache.org/job/AriesWithSnapshotDependencies/347/changes>

Changes:

[dkulp] Update poms to use the releases now at central, particularly for version plugin

------------------------------------------
[...truncated 15473 lines...]
[INFO] ------------------------------------------------------------------------
[INFO] Reactor Summary:
[INFO] 
[INFO] Aries :: Top Parent POM ........................... SUCCESS [0.522s]
[INFO] Aries :: Default Parent POM ....................... SUCCESS [0.682s]
[INFO] Aries :: Java 5 Parent POM ........................ SUCCESS [0.889s]
[INFO] Aries :: Java 6 Parent POM ........................ SUCCESS [0.021s]
[INFO] Aries Maven EBA Plugin ............................ SUCCESS [11.046s]
[INFO] Apache Aries Unit Test Support .................... SUCCESS [14.563s]
[INFO] Apache Aries Test Support ......................... SUCCESS [0.350s]
[INFO] Apache Aries Util classes compiled under r 42 framework  SUCCESS [3.953s]
[INFO] Apache Aries Util ................................. SUCCESS [15.782s]
[INFO] Apache Aries Util ................................. SUCCESS [0.365s]
[INFO] org.apache.aries.versioning.checker ............... SUCCESS [4.292s]
[INFO] org.apache.aries.versioning.plugin Maven Mojo ..... SUCCESS [5.723s]
[INFO] Apache Aries Semantic Versioning Checker .......... SUCCESS [0.349s]
[INFO] Apache Aries Proxy API ............................ SUCCESS [1.644s]
[INFO] Apache Aries Proxy Service ........................ SUCCESS [2.584s]
[INFO] Apache Aries Proxy Bundle ......................... SUCCESS [1.250s]
[INFO] Apache Aries Proxy iTests ......................... SUCCESS [20.506s]
[INFO] Apache Aries Class Proxy .......................... SUCCESS [0.376s]
[INFO] Apache Aries Quiesce API .......................... SUCCESS [1.178s]
[INFO] Apache Aries Quiesce Manager ...................... SUCCESS [1.982s]
[INFO] Aries Quiesce Manager iTests ...................... SUCCESS [5.395s]
[INFO] Apache Aries Quiesce .............................. SUCCESS [0.388s]
[INFO] Apache Aries Blueprint API ........................ SUCCESS [1.417s]
[INFO] Apache Aries Blueprint Parser ..................... SUCCESS [5.187s]
[INFO] Apache Aries Blueprint Core ....................... SUCCESS [8.229s]
[INFO] Apache Aries Blueprint CM ......................... SUCCESS [7.107s]
[INFO] Apache Aries Blueprint Bundle ..................... SUCCESS [2.959s]
[INFO] Apache Aries Blueprint Compatiblity Fragment Bundle  SUCCESS [0.997s]
[INFO] Apache Aries Blueprint Core Compatiblity Fragment Bundle  SUCCESS [0.592s]
[INFO] Apache Aries Blueprint no-OSGI .................... SUCCESS [1.645s]
[INFO] Apache Aries Blueprint JEXL evaluator ............. SUCCESS [2.851s]
[INFO] Apache Aries Blueprint Sample ..................... SUCCESS [1.239s]
[INFO] Apache Aries Blueprint Annotation API ............. SUCCESS [0.867s]
[INFO] Apache Aries Blueprint Annotation Impl ............ SUCCESS [5.609s]
[INFO] Apache Aries Blueprint Sample for Testing Annotation  SUCCESS [1.078s]
[INFO] Apache Aries Blueprint Sample Fragment for Testing Annotation  SUCCESS [0.855s]
[INFO] Apache Aries Blueprint Test Bundle A .............. SUCCESS [1.554s]
[INFO] Apache Aries Blueprint Test Bundle B .............. SUCCESS [2.231s]
[INFO] Apache Aries Blueprint Test Quiesce Bundle ........ SUCCESS [0.995s]
[INFO] Apache Aries Blueprint iTests ..................... SUCCESS [4.587s]
[INFO] Apache Aries Blueprint Annotation iTests .......... SUCCESS [3.032s]
[INFO] Apache Aries Blueprint ............................ SUCCESS [0.345s]
[INFO] Apache Aries JNDI API ............................. SUCCESS [1.349s]
[INFO] Apache Aries JNDI Core ............................ SUCCESS [2.882s]
[INFO] Apache Aries JNDI URL Handler ..................... SUCCESS [2.580s]
[INFO] Apache Aries JNDI RMI Handler ..................... SUCCESS [1.427s]
[INFO] Apache Aries JNDI Bundle .......................... SUCCESS [3.287s]
[INFO] Apache Aries JNDI Support for Legacy Runtimes ..... SUCCESS [1.422s]
[INFO] Apache Aries JNDI "business logic" test bundle for Aries jndi-url iTests  SUCCESS [0.440s]
[INFO] Apache Aries JNDI Test Bundle for Aries jndi-url iTests  SUCCESS [2.403s]
[INFO] Apache Aries JNDI iTests for jndi-url ............. SUCCESS [19.024s]
[INFO] Apache Aries JNDI ................................. SUCCESS [0.012s]
[INFO] Apache Aries Transaction Manager .................. SUCCESS [10.309s]
[INFO] Apache Aries Transaction Blueprint ................ SUCCESS [1.995s]
[INFO] Apache Aries Transaction Enlisting JDBC Datasource  SUCCESS [11.079s]
[INFO] Apache Aries JMS Pool ............................. SUCCESS [3.851s]
[INFO] Apache Aries Transaction Integration Tests ........ SUCCESS [6.121s]
[INFO] Apache Aries Transaction Test Bundle .............. SUCCESS [0.817s]
[INFO] Apache Aries Transaction Test Datasource Configuration  SUCCESS [0.906s]
[INFO] Apache Aries Transaction - reactor pom ............ SUCCESS [0.341s]
[INFO] Apache Aries Web Url handler ...................... SUCCESS [1.825s]
[INFO] Apache Aries Web integration tests ................ SUCCESS [2.117s]
[INFO] Apache Aries Web Component ........................ SUCCESS [0.345s]
[INFO] Apache Aries Application API ...................... SUCCESS [1.869s]
[INFO] Apache Aries Application Utils .................... SUCCESS [2.652s]
[INFO] Apache Aries Application Bundle ................... SUCCESS [5.333s]
[INFO] Apache Aries Application Converters ............... SUCCESS [4.179s]
[INFO] Apache Aries Application Default local platform ... SUCCESS [1.316s]
[INFO] Apache Aries Application Deployment Management .... SUCCESS [0.914s]
[INFO] Apache Aries Application Installer ................ SUCCESS [2.637s]
[INFO] Apache Aries Application itests sample application interface  SUCCESS [0.457s]
[INFO] Apache Aries Application integration tests ........ SUCCESS [9.429s]
[INFO] Apache Aries Application Management ............... SUCCESS [0.877s]
[INFO] Apache Aries Application Modelling ................ SUCCESS [1.725s]
[INFO] Apache Aries Application Modelling Standalone ..... SUCCESS [1:01.290s]
[INFO] Apache Aries Application Modelling tests .......... SUCCESS [4.836s]
[INFO] Apache Aries Application No-op Resolver ........... SUCCESS [0.519s]
[INFO] Apache Aries Application OBR Resolver ............. SUCCESS [1.072s]
[INFO] Apache Aries Application Resolve CM Transform ..... SUCCESS [0.537s]
[INFO] Apache Aries Application Resolve CM Transform iTests  SUCCESS [0.135s]
[INFO] Apache Aries Application Runtime .................. SUCCESS [0.593s]
[INFO] Apache Aries Isolated Application Runtime ......... SUCCESS [0.661s]
[INFO] Apache Aries Bundle Framework provider ............ SUCCESS [0.716s]
[INFO] Apache Aries Bundle Framework Manager provider .... SUCCESS [0.921s]
[INFO] Apache Aries repository generator tool ............ SUCCESS [6.773s]
[INFO] Apache Aries Bundle Repository provider ........... SUCCESS [0.658s]
[INFO] Application distribution .......................... SUCCESS [1.982s]
[INFO] Application distribution for isolated application support  SUCCESS [1.569s]
[INFO] Apache Aries Application .......................... SUCCESS [0.011s]
[INFO] Apache Aries Subsystem API ........................ SUCCESS [2.791s]
[INFO] Apache Aries Subsystem Core ....................... SUCCESS [5.126s]
[INFO] Apache Aries Subsystem OBR ........................ SUCCESS [0.718s]
[INFO] Apache Aries Subsystem iTests interfaces bundle ... SUCCESS [0.385s]
[INFO] Apache Aries Subsystem iTests ..................... FAILURE [5.894s]
[INFO] Apache Aries Subsystems Bundle .................... SKIPPED
[INFO] Apache Aries Subsystem ............................ SKIPPED
[INFO] Aries EJB Modelling Integration ................... SKIPPED
[INFO] Aries EJB Modelling iTests ........................ SKIPPED
[INFO] Aries OpenEJB Runtime Extender .................... SKIPPED
[INFO] Aries EJB Extender iTests ......................... SKIPPED
[INFO] Aries EJB Component ............................... SKIPPED
[INFO] Apache Aries JMX API .............................. SKIPPED
[INFO] Apache Aries JMX Blueprint API .................... SKIPPED
[INFO] Apache Aries JMX Core ............................. SKIPPED
[INFO] Apache Aries JMX Core via Whiteboards ............. SKIPPED
[INFO] Apache Aries Whiteboard support for JMX DynamicMBean services  SKIPPED
[INFO] Apache Aries JMX Blueprint Core ................... SKIPPED
[INFO] Apache Aries JMX Bundle ........................... SKIPPED
[INFO] Apache Aries JMX Blueprint Bundle ................. SKIPPED
[INFO] Apache Aries JMX integration tests ................ SKIPPED
[INFO] Apache Aries JMX .................................. SKIPPED
[INFO] Aries JPA Container API ........................... SKIPPED
[INFO] Aries JPA Container ............................... SKIPPED
[INFO] Aries JPA Container Managed Contexts .............. SKIPPED
[INFO] Aries JPA Container blueprint integration for Aries blueprint  SKIPPED
[INFO] Test Bundle for Aries JPA Container iTests ........ SKIPPED
[INFO] Test Bundle for Aries JPA Container advanced iTests  SKIPPED
[INFO] Aries JPA iTests .................................. SKIPPED
[INFO] Test Bundle for Aries JPA Blueprint iTests ........ SKIPPED
[INFO] Aries JPA Component ............................... SKIPPED
[INFO] Apache Aries SPI Fly Core (internal module) ....... SKIPPED
[INFO] Apache Aries SPI Fly Weaver (internal module) ..... SKIPPED
[INFO] Apache Aries SPI Fly Dynamic Weaving Bundle ....... SKIPPED
[INFO] Apache Aries SPI Fly Static Weaving Tool .......... SKIPPED
[INFO] Apache Aries SPI Fly Static Weaving Bundle ........ SKIPPED
[INFO] Apache Aries SPI Fly Examples ..................... SKIPPED
[INFO] Apache Aries Example SPI Interface ................ SKIPPED
[INFO] Apache Aries Example SPI Provider Jar 1 ........... SKIPPED
[INFO] Apache Aries Example SPI Provider Bundle 1 ........ SKIPPED
[INFO] Apache Aries Example SPI Provider Bundle 2 ........ SKIPPED
[INFO] Apache Aries Example SPI Client Jar 1 ............. SKIPPED
[INFO] Apache Aries Example SPI Client Bundle 1 .......... SKIPPED
[INFO] Apache Aries Example SPI Client Bundle 2 .......... SKIPPED
[INFO] Apache Aries Example Resource Provider Bundle ..... SKIPPED
[INFO] Apache Aries Example Resource Client Bundle ....... SKIPPED
[INFO] Apache Aries SPI Fly .............................. SKIPPED
[INFO] Apache Aries Samples .............................. SKIPPED
[INFO] Apache Aries blog sample .......................... SKIPPED
[INFO] Apache Aries blog sample API ...................... SKIPPED
[INFO] Apache Aries blog sample transaction enlisting JDBC datasource  SKIPPED
[INFO] Apache Aries blog sample assembly ................. SKIPPED
[INFO] Apache Aries blog sample .......................... SKIPPED
[INFO] Apache Aries blog sample web component ............ SKIPPED
[INFO] Apache Aries blog sample persistence .............. SKIPPED
[INFO] Apache Aries Blog Sample EBA using JDBC ........... SKIPPED
[INFO] Apache Aries blog sample persistence .............. SKIPPED
[INFO] Apache Aries Blog Sample EBA using JPA ............ SKIPPED
[INFO] Apache Aries blog sample commenting EJB ........... SKIPPED
[INFO] Apache Aries Blog sample iTests ................... SKIPPED
[INFO] AriesTrader :: Performance Benchmark Sample ....... SKIPPED
[INFO] AriesTrader :: Modules ............................ SKIPPED
[INFO] AriesTrader :: Modules - Util ..................... SKIPPED
[INFO] AriesTrader :: Modules - API ...................... SKIPPED
[INFO] AriesTrader :: Modules - Core ..................... SKIPPED
[INFO] AriesTrader :: Modules - Web ...................... SKIPPED
[INFO] AriesTrader :: Modules - Beans .................... SKIPPED
[INFO] AriesTrader :: Modules - Entities ................. SKIPPED
[INFO] AriesTrader :: Modules - Derby DataSource ......... SKIPPED
[INFO] AriesTrader :: Modules - Persist JDBC ............. SKIPPED
[INFO] AriesTrader :: Modules - Persist JPA App Managed .. SKIPPED
[INFO] AriesTrader :: Modules - Persist JPA Container Managed  SKIPPED
[INFO] AriesTrader :: Assemblies ......................... SKIPPED
[INFO] AriesTrader :: Assemblies - EBA - JDBC ............ SKIPPED
[INFO] AriesTrader :: Assemblies - EBA - ALL ............. SKIPPED
[INFO] Equinox test harness that can be used to install sample EBAs  SKIPPED
[INFO] Apache Aries Blueprint samples .................... SKIPPED
[INFO] Apache Aries Blueprint HelloWorld ................. SKIPPED
[INFO] Apache Aries Blueprint HelloWorld API ............. SKIPPED
[INFO] Apache Aries Blueprint HelloWorldServer ........... SKIPPED
[INFO] Apache Aries Blueprint HelloWorldClient ........... SKIPPED
[INFO] Apache Aries Blueprint HelloWorld Assembly ........ SKIPPED
[INFO] Apache Aries Blueprint HelloWorld EBA ............. SKIPPED
[INFO] Apache Aries Blueprint sample iTests .............. SKIPPED
[INFO] Apache Aries Blueprint Sample - ID Verifier ....... SKIPPED
[INFO] Apache Aries Blueprint Sample - ID Verifier API ... SKIPPED
[INFO] Apache Aries Blueprint Sample - ID Verifier Server  SKIPPED
[INFO] Apache Aries Blueprint Sample - ID Verifier Client  SKIPPED
[INFO] Apache Aries Blueprint Sample - ID Verifier Assembly  SKIPPED
[INFO] Apache Aries Twitter sample ....................... SKIPPED
[INFO] Apache Aries Bundlise Twitter4j ................... SKIPPED
[INFO] Apache Aries Twitter bundle ....................... SKIPPED
[INFO] Apache Aries Twitter EBA .......................... SKIPPED
[INFO] Apache Aries Twitter sample integration tests ..... SKIPPED
[INFO] Apache Aries ...................................... SKIPPED
[INFO] ------------------------------------------------------------------------
[INFO] BUILD FAILURE
[INFO] ------------------------------------------------------------------------
[INFO] Total time: 5:57.163s
[INFO] Finished at: Fri Feb 01 16:58:51 UTC 2013
[INFO] Final Memory: 239M/620M
[INFO] ------------------------------------------------------------------------
[ERROR] Failed to execute goal on project org.apache.aries.subsystem.itests: Could not resolve
dependencies for project org.apache.aries.subsystem:org.apache.aries.subsystem.itests:jar:1.0.0-SNAPSHOT:
Could not find artifact org.apache.aries.proxy:org.apache.aries.proxy:jar:1.0.1-SNAPSHOT in
codehaus.snapshots (http://snapshots.repository.codehaus.org) -> [Help 1]
org.apache.maven.lifecycle.LifecycleExecutionException: Failed to execute goal on project
org.apache.aries.subsystem.itests: Could not resolve dependencies for project org.apache.aries.subsystem:org.apache.aries.subsystem.itests:jar:1.0.0-SNAPSHOT:
Could not find artifact org.apache.aries.proxy:org.apache.aries.proxy:jar:1.0.1-SNAPSHOT in
codehaus.snapshots (http://snapshots.repository.codehaus.org)
	at org.apache.maven.lifecycle.internal.LifecycleDependencyResolver.getDependencies(LifecycleDependencyResolver.java:196)
	at org.apache.maven.lifecycle.internal.LifecycleDependencyResolver.resolveProjectDependencies(LifecycleDependencyResolver.java:108)
	at org.apache.maven.lifecycle.internal.MojoExecutor.ensureDependenciesAreResolved(MojoExecutor.java:258)
	at org.apache.maven.lifecycle.internal.MojoExecutor.execute(MojoExecutor.java:201)
	at org.apache.maven.lifecycle.internal.MojoExecutor.execute(MojoExecutor.java:153)
	at org.apache.maven.lifecycle.internal.MojoExecutor.execute(MojoExecutor.java:145)
	at org.apache.maven.lifecycle.internal.LifecycleModuleBuilder.buildProject(LifecycleModuleBuilder.java:84)
	at org.apache.maven.lifecycle.internal.LifecycleModuleBuilder.buildProject(LifecycleModuleBuilder.java:59)
	at org.apache.maven.lifecycle.internal.LifecycleStarter.singleThreadedBuild(LifecycleStarter.java:183)
	at org.apache.maven.lifecycle.internal.LifecycleStarter.execute(LifecycleStarter.java:161)
	at org.apache.maven.DefaultMaven.doExecute(DefaultMaven.java:319)
	at org.apache.maven.DefaultMaven.execute(DefaultMaven.java:156)
	at org.apache.maven.cli.MavenCli.execute(MavenCli.java:537)
	at org.apache.maven.cli.MavenCli.doMain(MavenCli.java:196)
	at org.apache.maven.cli.MavenCli.main(MavenCli.java:141)
	at sun.reflect.NativeMethodAccessorImpl.invoke0(Native Method)
	at sun.reflect.NativeMethodAccessorImpl.invoke(NativeMethodAccessorImpl.java:39)
	at sun.reflect.DelegatingMethodAccessorImpl.invoke(DelegatingMethodAccessorImpl.java:25)
	at java.lang.reflect.Method.invoke(Method.java:597)
	at org.codehaus.plexus.classworlds.launcher.Launcher.launchEnhanced(Launcher.java:290)
	at org.codehaus.plexus.classworlds.launcher.Launcher.launch(Launcher.java:230)
	at org.codehaus.plexus.classworlds.launcher.Launcher.mainWithExitCode(Launcher.java:409)
	at org.codehaus.plexus.classworlds.launcher.Launcher.main(Launcher.java:352)
Caused by: org.apache.maven.project.DependencyResolutionException: Could not resolve dependencies
for project org.apache.aries.subsystem:org.apache.aries.subsystem.itests:jar:1.0.0-SNAPSHOT:
Could not find artifact org.apache.aries.proxy:org.apache.aries.proxy:jar:1.0.1-SNAPSHOT in
codehaus.snapshots (http://snapshots.repository.codehaus.org)
	at org.apache.maven.project.DefaultProjectDependenciesResolver.resolve(DefaultProjectDependenciesResolver.java:170)
	at org.apache.maven.lifecycle.internal.LifecycleDependencyResolver.getDependencies(LifecycleDependencyResolver.java:171)
	... 22 more
Caused by: org.sonatype.aether.resolution.DependencyResolutionException: Could not find artifact
org.apache.aries.proxy:org.apache.aries.proxy:jar:1.0.1-SNAPSHOT in codehaus.snapshots (http://snapshots.repository.codehaus.org)
	at org.sonatype.aether.impl.internal.DefaultRepositorySystem.resolveDependencies(DefaultRepositorySystem.java:412)
	at org.apache.maven.project.DefaultProjectDependenciesResolver.resolve(DefaultProjectDependenciesResolver.java:164)
	... 23 more
Caused by: org.sonatype.aether.resolution.ArtifactResolutionException: Could not find artifact
org.apache.aries.proxy:org.apache.aries.proxy:jar:1.0.1-SNAPSHOT in codehaus.snapshots (http://snapshots.repository.codehaus.org)
	at org.sonatype.aether.impl.internal.DefaultArtifactResolver.resolve(DefaultArtifactResolver.java:541)
	at org.sonatype.aether.impl.internal.DefaultArtifactResolver.resolveArtifacts(DefaultArtifactResolver.java:220)
	at org.sonatype.aether.impl.internal.DefaultRepositorySystem.resolveDependencies(DefaultRepositorySystem.java:395)
	... 24 more
Caused by: org.sonatype.aether.transfer.ArtifactNotFoundException: Could not find artifact
org.apache.aries.proxy:org.apache.aries.proxy:jar:1.0.1-SNAPSHOT in codehaus.snapshots (http://snapshots.repository.codehaus.org)
	at org.sonatype.aether.connector.wagon.WagonRepositoryConnector$4.wrap(WagonRepositoryConnector.java:945)
	at org.sonatype.aether.connector.wagon.WagonRepositoryConnector$4.wrap(WagonRepositoryConnector.java:940)
	at org.sonatype.aether.connector.wagon.WagonRepositoryConnector$GetTask.flush(WagonRepositoryConnector.java:695)
	at org.sonatype.aether.connector.wagon.WagonRepositoryConnector$GetTask.flush(WagonRepositoryConnector.java:689)
	at org.sonatype.aether.connector.wagon.WagonRepositoryConnector.get(WagonRepositoryConnector.java:445)
	at org.sonatype.aether.impl.internal.DefaultArtifactResolver.resolve(DefaultArtifactResolver.java:460)
	... 26 more
[ERROR] 
[ERROR] Re-run Maven using the -X switch to enable full debug logging.
[ERROR] 
[ERROR] For more information about the errors and possible solutions, please read the following
articles:
[ERROR] [Help 1] http://cwiki.apache.org/confluence/display/MAVEN/DependencyResolutionException
[ERROR] 
[ERROR] After correcting the problems, you can resume the build with the command
[ERROR]   mvn <goals> -rf :org.apache.aries.subsystem.itests
Build step 'Invoke top-level Maven targets' marked build as failure

Mime
View raw message