aries-dev mailing list archives

Site index · List index
Message view « Date » · « Thread »
Top « Date » · « Thread »
From Apache Jenkins Server <jenk...@builds.apache.org>
Subject Build failed in Jenkins: AriesWithSnapshotDependencies #364
Date Wed, 06 Mar 2013 20:59:06 GMT
See <https://builds.apache.org/job/AriesWithSnapshotDependencies/364/changes>

Changes:

[jwross] [ARIES-1022] Support for mandatory directive for osgi.wiring.[package | bundle |
host] namespaces

Added support for the mandatory directive when matching capabilities to requirements plus
tests.

------------------------------------------
[...truncated 47359 lines...]

[INFO] --- maven-resources-plugin:2.4:testResources (default-testResources) @ org.apache.aries.blueprint.testbundlea
---
[INFO] [INFO] No sources to compile

[INFO] --- maven-compiler-plugin:2.0.2:testCompile (default-testCompile) @ org.apache.aries.blueprint.testbundlea
---
[INFO] [INFO] Surefire report directory: <https://builds.apache.org/job/AriesWithSnapshotDependencies/ws/aries-current-snapshots/blueprint/blueprint-testbundlea/target/surefire-reports>

[INFO] --- maven-surefire-plugin:2.4.3:test (default-test) @ org.apache.aries.blueprint.testbundlea
---

-------------------------------------------------------
 T E S T S
-------------------------------------------------------
There are no tests to run.

Results :

Tests run: 0, Failures: 0, Errors: 0, Skipped: 0

[JENKINS] Recording test results[INFO] Checking unresolved references to org.codehaus.mojo.signature:java15:1.0

[INFO] 
[INFO] --- maven-enforcer-plugin:1.0-beta-1:enforce (check-java15) @ org.apache.aries.blueprint.testbundlea
---
[INFO] 
[INFO] --- maven-bundle-plugin:2.3.4:bundle (default-bundle) @ org.apache.aries.blueprint.testbundlea
---
[INFO] [INFO] Checking legal files in: org.apache.aries.blueprint.testbundlea-1.0.1-SNAPSHOT.jar

[INFO] --- ianal-maven-plugin:1.0-alpha-1:verify-legal-files (default) @ org.apache.aries.blueprint.testbundlea
---
[INFO] Installing <https://builds.apache.org/job/AriesWithSnapshotDependencies/ws/aries-current-snapshots/blueprint/blueprint-testbundlea/target/org.apache.aries.blueprint.testbundlea-1.0.1-SNAPSHOT.jar>
to <https://builds.apache.org/job/AriesWithSnapshotDependencies/ws/.repository/org/apache/aries/blueprint/org.apache.aries.blueprint.testbundlea/1.0.1-SNAPSHOT/org.apache.aries.blueprint.testbundlea-1.0.1-SNAPSHOT.jar>
[INFO] [INFO] Installing <https://builds.apache.org/job/AriesWithSnapshotDependencies/ws/aries-current-snapshots/blueprint/blueprint-testbundlea/pom.xml>
to <https://builds.apache.org/job/AriesWithSnapshotDependencies/ws/.repository/org/apache/aries/blueprint/org.apache.aries.blueprint.testbundlea/1.0.1-SNAPSHOT/org.apache.aries.blueprint.testbundlea-1.0.1-SNAPSHOT.pom>

[INFO] --- maven-install-plugin:2.3:install (default-install) @ org.apache.aries.blueprint.testbundlea
---
[INFO] [INFO] Installing org/apache/aries/blueprint/org.apache.aries.blueprint.testbundlea/1.0.1-SNAPSHOT/org.apache.aries.blueprint.testbundlea-1.0.1-SNAPSHOT.jar
[INFO] Writing OBR metadata

[INFO] --- maven-bundle-plugin:2.3.4:install (default-install) @ org.apache.aries.blueprint.testbundlea
---
[INFO] [INFO] Deleting file set: <https://builds.apache.org/job/AriesWithSnapshotDependencies/ws/aries-current-snapshots/blueprint/blueprint-testbundleb/target>
(included: [**], excluded: [])
                                                                        
[INFO] ------------------------------------------------------------------------
[INFO] Building Apache Aries Blueprint Test Bundle B 1.0.2-SNAPSHOT
[INFO] ------------------------------------------------------------------------
[INFO] 
[INFO] --- maven-clean-plugin:2.3:clean (default-clean) @ org.apache.aries.blueprint.testbundleb
---
[INFO] 
[INFO] --- maven-enforcer-plugin:1.0-beta-1:enforce (default) @ org.apache.aries.blueprint.testbundleb
---
[INFO] 
[INFO] --- maven-remote-resources-plugin:1.1:process (default) @ org.apache.aries.blueprint.testbundleb
---
[INFO] [INFO] Using 'UTF-8' encoding to copy filtered resources.
[INFO] Copying 3 resources
[INFO] skip non existing resourceDirectory <https://builds.apache.org/job/AriesWithSnapshotDependencies/ws/aries-current-snapshots/blueprint/blueprint-testbundleb/src/main/filtered-resources>
[INFO] Copying 0 resource
[INFO] Copying 3 resources

[INFO] --- maven-resources-plugin:2.4:resources (default-resources) @ org.apache.aries.blueprint.testbundleb
---
[INFO] [INFO] Compiling 4 source files to <https://builds.apache.org/job/AriesWithSnapshotDependencies/ws/aries-current-snapshots/blueprint/blueprint-testbundleb/target/classes>

[INFO] --- maven-compiler-plugin:2.0.2:compile (default-compile) @ org.apache.aries.blueprint.testbundleb
---
[INFO] [INFO] Using 'UTF-8' encoding to copy filtered resources.
[INFO] skip non existing resourceDirectory <https://builds.apache.org/job/AriesWithSnapshotDependencies/ws/aries-current-snapshots/blueprint/blueprint-testbundleb/src/test/resources>
[INFO] skip non existing resourceDirectory <https://builds.apache.org/job/AriesWithSnapshotDependencies/ws/aries-current-snapshots/blueprint/blueprint-testbundleb/src/test/filtered-resources>
[INFO] Copying 3 resources

[INFO] --- maven-resources-plugin:2.4:testResources (default-testResources) @ org.apache.aries.blueprint.testbundleb
---
[INFO] [INFO] No sources to compile

[INFO] --- maven-compiler-plugin:2.0.2:testCompile (default-testCompile) @ org.apache.aries.blueprint.testbundleb
---
[INFO] [INFO] Surefire report directory: <https://builds.apache.org/job/AriesWithSnapshotDependencies/ws/aries-current-snapshots/blueprint/blueprint-testbundleb/target/surefire-reports>

[INFO] --- maven-surefire-plugin:2.4.3:test (default-test) @ org.apache.aries.blueprint.testbundleb
---

-------------------------------------------------------
 T E S T S
-------------------------------------------------------
There are no tests to run.

Results :

Tests run: 0, Failures: 0, Errors: 0, Skipped: 0

[JENKINS] Recording test results[INFO] Checking unresolved references to org.codehaus.mojo.signature:java15:1.0

[INFO] 
[INFO] --- maven-enforcer-plugin:1.0-beta-1:enforce (check-java15) @ org.apache.aries.blueprint.testbundleb
---
[INFO] 
[INFO] --- maven-bundle-plugin:2.3.4:bundle (default-bundle) @ org.apache.aries.blueprint.testbundleb
---
[INFO] [INFO] Checking legal files in: org.apache.aries.blueprint.testbundleb-1.0.2-SNAPSHOT.jar

[INFO] --- ianal-maven-plugin:1.0-alpha-1:verify-legal-files (default) @ org.apache.aries.blueprint.testbundleb
---
[INFO] [INFO] Installing <https://builds.apache.org/job/AriesWithSnapshotDependencies/ws/aries-current-snapshots/blueprint/blueprint-testbundleb/target/org.apache.aries.blueprint.testbundleb-1.0.2-SNAPSHOT.jar>
to <https://builds.apache.org/job/AriesWithSnapshotDependencies/ws/.repository/org/apache/aries/blueprint/org.apache.aries.blueprint.testbundleb/1.0.2-SNAPSHOT/org.apache.aries.blueprint.testbundleb-1.0.2-SNAPSHOT.jar>
[INFO] Installing <https://builds.apache.org/job/AriesWithSnapshotDependencies/ws/aries-current-snapshots/blueprint/blueprint-testbundleb/pom.xml>
to <https://builds.apache.org/job/AriesWithSnapshotDependencies/ws/.repository/org/apache/aries/blueprint/org.apache.aries.blueprint.testbundleb/1.0.2-SNAPSHOT/org.apache.aries.blueprint.testbundleb-1.0.2-SNAPSHOT.pom>

[INFO] --- maven-install-plugin:2.3:install (default-install) @ org.apache.aries.blueprint.testbundleb
---
[INFO] [INFO] Installing org/apache/aries/blueprint/org.apache.aries.blueprint.testbundleb/1.0.2-SNAPSHOT/org.apache.aries.blueprint.testbundleb-1.0.2-SNAPSHOT.jar
[INFO] Writing OBR metadata

[INFO] --- maven-bundle-plugin:2.3.4:install (default-install) @ org.apache.aries.blueprint.testbundleb
---
[INFO] Deleting file set: <https://builds.apache.org/job/AriesWithSnapshotDependencies/ws/aries-current-snapshots/blueprint/blueprint-testquiescebundle/target>
(included: [**], excluded: [])
[INFO]                                                                         
[INFO] ------------------------------------------------------------------------
[INFO] Building Apache Aries Blueprint Test Quiesce Bundle 1.0.1-SNAPSHOT
[INFO] ------------------------------------------------------------------------
[INFO] 
[INFO] --- maven-clean-plugin:2.3:clean (default-clean) @ org.apache.aries.blueprint.testquiescebundle
---
[INFO] 
[INFO] --- maven-enforcer-plugin:1.0-beta-1:enforce (default) @ org.apache.aries.blueprint.testquiescebundle
---
[INFO] 
[INFO] --- maven-remote-resources-plugin:1.1:process (default) @ org.apache.aries.blueprint.testquiescebundle
---
[INFO] [INFO] Using 'UTF-8' encoding to copy filtered resources.
[INFO] Copying 1 resource
[INFO] skip non existing resourceDirectory <https://builds.apache.org/job/AriesWithSnapshotDependencies/ws/aries-current-snapshots/blueprint/blueprint-testquiescebundle/src/main/filtered-resources>
[INFO] Copying 0 resource
[INFO] Copying 3 resources

[INFO] --- maven-resources-plugin:2.4:resources (default-resources) @ org.apache.aries.blueprint.testquiescebundle
---
[INFO] Compiling 2 source files to <https://builds.apache.org/job/AriesWithSnapshotDependencies/ws/aries-current-snapshots/blueprint/blueprint-testquiescebundle/target/classes>
[INFO] 
[INFO] --- maven-compiler-plugin:2.0.2:compile (default-compile) @ org.apache.aries.blueprint.testquiescebundle
---
[INFO] [INFO] Using 'UTF-8' encoding to copy filtered resources.
[INFO] skip non existing resourceDirectory <https://builds.apache.org/job/AriesWithSnapshotDependencies/ws/aries-current-snapshots/blueprint/blueprint-testquiescebundle/src/test/resources>
[INFO] skip non existing resourceDirectory <https://builds.apache.org/job/AriesWithSnapshotDependencies/ws/aries-current-snapshots/blueprint/blueprint-testquiescebundle/src/test/filtered-resources>
[INFO] Copying 3 resources

[INFO] --- maven-resources-plugin:2.4:testResources (default-testResources) @ org.apache.aries.blueprint.testquiescebundle
---
[INFO] [INFO] No sources to compile

[INFO] --- maven-compiler-plugin:2.0.2:testCompile (default-testCompile) @ org.apache.aries.blueprint.testquiescebundle
---
[INFO] [INFO] Surefire report directory: <https://builds.apache.org/job/AriesWithSnapshotDependencies/ws/aries-current-snapshots/blueprint/blueprint-testquiescebundle/target/surefire-reports>

[INFO] --- maven-surefire-plugin:2.4.3:test (default-test) @ org.apache.aries.blueprint.testquiescebundle
---

-------------------------------------------------------
 T E S T S
-------------------------------------------------------
There are no tests to run.

Results :

Tests run: 0, Failures: 0, Errors: 0, Skipped: 0

[JENKINS] Recording test results[INFO] Checking unresolved references to org.codehaus.mojo.signature:java15:1.0

[INFO] 
[INFO] --- maven-enforcer-plugin:1.0-beta-1:enforce (check-java15) @ org.apache.aries.blueprint.testquiescebundle
---
[INFO] 
[INFO] --- maven-bundle-plugin:2.3.4:bundle (default-bundle) @ org.apache.aries.blueprint.testquiescebundle
---
[INFO] Checking legal files in: org.apache.aries.blueprint.testquiescebundle-1.0.1-SNAPSHOT.jar
[INFO] 
[INFO] --- ianal-maven-plugin:1.0-alpha-1:verify-legal-files (default) @ org.apache.aries.blueprint.testquiescebundle
---
[INFO] [INFO] Installing <https://builds.apache.org/job/AriesWithSnapshotDependencies/ws/aries-current-snapshots/blueprint/blueprint-testquiescebundle/target/org.apache.aries.blueprint.testquiescebundle-1.0.1-SNAPSHOT.jar>
to <https://builds.apache.org/job/AriesWithSnapshotDependencies/ws/.repository/org/apache/aries/blueprint/org.apache.aries.blueprint.testquiescebundle/1.0.1-SNAPSHOT/org.apache.aries.blueprint.testquiescebundle-1.0.1-SNAPSHOT.jar>
[INFO] Installing <https://builds.apache.org/job/AriesWithSnapshotDependencies/ws/aries-current-snapshots/blueprint/blueprint-testquiescebundle/pom.xml>
to <https://builds.apache.org/job/AriesWithSnapshotDependencies/ws/.repository/org/apache/aries/blueprint/org.apache.aries.blueprint.testquiescebundle/1.0.1-SNAPSHOT/org.apache.aries.blueprint.testquiescebundle-1.0.1-SNAPSHOT.pom>

[INFO] --- maven-install-plugin:2.3:install (default-install) @ org.apache.aries.blueprint.testquiescebundle
---
[INFO] [INFO] Installing org/apache/aries/blueprint/org.apache.aries.blueprint.testquiescebundle/1.0.1-SNAPSHOT/org.apache.aries.blueprint.testquiescebundle-1.0.1-SNAPSHOT.jar
[INFO] Writing OBR metadata

[INFO] --- maven-bundle-plugin:2.3.4:install (default-install) @ org.apache.aries.blueprint.testquiescebundle
---
[INFO] [INFO] Deleting file set: <https://builds.apache.org/job/AriesWithSnapshotDependencies/ws/aries-current-snapshots/blueprint/blueprint-itests/target>
(included: [**], excluded: [])
                                                                        
[INFO] ------------------------------------------------------------------------
[INFO] Building Apache Aries Blueprint iTests 1.0.2-SNAPSHOT
[INFO] ------------------------------------------------------------------------
[INFO] 
[INFO] --- maven-clean-plugin:2.3:clean (default-clean) @ org.apache.aries.blueprint.itests
---
[INFO] 
[INFO] --- maven-enforcer-plugin:1.0-beta-1:enforce (default) @ org.apache.aries.blueprint.itests
---
[INFO] 
[INFO] --- maven-remote-resources-plugin:1.1:process (default) @ org.apache.aries.blueprint.itests
---
[INFO] [INFO] Created: <https://builds.apache.org/job/AriesWithSnapshotDependencies/ws/aries-current-snapshots/blueprint/blueprint-itests/target/test-resources/META-INF/maven/dependencies.properties>

[INFO] --- maven-paxexam-plugin:1.2.3:generate-depends-file (generate-config) @ org.apache.aries.blueprint.itests
---
[INFO] Using 'UTF-8' encoding to copy filtered resources.
[INFO] [INFO] skip non existing resourceDirectory <https://builds.apache.org/job/AriesWithSnapshotDependencies/ws/aries-current-snapshots/blueprint/blueprint-itests/src/main/resources>
[INFO] skip non existing resourceDirectory <https://builds.apache.org/job/AriesWithSnapshotDependencies/ws/aries-current-snapshots/blueprint/blueprint-itests/src/main/filtered-resources>
[INFO] skip non existing resourceDirectory <https://builds.apache.org/job/AriesWithSnapshotDependencies/ws/aries-current-snapshots/blueprint/blueprint-itests/src/main/java>
[INFO] Copying 3 resources

[INFO] --- maven-resources-plugin:2.4:resources (default-resources) @ org.apache.aries.blueprint.itests
---
[INFO] [INFO] No sources to compile

[INFO] --- maven-compiler-plugin:2.0.2:compile (default-compile) @ org.apache.aries.blueprint.itests
---
[INFO] Using 'UTF-8' encoding to copy filtered resources.
[INFO] [INFO] Copying 1 resource
[INFO] Copying 2 resources
[INFO] Copying 3 resources

[INFO] --- maven-resources-plugin:2.4:testResources (default-testResources) @ org.apache.aries.blueprint.itests
---
[INFO] [INFO] Compiling 14 source files to <https://builds.apache.org/job/AriesWithSnapshotDependencies/ws/aries-current-snapshots/blueprint/blueprint-itests/target/test-classes>

[INFO] --- maven-compiler-plugin:2.0.2:testCompile (default-testCompile) @ org.apache.aries.blueprint.itests
---
[WARNING] <https://builds.apache.org/job/AriesWithSnapshotDependencies/ws/aries-current-snapshots/blueprint/blueprint-itests/src/test/java/org/apache/aries/blueprint/itests/BlueprintContainer2BTCustomizerTest.java>:[39,33]
[deprecation] org.osgi.service.framework.CompositeBundle in org.osgi.service.framework has
been deprecated

[WARNING] <https://builds.apache.org/job/AriesWithSnapshotDependencies/ws/aries-current-snapshots/blueprint/blueprint-itests/src/test/java/org/apache/aries/blueprint/itests/BlueprintContainer2BTCustomizerTest.java>:[40,33]
[deprecation] org.osgi.service.framework.CompositeBundleFactory in org.osgi.service.framework
has been deprecated

[WARNING] <https://builds.apache.org/job/AriesWithSnapshotDependencies/ws/aries-current-snapshots/blueprint/blueprint-itests/src/test/java/org/apache/aries/blueprint/itests/BlueprintContainerBTCustomizerTest.java>:[39,33]
[deprecation] org.osgi.service.framework.CompositeBundle in org.osgi.service.framework has
been deprecated

[WARNING] <https://builds.apache.org/job/AriesWithSnapshotDependencies/ws/aries-current-snapshots/blueprint/blueprint-itests/src/test/java/org/apache/aries/blueprint/itests/BlueprintContainerBTCustomizerTest.java>:[40,33]
[deprecation] org.osgi.service.framework.CompositeBundleFactory in org.osgi.service.framework
has been deprecated

[WARNING] <https://builds.apache.org/job/AriesWithSnapshotDependencies/ws/aries-current-snapshots/blueprint/blueprint-itests/src/test/java/org/apache/aries/blueprint/itests/BlueprintContainer2BTCustomizerTest.java>:[59,12]
[deprecation] org.osgi.service.framework.CompositeBundleFactory in org.osgi.service.framework
has been deprecated

[WARNING] <https://builds.apache.org/job/AriesWithSnapshotDependencies/ws/aries-current-snapshots/blueprint/blueprint-itests/src/test/java/org/apache/aries/blueprint/itests/BlueprintContainer2BTCustomizerTest.java>:[59,42]
[deprecation] org.osgi.service.framework.CompositeBundleFactory in org.osgi.service.framework
has been deprecated

[WARNING] <https://builds.apache.org/job/AriesWithSnapshotDependencies/ws/aries-current-snapshots/blueprint/blueprint-itests/src/test/java/org/apache/aries/blueprint/itests/BlueprintContainer2BTCustomizerTest.java>:[68,12]
[deprecation] org.osgi.service.framework.CompositeBundle in org.osgi.service.framework has
been deprecated

[WARNING] <https://builds.apache.org/job/AriesWithSnapshotDependencies/ws/aries-current-snapshots/blueprint/blueprint-itests/src/test/java/org/apache/aries/blueprint/itests/BlueprintContainerBTCustomizerTest.java>:[60,12]
[deprecation] org.osgi.service.framework.CompositeBundleFactory in org.osgi.service.framework
has been deprecated

[WARNING] <https://builds.apache.org/job/AriesWithSnapshotDependencies/ws/aries-current-snapshots/blueprint/blueprint-itests/src/test/java/org/apache/aries/blueprint/itests/BlueprintContainerBTCustomizerTest.java>:[60,42]
[deprecation] org.osgi.service.framework.CompositeBundleFactory in org.osgi.service.framework
has been deprecated

[WARNING] <https://builds.apache.org/job/AriesWithSnapshotDependencies/ws/aries-current-snapshots/blueprint/blueprint-itests/src/test/java/org/apache/aries/blueprint/itests/BlueprintContainerBTCustomizerTest.java>:[69,12]
[deprecation] org.osgi.service.framework.CompositeBundle in org.osgi.service.framework has
been deprecated

[INFO] [INFO] Surefire report directory: <https://builds.apache.org/job/AriesWithSnapshotDependencies/ws/aries-current-snapshots/blueprint/blueprint-itests/target/surefire-reports>

[INFO] --- maven-surefire-plugin:2.4.3:test (default-test) @ org.apache.aries.blueprint.itests
---

-------------------------------------------------------
 T E S T S
-------------------------------------------------------
Running org.apache.aries.blueprint.itests.TestRegistrationListener
Tests run: 1, Failures: 1, Errors: 0, Skipped: 0, Time elapsed: 3.008 sec <<< FAILURE!
Running org.apache.aries.blueprint.itests.BlueprintContainerTest
Tests run: 4, Failures: 1, Errors: 0, Skipped: 0, Time elapsed: 49.228 sec <<< FAILURE!
Running org.apache.aries.blueprint.itests.FragmentTest
Tests run: 2, Failures: 0, Errors: 0, Skipped: 0, Time elapsed: 5.279 sec
Running org.apache.aries.blueprint.itests.TestConfigAdmin
Tests run: 4, Failures: 0, Errors: 0, Skipped: 0, Time elapsed: 10.06 sec
Running org.apache.aries.blueprint.itests.BlueprintContainer2Test
Tests run: 1, Failures: 0, Errors: 0, Skipped: 0, Time elapsed: 3.93 sec
Running org.apache.aries.blueprint.itests.BlueprintContainerBTCustomizerTest
Tests run: 1, Failures: 0, Errors: 0, Skipped: 0, Time elapsed: 11.012 sec
Running org.apache.aries.blueprint.itests.BlueprintContainer2BTCustomizerTest
Tests run: 1, Failures: 0, Errors: 0, Skipped: 0, Time elapsed: 11.823 sec
Running org.apache.aries.blueprint.itests.ASMMultiBundleTest
Tests run: 1, Failures: 0, Errors: 0, Skipped: 0, Time elapsed: 2.783 sec
Running org.apache.aries.blueprint.itests.TestReferences
Tests run: 4, Failures: 0, Errors: 1, Skipped: 0, Time elapsed: 17.33 sec <<< FAILURE!
Running org.apache.aries.blueprint.itests.QuiesceBlueprintTest
Tests run: 4, Failures: 0, Errors: 0, Skipped: 0, Time elapsed: 20.509 sec

Results :

Failed tests: 

Tests in error: 

Tests run: 23, Failures: 2, Errors: 1, Skipped: 0

[ERROR] There are test failures.

Please refer to <https://builds.apache.org/job/AriesWithSnapshotDependencies/ws/aries-current-snapshots/blueprint/blueprint-itests/target/surefire-reports>
for the individual test results.
ERROR: Maven JVM terminated unexpectedly with exit code 143


Mime
View raw message