aries-dev mailing list archives

Site index · List index
Message view « Date » · « Thread »
Top « Date » · « Thread »
From Apache Jenkins Server <jenk...@builds.apache.org>
Subject Build failed in Jenkins: Aries #1817
Date Thu, 07 Mar 2013 12:35:44 GMT
See <https://builds.apache.org/job/Aries/1817/changes>

Changes:

[timothyjward] ARIES-1024 : Fix SingleServiceTracker so that it finds pre-registered services
properly when using a filter

------------------------------------------
[...truncated 21104 lines...]
	at org.jvnet.hudson.maven3.agent.Maven3Main.launch(Maven3Main.java:158)
	at hudson.maven.Maven3Builder.call(Maven3Builder.java:100)
	at hudson.maven.Maven3Builder.call(Maven3Builder.java:66)
	at hudson.remoting.UserRequest.perform(UserRequest.java:118)
	at hudson.remoting.UserRequest.perform(UserRequest.java:48)
	at hudson.remoting.Request$2.run(Request.java:326)
	at hudson.remoting.InterceptingExecutorService$1.call(InterceptingExecutorService.java:72)
	at java.util.concurrent.FutureTask$Sync.innerRun(FutureTask.java:303)
	at java.util.concurrent.FutureTask.run(FutureTask.java:138)
	at java.util.concurrent.ThreadPoolExecutor$Worker.runTask(ThreadPoolExecutor.java:886)
	at java.util.concurrent.ThreadPoolExecutor$Worker.run(ThreadPoolExecutor.java:908)
	at java.lang.Thread.run(Thread.java:662)
Caused by: org.xmlpull.v1.XmlPullParserException: unexpected type (position:END_DOCUMENT null@3:1
in java.io.InputStreamReader@1f81f5f) 
	at org.kxml2.io.KXmlParser.exception(Unknown Source)
	at org.kxml2.io.KXmlParser.nextTag(Unknown Source)
	at org.apache.felix.bundlerepository.impl.PullParser.parseRepository(PullParser.java:43)
	at org.apache.felix.bundlerepository.impl.DataModelHelperImpl.repository(DataModelHelperImpl.java:147)
	at org.apache.felix.bundlerepository.impl.DataModelHelperImpl.repository(DataModelHelperImpl.java:118)
	at org.apache.felix.obrplugin.ObrUpdate.parseRepositoryXml(ObrUpdate.java:291)
	... 30 more

[INFO] --- maven-bundle-plugin:2.3.4:install (default-install) @ org.apache.aries.samples.blog.persistence.jpa
---
[INFO]                                                                         
[INFO] ------------------------------------------------------------------------
[INFO] Building Apache Aries Blog Sample EBA using JPA 1.0.1-SNAPSHOT
[INFO] ------------------------------------------------------------------------
[INFO] 
[INFO] --- maven-clean-plugin:2.3:clean (default-clean) @ org.apache.aries.samples.blog.jpa.eba
---
[INFO] 
[INFO] --- maven-enforcer-plugin:1.0-beta-1:enforce (default) @ org.apache.aries.samples.blog.jpa.eba
---
[INFO] 
[INFO] --- maven-remote-resources-plugin:1.1:process (default) @ org.apache.aries.samples.blog.jpa.eba
---
[INFO] [INFO] Using 'UTF-8' encoding to copy filtered resources.
[INFO] skip non existing resourceDirectory <https://builds.apache.org/job/Aries/ws/aries/samples/blog/blog-jpa-eba/src/main/resources>
[INFO] skip non existing resourceDirectory <https://builds.apache.org/job/Aries/ws/aries/samples/blog/blog-jpa-eba/src/main/filtered-resources>
[INFO] skip non existing resourceDirectory <https://builds.apache.org/job/Aries/ws/aries/samples/blog/blog-jpa-eba/src/main/java>
[INFO] Copying 3 resources

[INFO] --- maven-resources-plugin:2.4:resources (default-resources) @ org.apache.aries.samples.blog.jpa.eba
---
[INFO] [INFO] No sources to compile

[INFO] --- maven-compiler-plugin:2.0.2:compile (default-compile) @ org.apache.aries.samples.blog.jpa.eba
---
[INFO] Using 'UTF-8' encoding to copy filtered resources.
[INFO] [INFO] skip non existing resourceDirectory <https://builds.apache.org/job/Aries/ws/aries/samples/blog/blog-jpa-eba/src/test/resources>
[INFO] skip non existing resourceDirectory <https://builds.apache.org/job/Aries/ws/aries/samples/blog/blog-jpa-eba/src/test/filtered-resources>
[INFO] Copying 3 resources

[INFO] --- maven-resources-plugin:2.4:testResources (default-testResources) @ org.apache.aries.samples.blog.jpa.eba
---
[INFO] [INFO] No sources to compile

[INFO] --- maven-compiler-plugin:2.0.2:testCompile (default-testCompile) @ org.apache.aries.samples.blog.jpa.eba
---
[INFO] Surefire report directory: <https://builds.apache.org/job/Aries/ws/aries/samples/blog/blog-jpa-eba/target/surefire-reports>
[INFO] 
[INFO] --- maven-surefire-plugin:2.4.3:test (default-test) @ org.apache.aries.samples.blog.jpa.eba
---

-------------------------------------------------------
 T E S T S
-------------------------------------------------------
There are no tests to run.

Results :

Tests run: 0, Failures: 0, Errors: 0, Skipped: 0

[JENKINS] Recording test results[INFO] Checking unresolved references to org.codehaus.mojo.signature:java15:1.0

[INFO] 
[INFO] --- maven-enforcer-plugin:1.0-beta-1:enforce (check-java15) @ org.apache.aries.samples.blog.jpa.eba
---
[INFO] archiveContent[applicationContent]
[INFO] Copying artifact[org.apache.aries.samples.blog, org.apache.aries.samples.blog:org.apache.aries.samples.blog.api:jar:1.0.1-SNAPSHOT,
compile]
[INFO] Copying artifact[org.apache.aries.samples.blog, org.apache.aries.samples.blog:org.apache.aries.samples.blog.web:jar:1.0.1-SNAPSHOT,
compile]
[INFO] Copying artifact[org.apache.aries.samples.blog, org.apache.aries.samples.blog:org.apache.aries.samples.blog.biz:jar:1.0.1-SNAPSHOT,
compile]
[INFO] [INFO] Copying artifact[org.apache.aries.samples.blog, org.apache.aries.samples.blog:org.apache.aries.samples.blog.persistence.jpa:jar:1.0.1-SNAPSHOT,
compile]
[INFO] Building zip: <https://builds.apache.org/job/Aries/ws/aries/samples/blog/blog-jpa-eba/target/org.apache.aries.samples.blog.jpa.eba-1.0.1-SNAPSHOT.eba>

[INFO] --- eba-maven-plugin:1.0.0:eba (default-eba) @ org.apache.aries.samples.blog.jpa.eba
---
[INFO] Checking legal files in: org.apache.aries.samples.blog.jpa.eba-1.0.1-SNAPSHOT.eba
[INFO] 
[INFO] --- ianal-maven-plugin:1.0-alpha-1:verify-legal-files (default) @ org.apache.aries.samples.blog.jpa.eba
---
[INFO] Installing <https://builds.apache.org/job/Aries/ws/aries/samples/blog/blog-jpa-eba/target/org.apache.aries.samples.blog.jpa.eba-1.0.1-SNAPSHOT.eba>
to /home/jenkins/jenkins-slave/maven-repositories/0/org/apache/aries/samples/blog/org.apache.aries.samples.blog.jpa.eba/1.0.1-SNAPSHOT/org.apache.aries.samples.blog.jpa.eba-1.0.1-SNAPSHOT.eba
[INFO] [INFO] Installing <https://builds.apache.org/job/Aries/ws/aries/samples/blog/blog-jpa-eba/pom.xml>
to /home/jenkins/jenkins-slave/maven-repositories/0/org/apache/aries/samples/blog/org.apache.aries.samples.blog.jpa.eba/1.0.1-SNAPSHOT/org.apache.aries.samples.blog.jpa.eba-1.0.1-SNAPSHOT.pom

[INFO] --- maven-install-plugin:2.3:install (default-install) @ org.apache.aries.samples.blog.jpa.eba
---
[INFO]                                                                         
[INFO] ------------------------------------------------------------------------
[INFO] Building Apache Aries blog sample commenting EJB 1.0.1-SNAPSHOT
[INFO] ------------------------------------------------------------------------
[INFO] 
[INFO] --- maven-clean-plugin:2.3:clean (default-clean) @ org.apache.aries.samples.blog.comment.ejb
---
[INFO] 
[INFO] --- maven-enforcer-plugin:1.0-beta-1:enforce (default) @ org.apache.aries.samples.blog.comment.ejb
---
[INFO] 
[INFO] --- maven-remote-resources-plugin:1.1:process (default) @ org.apache.aries.samples.blog.comment.ejb
---
[INFO] [INFO] Using 'UTF-8' encoding to copy filtered resources.
[INFO] Copying 1 resource

[INFO] --- maven-resources-plugin:2.4:resources (default-resources) @ org.apache.aries.samples.blog.comment.ejb
---
[INFO] skip non existing resourceDirectory <https://builds.apache.org/job/Aries/ws/aries/samples/blog/blog-comment-ejb/src/main/filtered-resources>
[INFO] Copying 0 resource
[INFO] Copying 3 resources
[INFO] [INFO] Compiling 2 source files to <https://builds.apache.org/job/Aries/ws/aries/samples/blog/blog-comment-ejb/target/classes>

[INFO] --- maven-compiler-plugin:2.0.2:compile (default-compile) @ org.apache.aries.samples.blog.comment.ejb
---
[INFO] Executing tasks
[INFO] 
[INFO] --- maven-antrun-plugin:1.3:run (default) @ org.apache.aries.samples.blog.comment.ejb
---
57  blogComments  INFO   [pool-1-thread-1] openjpa.Tool - No targets were given.  Running
on all classes in your persistent classes list, or all metadata files in classpath directories
if you have not listed your persistent classes.  Use -help to display tool usage information.
90  blogComments  WARN   [pool-1-thread-1] openjpa.Tool - Found no class to enhance.
Usage: java org.apache.openjpa.enhance.PCEnhancer
	[-properties/-p <properties file or resource>]
	[-<property name> <property value>]*
	[-directory/-d <output directory>]
	[-addDefaultConstructor/-adc <true/t | false/f>]
	[-jdoEnhance/-jdo <true/t | false/f>]
	[-enforcePropertyRestrictions/-epr <true/t | false/f>]
	[-tmpClassLoader/-tcl <true/t | false/f>]
	<class name | .java file | .class file | .jdo file>+ 
[INFO] Executed tasks
[INFO] Using 'UTF-8' encoding to copy filtered resources.
[INFO] [INFO] skip non existing resourceDirectory <https://builds.apache.org/job/Aries/ws/aries/samples/blog/blog-comment-ejb/src/test/resources>
[INFO] skip non existing resourceDirectory <https://builds.apache.org/job/Aries/ws/aries/samples/blog/blog-comment-ejb/src/test/filtered-resources>
[INFO] Copying 3 resources

[INFO] --- maven-resources-plugin:2.4:testResources (default-testResources) @ org.apache.aries.samples.blog.comment.ejb
---
[INFO] No sources to compile
[INFO] 
[INFO] --- maven-compiler-plugin:2.0.2:testCompile (default-testCompile) @ org.apache.aries.samples.blog.comment.ejb
---
[INFO] Surefire report directory: <https://builds.apache.org/job/Aries/ws/aries/samples/blog/blog-comment-ejb/target/surefire-reports>
[INFO] 
[INFO] --- maven-surefire-plugin:2.4.3:test (default-test) @ org.apache.aries.samples.blog.comment.ejb
---

-------------------------------------------------------
 T E S T S
-------------------------------------------------------
There are no tests to run.

Results :

Tests run: 0, Failures: 0, Errors: 0, Skipped: 0

[JENKINS] Recording test results[INFO] Checking unresolved references to org.codehaus.mojo.signature:java15:1.0

[INFO] 
[INFO] --- maven-enforcer-plugin:1.0-beta-1:enforce (check-java15) @ org.apache.aries.samples.blog.comment.ejb
---
[INFO] 
[INFO] --- maven-bundle-plugin:2.3.4:bundle (default-bundle) @ org.apache.aries.samples.blog.comment.ejb
---
[INFO] Checking legal files in: org.apache.aries.samples.blog.comment.ejb-1.0.1-SNAPSHOT.jar
[INFO] 
[INFO] --- ianal-maven-plugin:1.0-alpha-1:verify-legal-files (default) @ org.apache.aries.samples.blog.comment.ejb
---
[INFO] [INFO] Installing <https://builds.apache.org/job/Aries/ws/aries/samples/blog/blog-comment-ejb/target/org.apache.aries.samples.blog.comment.ejb-1.0.1-SNAPSHOT.jar>
to /home/jenkins/jenkins-slave/maven-repositories/0/org/apache/aries/samples/blog/org.apache.aries.samples.blog.comment.ejb/1.0.1-SNAPSHOT/org.apache.aries.samples.blog.comment.ejb-1.0.1-SNAPSHOT.jar
[INFO] Installing <https://builds.apache.org/job/Aries/ws/aries/samples/blog/blog-comment-ejb/pom.xml>
to /home/jenkins/jenkins-slave/maven-repositories/0/org/apache/aries/samples/blog/org.apache.aries.samples.blog.comment.ejb/1.0.1-SNAPSHOT/org.apache.aries.samples.blog.comment.ejb-1.0.1-SNAPSHOT.pom

[INFO] --- maven-install-plugin:2.3:install (default-install) @ org.apache.aries.samples.blog.comment.ejb
---
[INFO] [WARNING] Exception while updating local OBR: Unable to read repository xml: file:/home/jenkins/jenkins-slave/maven-repositories/0/repository.xml
org.apache.maven.plugin.MojoExecutionException: Unable to read repository xml: file:/home/jenkins/jenkins-slave/maven-repositories/0/repository.xml
	at org.apache.felix.obrplugin.ObrUpdate.parseRepositoryXml(ObrUpdate.java:295)
	at org.apache.felix.obrplugin.ObrInstall.execute(ObrInstall.java:140)
	at org.apache.maven.plugin.DefaultBuildPluginManager.executeMojo(DefaultBuildPluginManager.java:101)
	at org.apache.maven.lifecycle.internal.MojoExecutor.execute(MojoExecutor.java:209)
	at org.apache.maven.lifecycle.internal.MojoExecutor.execute(MojoExecutor.java:153)
	at org.apache.maven.lifecycle.internal.MojoExecutor.execute(MojoExecutor.java:145)
	at org.apache.maven.lifecycle.internal.LifecycleModuleBuilder.buildProject(LifecycleModuleBuilder.java:84)
	at org.apache.maven.lifecycle.internal.LifecycleModuleBuilder.buildProject(LifecycleModuleBuilder.java:59)
	at org.apache.maven.lifecycle.internal.LifecycleStarter.singleThreadedBuild(LifecycleStarter.java:183)
	at org.apache.maven.lifecycle.internal.LifecycleStarter.execute(LifecycleStarter.java:161)
	at org.apache.maven.DefaultMaven.doExecute(DefaultMaven.java:320)
	at org.apache.maven.DefaultMaven.execute(DefaultMaven.java:156)
	at org.jvnet.hudson.maven3.launcher.Maven3Launcher.main(Maven3Launcher.java:79)
	at sun.reflect.NativeMethodAccessorImpl.invoke0(Native Method)
	at sun.reflect.NativeMethodAccessorImpl.invoke(NativeMethodAccessorImpl.java:39)
	at sun.reflect.DelegatingMethodAccessorImpl.invoke(DelegatingMethodAccessorImpl.java:25)
	at java.lang.reflect.Method.invoke(Method.java:597)
	at org.codehaus.plexus.classworlds.launcher.Launcher.launchStandard(Launcher.java:329)
	at org.codehaus.plexus.classworlds.launcher.Launcher.launch(Launcher.java:239)
	at org.jvnet.hudson.maven3.agent.Maven3Main.launch(Maven3Main.java:158)
	at hudson.maven.Maven3Builder.call(Maven3Builder.java:100)
	at hudson.maven.Maven3Builder.call(Maven3Builder.java:66)
	at hudson.remoting.UserRequest.perform(UserRequest.java:118)
	at hudson.remoting.UserRequest.perform(UserRequest.java:48)
	at hudson.remoting.Request$2.run(Request.java:326)
	at hudson.remoting.InterceptingExecutorService$1.call(InterceptingExecutorService.java:72)
	at java.util.concurrent.FutureTask$Sync.innerRun(FutureTask.java:303)
	at java.util.concurrent.FutureTask.run(FutureTask.java:138)
	at java.util.concurrent.ThreadPoolExecutor$Worker.runTask(ThreadPoolExecutor.java:886)
	at java.util.concurrent.ThreadPoolExecutor$Worker.run(ThreadPoolExecutor.java:908)
	at java.lang.Thread.run(Thread.java:662)
Caused by: org.xmlpull.v1.XmlPullParserException: unexpected type (position:END_DOCUMENT null@3:1
in java.io.InputStreamReader@135ef5a) 
	at org.kxml2.io.KXmlParser.exception(Unknown Source)
	at org.kxml2.io.KXmlParser.nextTag(Unknown Source)
	at org.apache.felix.bundlerepository.impl.PullParser.parseRepository(PullParser.java:43)
	at org.apache.felix.bundlerepository.impl.DataModelHelperImpl.repository(DataModelHelperImpl.java:147)
	at org.apache.felix.bundlerepository.impl.DataModelHelperImpl.repository(DataModelHelperImpl.java:118)
	at org.apache.felix.obrplugin.ObrUpdate.parseRepositoryXml(ObrUpdate.java:291)
	... 30 more

[INFO] --- maven-bundle-plugin:2.3.4:install (default-install) @ org.apache.aries.samples.blog.comment.ejb
---
[INFO]                                                                         
[INFO] ------------------------------------------------------------------------
[INFO] Building Apache Aries Blog sample iTests 1.0.1-SNAPSHOT
[INFO] ------------------------------------------------------------------------
[INFO] 
[INFO] --- maven-clean-plugin:2.3:clean (default-clean) @ org.apache.aries.samples.blog.itests
---
[INFO] 
[INFO] --- maven-enforcer-plugin:1.0-beta-1:enforce (default) @ org.apache.aries.samples.blog.itests
---
[INFO] 
[INFO] --- maven-remote-resources-plugin:1.1:process (default) @ org.apache.aries.samples.blog.itests
---
[INFO] [INFO] Created: <https://builds.apache.org/job/Aries/ws/aries/samples/blog/blog-itests/target/test-classes/META-INF/maven/dependencies.properties>

[INFO] --- maven-paxexam-plugin:1.2.3:generate-depends-file (generate-config) @ org.apache.aries.samples.blog.itests
---
[INFO] [INFO] Using 'UTF-8' encoding to copy filtered resources.
[INFO] skip non existing resourceDirectory <https://builds.apache.org/job/Aries/ws/aries/samples/blog/blog-itests/src/main/resources>
[INFO] skip non existing resourceDirectory <https://builds.apache.org/job/Aries/ws/aries/samples/blog/blog-itests/src/main/filtered-resources>
[INFO] skip non existing resourceDirectory <https://builds.apache.org/job/Aries/ws/aries/samples/blog/blog-itests/src/main/java>
[INFO] Copying 3 resources

[INFO] --- maven-resources-plugin:2.4:resources (default-resources) @ org.apache.aries.samples.blog.itests
---
[INFO] [INFO] No sources to compile

[INFO] --- maven-compiler-plugin:2.0.2:compile (default-compile) @ org.apache.aries.samples.blog.itests
---
[INFO] [INFO] Using 'UTF-8' encoding to copy filtered resources.
[INFO] skip non existing resourceDirectory <https://builds.apache.org/job/Aries/ws/aries/samples/blog/blog-itests/src/test/resources>
[INFO] skip non existing resourceDirectory <https://builds.apache.org/job/Aries/ws/aries/samples/blog/blog-itests/src/test/filtered-resources>
[INFO] Copying 3 resources

[INFO] --- maven-resources-plugin:2.4:testResources (default-testResources) @ org.apache.aries.samples.blog.itests
---
[INFO] 
[INFO] --- maven-compiler-plugin:2.0.2:testCompile (default-testCompile) @ org.apache.aries.samples.blog.itests
---
[INFO] Compiling 4 source files to <https://builds.apache.org/job/Aries/ws/aries/samples/blog/blog-itests/target/test-classes>
[INFO] Surefire report directory: <https://builds.apache.org/job/Aries/ws/aries/samples/blog/blog-itests/target/surefire-reports>
[INFO] 
[INFO] --- maven-surefire-plugin:2.4.3:test (default-test) @ org.apache.aries.samples.blog.itests
---

-------------------------------------------------------
 T E S T S
-------------------------------------------------------
Running org.apache.aries.samples.blog.itests.JpaBlogSampleWithEbaTest
Tests run: 1, Failures: 0, Errors: 0, Skipped: 0, Time elapsed: 8.146 sec
Running org.apache.aries.samples.blog.itests.QuiesceBlogSampleWithEbaTest
Tests run: 1, Failures: 0, Errors: 0, Skipped: 0, Time elapsed: 10.686 sec
Running org.apache.aries.samples.blog.itests.JdbcBlogSampleWithEbaTest
Tests run: 1, Failures: 0, Errors: 0, Skipped: 0, Time elapsed: 6.304 sec

Results :

Tests run: 3, Failures: 0, Errors: 0, Skipped: 0

Sending e-mails to: dev@aries.apache.org
ERROR: Maven JVM terminated unexpectedly with exit code 143


Mime
View raw message