aries-dev mailing list archives

Site index · List index
Message view « Date » · « Thread »
Top « Date » · « Thread »
From Apache Jenkins Server <jenk...@builds.apache.org>
Subject Build failed in Jenkins: Aries #1815
Date Wed, 06 Mar 2013 20:34:05 GMT
See <https://builds.apache.org/job/Aries/1815/changes>

Changes:

[jwross] [ARIES-1022] Support for mandatory directive for osgi.wiring.[package | bundle |
host] namespaces

Added support for the mandatory directive when matching capabilities to requirements plus
tests.

------------------------------------------
[...truncated 7482 lines...]
[INFO] Copying 3 resources

[INFO] --- maven-resources-plugin:2.4:testResources (default-testResources) @ org.apache.aries.proxy.impl
---
[INFO] [INFO] Compiling 40 source files to <https://builds.apache.org/job/Aries/ws/aries/proxy/proxy-impl/target/test-classes>

[INFO] --- maven-compiler-plugin:2.0.2:testCompile (default-testCompile) @ org.apache.aries.proxy.impl
---
[INFO] Surefire report directory: <https://builds.apache.org/job/Aries/ws/aries/proxy/proxy-impl/target/surefire-reports>
[INFO] 
[INFO] --- maven-surefire-plugin:2.4.3:test (default-test) @ org.apache.aries.proxy.impl ---

-------------------------------------------------------
 T E S T S
-------------------------------------------------------
Running org.apache.aries.blueprint.proxy.WovenProxyGeneratorTest
Tests run: 34, Failures: 0, Errors: 0, Skipped: 0, Time elapsed: 0.259 sec
Running org.apache.aries.proxy.impl.weaving.ProxyWeavingHookTest
Tests run: 2, Failures: 0, Errors: 0, Skipped: 0, Time elapsed: 0.027 sec
Running org.apache.aries.blueprint.proxy.InterfaceProxyingTest
Tests run: 7, Failures: 0, Errors: 0, Skipped: 0, Time elapsed: 0.084 sec
Running org.apache.aries.blueprint.proxy.WovenProxyPlusSubclassGeneratorTest
Tests run: 35, Failures: 0, Errors: 0, Skipped: 0, Time elapsed: 0.08 sec
[JENKINS] Recording test resultsRunning org.apache.aries.blueprint.proxy.ProxySubclassGeneratorTest
Tests run: 21, Failures: 0, Errors: 0, Skipped: 0, Time elapsed: 0.053 sec
Running org.apache.aries.blueprint.proxy.WovenSubclassGeneratorTest
Tests run: 21, Failures: 0, Errors: 0, Skipped: 0, Time elapsed: 0.058 sec

Results :


Tests run: 120, Failures: 0, Errors: 0, Skipped: 0

[INFO] [INFO] Checking unresolved references to org.codehaus.mojo.signature:java15:1.0

[INFO] --- maven-enforcer-plugin:1.0-beta-1:enforce (check-java15) @ org.apache.aries.proxy.impl
---
[INFO] 
[INFO] --- maven-bundle-plugin:2.3.4:bundle (default-bundle) @ org.apache.aries.proxy.impl
---
[INFO] [INFO] Checking legal files in: org.apache.aries.proxy.impl-1.0.2-SNAPSHOT.jar

[INFO] --- ianal-maven-plugin:1.0-alpha-1:verify-legal-files (default) @ org.apache.aries.proxy.impl
---
[INFO] 
[INFO] --- org.apache.aries.versioning.plugin:0.1.0:version-check (default-verify) @ org.apache.aries.proxy.impl
---
[INFO] All package or bundle versions are semanticly versioned correctly.
[INFO] [INFO] Installing <https://builds.apache.org/job/Aries/ws/aries/proxy/proxy-impl/target/org.apache.aries.proxy.impl-1.0.2-SNAPSHOT.jar>
to /home/jenkins/jenkins-slave/maven-repositories/0/org/apache/aries/proxy/org.apache.aries.proxy.impl/1.0.2-SNAPSHOT/org.apache.aries.proxy.impl-1.0.2-SNAPSHOT.jar
[INFO] Installing <https://builds.apache.org/job/Aries/ws/aries/proxy/proxy-impl/pom.xml>
to /home/jenkins/jenkins-slave/maven-repositories/0/org/apache/aries/proxy/org.apache.aries.proxy.impl/1.0.2-SNAPSHOT/org.apache.aries.proxy.impl-1.0.2-SNAPSHOT.pom

[INFO] --- maven-install-plugin:2.3:install (default-install) @ org.apache.aries.proxy.impl
---
[INFO] [WARNING] Exception while updating local OBR: Unable to read repository xml: file:/home/jenkins/jenkins-slave/maven-repositories/0/repository.xml
org.apache.maven.plugin.MojoExecutionException: Unable to read repository xml: file:/home/jenkins/jenkins-slave/maven-repositories/0/repository.xml
	at org.apache.felix.obrplugin.ObrUpdate.parseRepositoryXml(ObrUpdate.java:295)
	at org.apache.felix.obrplugin.ObrInstall.execute(ObrInstall.java:140)
	at org.apache.maven.plugin.DefaultBuildPluginManager.executeMojo(DefaultBuildPluginManager.java:101)
	at org.apache.maven.lifecycle.internal.MojoExecutor.execute(MojoExecutor.java:209)
	at org.apache.maven.lifecycle.internal.MojoExecutor.execute(MojoExecutor.java:153)
	at org.apache.maven.lifecycle.internal.MojoExecutor.execute(MojoExecutor.java:145)
	at org.apache.maven.lifecycle.internal.LifecycleModuleBuilder.buildProject(LifecycleModuleBuilder.java:84)
	at org.apache.maven.lifecycle.internal.LifecycleModuleBuilder.buildProject(LifecycleModuleBuilder.java:59)
	at org.apache.maven.lifecycle.internal.LifecycleStarter.singleThreadedBuild(LifecycleStarter.java:183)
	at org.apache.maven.lifecycle.internal.LifecycleStarter.execute(LifecycleStarter.java:161)
	at org.apache.maven.DefaultMaven.doExecute(DefaultMaven.java:320)
	at org.apache.maven.DefaultMaven.execute(DefaultMaven.java:156)
	at org.jvnet.hudson.maven3.launcher.Maven3Launcher.main(Maven3Launcher.java:79)
	at sun.reflect.NativeMethodAccessorImpl.invoke0(Native Method)
	at sun.reflect.NativeMethodAccessorImpl.invoke(NativeMethodAccessorImpl.java:39)
	at sun.reflect.DelegatingMethodAccessorImpl.invoke(DelegatingMethodAccessorImpl.java:25)
	at java.lang.reflect.Method.invoke(Method.java:597)
	at org.codehaus.plexus.classworlds.launcher.Launcher.launchStandard(Launcher.java:329)
	at org.codehaus.plexus.classworlds.launcher.Launcher.launch(Launcher.java:239)
	at org.jvnet.hudson.maven3.agent.Maven3Main.launch(Maven3Main.java:158)
	at hudson.maven.Maven3Builder.call(Maven3Builder.java:100)
	at hudson.maven.Maven3Builder.call(Maven3Builder.java:66)
	at hudson.remoting.UserRequest.perform(UserRequest.java:118)
	at hudson.remoting.UserRequest.perform(UserRequest.java:48)
	at hudson.remoting.Request$2.run(Request.java:326)
	at hudson.remoting.InterceptingExecutorService$1.call(InterceptingExecutorService.java:72)
	at java.util.concurrent.FutureTask$Sync.innerRun(FutureTask.java:303)
	at java.util.concurrent.FutureTask.run(FutureTask.java:138)
	at java.util.concurrent.ThreadPoolExecutor$Worker.runTask(ThreadPoolExecutor.java:886)
	at java.util.concurrent.ThreadPoolExecutor$Worker.run(ThreadPoolExecutor.java:908)
	at java.lang.Thread.run(Thread.java:662)
Caused by: org.xmlpull.v1.XmlPullParserException: unexpected type (position:END_DOCUMENT null@3:1
in java.io.InputStreamReader@8bbfd7) 
	at org.kxml2.io.KXmlParser.exception(Unknown Source)
	at org.kxml2.io.KXmlParser.nextTag(Unknown Source)
	at org.apache.felix.bundlerepository.impl.PullParser.parseRepository(PullParser.java:43)
	at org.apache.felix.bundlerepository.impl.DataModelHelperImpl.repository(DataModelHelperImpl.java:147)
	at org.apache.felix.bundlerepository.impl.DataModelHelperImpl.repository(DataModelHelperImpl.java:118)
	at org.apache.felix.obrplugin.ObrUpdate.parseRepositoryXml(ObrUpdate.java:291)
	... 30 more

[INFO] --- maven-bundle-plugin:2.3.4:install (default-install) @ org.apache.aries.proxy.impl
---
[INFO]                                                                         
[INFO] ------------------------------------------------------------------------
[INFO] Building Apache Aries Proxy Bundle 1.0.2-SNAPSHOT
[INFO] ------------------------------------------------------------------------
[INFO] 
[INFO] --- maven-clean-plugin:2.3:clean (default-clean) @ org.apache.aries.proxy ---
[INFO] 
[INFO] --- maven-enforcer-plugin:1.0-beta-1:enforce (default) @ org.apache.aries.proxy ---
[INFO] 
[INFO] --- maven-remote-resources-plugin:1.1:process (default) @ org.apache.aries.proxy ---
[INFO] [INFO] Using 'UTF-8' encoding to copy filtered resources.
[INFO] skip non existing resourceDirectory <https://builds.apache.org/job/Aries/ws/aries/proxy/proxy-bundle/src/main/resources>
[INFO] skip non existing resourceDirectory <https://builds.apache.org/job/Aries/ws/aries/proxy/proxy-bundle/src/main/filtered-resources>
[INFO] skip non existing resourceDirectory <https://builds.apache.org/job/Aries/ws/aries/proxy/proxy-bundle/src/main/java>
[INFO] Copying 3 resources

[INFO] --- maven-resources-plugin:2.4:resources (default-resources) @ org.apache.aries.proxy
---
[INFO] [INFO] No sources to compile

[INFO] --- maven-compiler-plugin:2.0.2:compile (default-compile) @ org.apache.aries.proxy
---
[INFO] [INFO] Using 'UTF-8' encoding to copy filtered resources.
[INFO] skip non existing resourceDirectory <https://builds.apache.org/job/Aries/ws/aries/proxy/proxy-bundle/src/test/resources>
[INFO] skip non existing resourceDirectory <https://builds.apache.org/job/Aries/ws/aries/proxy/proxy-bundle/src/test/filtered-resources>
[INFO] Copying 3 resources

[INFO] --- maven-resources-plugin:2.4:testResources (default-testResources) @ org.apache.aries.proxy
---
[INFO] [INFO] No sources to compile

[INFO] --- maven-compiler-plugin:2.0.2:testCompile (default-testCompile) @ org.apache.aries.proxy
---
[INFO] [INFO] Surefire report directory: <https://builds.apache.org/job/Aries/ws/aries/proxy/proxy-bundle/target/surefire-reports>

[INFO] --- maven-surefire-plugin:2.4.3:test (default-test) @ org.apache.aries.proxy ---

-------------------------------------------------------
 T E S T S
-------------------------------------------------------
There are no tests to run.

Results :

Tests run: 0, Failures: 0, Errors: 0, Skipped: 0

[JENKINS] Recording test results[INFO] Checking unresolved references to org.codehaus.mojo.signature:java15:1.0

[INFO] 
[INFO] --- maven-enforcer-plugin:1.0-beta-1:enforce (check-java15) @ org.apache.aries.proxy
---
[INFO] 
[INFO] --- maven-bundle-plugin:2.3.4:bundle (default-bundle) @ org.apache.aries.proxy ---
[WARNING] Warning building bundle org.apache.aries.proxy:org.apache.aries.proxy:bundle:1.0.2-SNAPSHOT
: Split package org/apache/aries/proxy/nls
Use directive -split-package:=(merge-first|merge-last|error|first) on Export/Private Package
instruction to get rid of this warning
Package found in   [Jar:org.apache.aries.proxy.api, Jar:org.apache.aries.proxy.impl]
Reference from     <https://builds.apache.org/job/Aries/ws/aries/proxy/proxy-impl/target/org.apache.aries.proxy.impl-1.0.2-SNAPSHOT.jar>
Classpath          [Jar:., Jar:org.apache.aries.proxy.api, Jar:org.apache.aries.util, Jar:org.apache.aries.proxy.impl,
Jar:org.osgi.core, Jar:org.osgi.compendium, Jar:asm-all, Jar:slf4j-api]
[INFO] [INFO] Checking legal files in: org.apache.aries.proxy-1.0.2-SNAPSHOT.jar

[INFO] --- ianal-maven-plugin:1.0-alpha-1:verify-legal-files (default) @ org.apache.aries.proxy
---
[INFO] 
[INFO] --- org.apache.aries.versioning.plugin:0.1.0:version-check (default-verify) @ org.apache.aries.proxy
---
[INFO] All package or bundle versions are semanticly versioned correctly.
[INFO] [INFO] Installing <https://builds.apache.org/job/Aries/ws/aries/proxy/proxy-bundle/target/org.apache.aries.proxy-1.0.2-SNAPSHOT.jar>
to /home/jenkins/jenkins-slave/maven-repositories/0/org/apache/aries/proxy/org.apache.aries.proxy/1.0.2-SNAPSHOT/org.apache.aries.proxy-1.0.2-SNAPSHOT.jar
[INFO] Installing <https://builds.apache.org/job/Aries/ws/aries/proxy/proxy-bundle/pom.xml>
to /home/jenkins/jenkins-slave/maven-repositories/0/org/apache/aries/proxy/org.apache.aries.proxy/1.0.2-SNAPSHOT/org.apache.aries.proxy-1.0.2-SNAPSHOT.pom

[INFO] --- maven-install-plugin:2.3:install (default-install) @ org.apache.aries.proxy ---
[INFO] [WARNING] Exception while updating local OBR: Unable to read repository xml: file:/home/jenkins/jenkins-slave/maven-repositories/0/repository.xml
org.apache.maven.plugin.MojoExecutionException: Unable to read repository xml: file:/home/jenkins/jenkins-slave/maven-repositories/0/repository.xml
	at org.apache.felix.obrplugin.ObrUpdate.parseRepositoryXml(ObrUpdate.java:295)
	at org.apache.felix.obrplugin.ObrInstall.execute(ObrInstall.java:140)
	at org.apache.maven.plugin.DefaultBuildPluginManager.executeMojo(DefaultBuildPluginManager.java:101)
	at org.apache.maven.lifecycle.internal.MojoExecutor.execute(MojoExecutor.java:209)
	at org.apache.maven.lifecycle.internal.MojoExecutor.execute(MojoExecutor.java:153)
	at org.apache.maven.lifecycle.internal.MojoExecutor.execute(MojoExecutor.java:145)
	at org.apache.maven.lifecycle.internal.LifecycleModuleBuilder.buildProject(LifecycleModuleBuilder.java:84)
	at org.apache.maven.lifecycle.internal.LifecycleModuleBuilder.buildProject(LifecycleModuleBuilder.java:59)
	at org.apache.maven.lifecycle.internal.LifecycleStarter.singleThreadedBuild(LifecycleStarter.java:183)
	at org.apache.maven.lifecycle.internal.LifecycleStarter.execute(LifecycleStarter.java:161)
	at org.apache.maven.DefaultMaven.doExecute(DefaultMaven.java:320)
	at org.apache.maven.DefaultMaven.execute(DefaultMaven.java:156)
	at org.jvnet.hudson.maven3.launcher.Maven3Launcher.main(Maven3Launcher.java:79)
	at sun.reflect.NativeMethodAccessorImpl.invoke0(Native Method)
	at sun.reflect.NativeMethodAccessorImpl.invoke(NativeMethodAccessorImpl.java:39)
	at sun.reflect.DelegatingMethodAccessorImpl.invoke(DelegatingMethodAccessorImpl.java:25)
	at java.lang.reflect.Method.invoke(Method.java:597)
	at org.codehaus.plexus.classworlds.launcher.Launcher.launchStandard(Launcher.java:329)
	at org.codehaus.plexus.classworlds.launcher.Launcher.launch(Launcher.java:239)
	at org.jvnet.hudson.maven3.agent.Maven3Main.launch(Maven3Main.java:158)
	at hudson.maven.Maven3Builder.call(Maven3Builder.java:100)
	at hudson.maven.Maven3Builder.call(Maven3Builder.java:66)
	at hudson.remoting.UserRequest.perform(UserRequest.java:118)
	at hudson.remoting.UserRequest.perform(UserRequest.java:48)
	at hudson.remoting.Request$2.run(Request.java:326)
	at hudson.remoting.InterceptingExecutorService$1.call(InterceptingExecutorService.java:72)
	at java.util.concurrent.FutureTask$Sync.innerRun(FutureTask.java:303)
	at java.util.concurrent.FutureTask.run(FutureTask.java:138)
	at java.util.concurrent.ThreadPoolExecutor$Worker.runTask(ThreadPoolExecutor.java:886)
	at java.util.concurrent.ThreadPoolExecutor$Worker.run(ThreadPoolExecutor.java:908)
	at java.lang.Thread.run(Thread.java:662)
Caused by: org.xmlpull.v1.XmlPullParserException: unexpected type (position:END_DOCUMENT null@3:1
in java.io.InputStreamReader@11dc865) 
	at org.kxml2.io.KXmlParser.exception(Unknown Source)
	at org.kxml2.io.KXmlParser.nextTag(Unknown Source)
	at org.apache.felix.bundlerepository.impl.PullParser.parseRepository(PullParser.java:43)
	at org.apache.felix.bundlerepository.impl.DataModelHelperImpl.repository(DataModelHelperImpl.java:147)
	at org.apache.felix.bundlerepository.impl.DataModelHelperImpl.repository(DataModelHelperImpl.java:118)
	at org.apache.felix.obrplugin.ObrUpdate.parseRepositoryXml(ObrUpdate.java:291)
	... 30 more

[INFO] --- maven-bundle-plugin:2.3.4:install (default-install) @ org.apache.aries.proxy ---
[INFO]                                                                         
[INFO] ------------------------------------------------------------------------
[INFO] Building Apache Aries Proxy iTests 1.0.1-SNAPSHOT
[INFO] ------------------------------------------------------------------------
[INFO] 
[INFO] --- maven-clean-plugin:2.3:clean (default-clean) @ org.apache.aries.proxy.itests ---
[INFO] 
[INFO] --- maven-enforcer-plugin:1.0-beta-1:enforce (default) @ org.apache.aries.proxy.itests
---
[INFO] 
[INFO] --- maven-remote-resources-plugin:1.1:process (default) @ org.apache.aries.proxy.itests
---
[INFO] 
[INFO] --- maven-paxexam-plugin:1.2.3:generate-depends-file (generate-config) @ org.apache.aries.proxy.itests
---
[INFO] Created: <https://builds.apache.org/job/Aries/ws/aries/proxy/proxy-itests/target/test-classes/META-INF/maven/dependencies.properties>
[INFO] [INFO] Using 'UTF-8' encoding to copy filtered resources.
[INFO] skip non existing resourceDirectory <https://builds.apache.org/job/Aries/ws/aries/proxy/proxy-itests/src/main/resources>
[INFO] skip non existing resourceDirectory <https://builds.apache.org/job/Aries/ws/aries/proxy/proxy-itests/src/main/filtered-resources>
[INFO] skip non existing resourceDirectory <https://builds.apache.org/job/Aries/ws/aries/proxy/proxy-itests/src/main/java>
[INFO] Copying 3 resources

[INFO] --- maven-resources-plugin:2.4:resources (default-resources) @ org.apache.aries.proxy.itests
---
[INFO] [INFO] No sources to compile

[INFO] --- maven-compiler-plugin:2.0.2:compile (default-compile) @ org.apache.aries.proxy.itests
---
[INFO] [INFO] Using 'UTF-8' encoding to copy filtered resources.
[INFO] Copying 2 resources
[INFO] skip non existing resourceDirectory <https://builds.apache.org/job/Aries/ws/aries/proxy/proxy-itests/src/test/filtered-resources>
[INFO] Copying 3 resources

[INFO] --- maven-resources-plugin:2.4:testResources (default-testResources) @ org.apache.aries.proxy.itests
---
[INFO] [INFO] Compiling 8 source files to <https://builds.apache.org/job/Aries/ws/aries/proxy/proxy-itests/target/test-classes>

[INFO] --- maven-compiler-plugin:2.0.2:testCompile (default-testCompile) @ org.apache.aries.proxy.itests
---
[INFO] Surefire report directory: <https://builds.apache.org/job/Aries/ws/aries/proxy/proxy-itests/target/surefire-reports>
[INFO] 
[INFO] --- maven-surefire-plugin:2.4.3:test (default-test) @ org.apache.aries.proxy.itests
---

-------------------------------------------------------
 T E S T S
-------------------------------------------------------
Running org.apache.aries.proxy.itests.BasicProxyUberBundleTest
Tests run: 12, Failures: 0, Errors: 0, Skipped: 0, Time elapsed: 24.312 sec
Running org.apache.aries.proxy.itests.BasicProxyBundlesTest
Tests run: 12, Failures: 0, Errors: 0, Skipped: 0, Time elapsed: 23.353 sec
Running org.apache.aries.proxy.itests.WeavingProxyUberBundleTest
Tests run: 7, Failures: 0, Errors: 0, Skipped: 0, Time elapsed: 14.657 sec
Running org.apache.aries.proxy.itests.WeavingProxyBundlesTest
Tests run: 7, Failures: 0, Errors: 0, Skipped: 0, Time elapsed: 14.697 sec

Results :

Tests run: 38, Failures: 0, Errors: 0, Skipped: 0

ERROR: Maven JVM terminated unexpectedly with exit code 143


Mime
View raw message