aries-dev mailing list archives

Site index · List index
Message view « Date » · « Thread »
Top « Date » · « Thread »
From Apache Jenkins Server <jenk...@builds.apache.org>
Subject Build failed in Jenkins: AriesWithSnapshotDependencies #455
Date Fri, 30 May 2014 17:07:30 GMT
See <https://builds.apache.org/job/AriesWithSnapshotDependencies/455/changes>

Changes:

[jbonofre] [ARIES-1006] Upgrade to the "new" parent pom and OSGi 4.3.1

[jbonofre] [ARIES-1006] Upgrade to the "new" parent pom and OSGi 4.3.1

------------------------------------------
[...truncated 6302 lines...]
AU        blueprint/blueprint-annotation-api/src/main/java/org/apache/aries/blueprint/annotation/Blueprint.java
AU        blueprint/blueprint-annotation-api/src/main/java/org/apache/aries/blueprint/annotation/ReferenceListener.java
AU        blueprint/blueprint-annotation-api/src/main/java/org/apache/aries/blueprint/annotation/Bean.java
AU        blueprint/blueprint-annotation-api/src/main/java/org/apache/aries/blueprint/annotation/ServiceProperty.java
AU        blueprint/blueprint-annotation-api/src/main/java/org/apache/aries/blueprint/annotation/Arg.java
AU        blueprint/blueprint-annotation-api/src/main/java/org/apache/aries/blueprint/annotation/List.java
AU        blueprint/blueprint-annotation-api/src/main/java/org/apache/aries/blueprint/annotation/Bind.java
AU        blueprint/blueprint-annotation-api/src/main/java/org/apache/aries/blueprint/annotation/Inject.java
AU        blueprint/blueprint-annotation-api/src/main/java/org/apache/aries/blueprint/annotation/Unbind.java
AU        blueprint/blueprint-annotation-api/src/main/java/org/apache/aries/blueprint/annotation/RegistrationListener.java
A         blueprint/blueprint-annotation-api/src/main/java/org/apache/aries/blueprint/annotation/service
A         blueprint/blueprint-annotation-api/src/main/java/org/apache/aries/blueprint/annotation/service/packageinfo
AU        blueprint/blueprint-annotation-api/src/main/java/org/apache/aries/blueprint/annotation/service/BlueprintAnnotationScanner.java
AU        blueprint/blueprint-annotation-api/src/main/java/org/apache/aries/blueprint/annotation/Register.java
AU        blueprint/blueprint-annotation-api/pom.xml
A         blueprint/blueprint-annotation-api/NOTICE
A         blueprint/blueprint-annotation-api/LICENSE
A         blueprint/blueprint-sample-fragment
A         blueprint/blueprint-sample-fragment/pom.xml
A         blueprint/blueprint-sample-fragment/src
A         blueprint/blueprint-sample-fragment/src/main
A         blueprint/blueprint-sample-fragment/src/main/java
A         blueprint/blueprint-sample-fragment/src/main/java/org
A         blueprint/blueprint-sample-fragment/src/main/java/org/apache
A         blueprint/blueprint-sample-fragment/src/main/java/org/apache/aries
A         blueprint/blueprint-sample-fragment/src/main/java/org/apache/aries/blueprint
A         blueprint/blueprint-sample-fragment/src/main/java/org/apache/aries/blueprint/fragment
A         blueprint/blueprint-sample-fragment/src/main/java/org/apache/aries/blueprint/fragment/FragmentBean.java
A         .gitignore
A         esa-maven-plugin
A         esa-maven-plugin/NOTICE
A         esa-maven-plugin/LICENSE
A         esa-maven-plugin/src
A         esa-maven-plugin/src/main
A         esa-maven-plugin/src/main/java
A         esa-maven-plugin/src/main/java/org
A         esa-maven-plugin/src/main/java/org/apache
A         esa-maven-plugin/src/main/java/org/apache/aries
A         esa-maven-plugin/src/main/java/org/apache/aries/plugin
A         esa-maven-plugin/src/main/java/org/apache/aries/plugin/esa
AU        esa-maven-plugin/src/main/java/org/apache/aries/plugin/esa/ContentInfo.java
AU        esa-maven-plugin/src/main/java/org/apache/aries/plugin/esa/Constants.java
A         esa-maven-plugin/src/main/java/org/apache/aries/plugin/esa/EsaMojo.java
A         esa-maven-plugin/src/main/resources
A         esa-maven-plugin/src/main/resources/META-INF
A         esa-maven-plugin/src/main/resources/META-INF/plexus
A         esa-maven-plugin/src/main/resources/META-INF/plexus/components.xml
A         esa-maven-plugin/src/it
A         esa-maven-plugin/src/it/settings.xml
A         esa-maven-plugin/src/it/default
A         esa-maven-plugin/src/it/default/pom.xml
A         esa-maven-plugin/src/it/default/verify.bsh
A         esa-maven-plugin/src/it/default/src
A         esa-maven-plugin/src/it/default/src/main
A         esa-maven-plugin/src/it/default/src/main/esa
A         esa-maven-plugin/src/it/default/src/main/esa/SomeResource.txt
A         esa-maven-plugin/src/it/default/src/main/custom
A         esa-maven-plugin/src/it/default/src/main/custom/SUBSYSTEM.MF
A         esa-maven-plugin/src/test
A         esa-maven-plugin/src/test/resources
A         esa-maven-plugin/src/test/resources/unit
A         esa-maven-plugin/src/test/resources/unit/basic-esa-no-bundles
A         esa-maven-plugin/src/test/resources/unit/basic-esa-no-bundles/plugin-config.xml
A         esa-maven-plugin/src/test/resources/unit/basic-esa-start-order
A         esa-maven-plugin/src/test/resources/unit/basic-esa-start-order/plugin-config.xml
A         esa-maven-plugin/src/test/resources/unit/basic-esa-test-with-pgk-type
A         esa-maven-plugin/src/test/resources/unit/basic-esa-test-with-pgk-type/plugin-config.xml
A         esa-maven-plugin/src/test/resources/unit/basic-esa-test-with-pgk-type/target
A         esa-maven-plugin/src/test/resources/unit/basic-esa-test-with-pgk-type/target/maven-esa-test-1.0-SNAPSHOT.jar
A         esa-maven-plugin/src/test/resources/unit/basic-esa-with-descriptor
A         esa-maven-plugin/src/test/resources/unit/basic-esa-with-descriptor/src
A         esa-maven-plugin/src/test/resources/unit/basic-esa-with-descriptor/src/main
A         esa-maven-plugin/src/test/resources/unit/basic-esa-with-descriptor/src/main/esa
A         esa-maven-plugin/src/test/resources/unit/basic-esa-with-descriptor/src/main/esa/OSGI-INF
A         esa-maven-plugin/src/test/resources/unit/basic-esa-with-descriptor/src/main/esa/OSGI-INF/SUBSYSTEM.MF
A         esa-maven-plugin/src/test/resources/unit/basic-esa-with-descriptor/plugin-config.xml
A         esa-maven-plugin/src/test/resources/unit/basic-esa-without-manifest
A         esa-maven-plugin/src/test/resources/unit/basic-esa-without-manifest/plugin-config.xml
A         esa-maven-plugin/src/test/resources/unit/basic-esa-content-type
AU        esa-maven-plugin/src/test/resources/unit/basic-esa-content-type/plugin-config.xml
A         esa-maven-plugin/src/test/resources/unit/basic-esa-custom-instructions
AU        esa-maven-plugin/src/test/resources/unit/basic-esa-custom-instructions/plugin-config.xml
A         esa-maven-plugin/src/test/resources/unit/basic-esa-test
A         esa-maven-plugin/src/test/resources/unit/basic-esa-test/target
A         esa-maven-plugin/src/test/resources/unit/basic-esa-test/target/test-esa.jar
A         esa-maven-plugin/src/test/resources/unit/basic-esa-test/plugin-config.xml
A         esa-maven-plugin/src/test/resources/unit/basic-esa-with-manifest
A         esa-maven-plugin/src/test/resources/unit/basic-esa-with-manifest/plugin-config.xml
A         esa-maven-plugin/src/test/resources/unit/basic-esa-with-manifest/src
A         esa-maven-plugin/src/test/resources/unit/basic-esa-with-manifest/src/main
A         esa-maven-plugin/src/test/resources/unit/basic-esa-with-manifest/src/main/esa
A         esa-maven-plugin/src/test/resources/unit/basic-esa-with-manifest/src/main/esa/OSGI-INF
A         esa-maven-plugin/src/test/resources/unit/basic-esa-with-manifest/src/main/esa/OSGI-INF/SUBSYSTEM.MF
A         esa-maven-plugin/src/test/resources/unit/basic-esa-with-manifest/src/main/esa/META-INF
A         esa-maven-plugin/src/test/resources/unit/basic-esa-with-manifest/src/main/esa/META-INF/MANIFEST.MF
A         esa-maven-plugin/src/test/resources/unit/basic-esa-content-bundles-only
A         esa-maven-plugin/src/test/resources/unit/basic-esa-content-bundles-only/plugin-config.xml
A         esa-maven-plugin/src/test/remote-repo
A         esa-maven-plugin/src/test/remote-repo/org
A         esa-maven-plugin/src/test/remote-repo/org/apache
A         esa-maven-plugin/src/test/remote-repo/org/apache/maven
A         esa-maven-plugin/src/test/remote-repo/org/apache/maven/test
A         esa-maven-plugin/src/test/remote-repo/org/apache/maven/test/maven-artifact01
A         esa-maven-plugin/src/test/remote-repo/org/apache/maven/test/maven-artifact01/1.0-SNAPSHOT
A         esa-maven-plugin/src/test/remote-repo/org/apache/maven/test/maven-artifact01/1.0-SNAPSHOT/maven-artifact01-1.0-SNAPSHOT.pom
AU        esa-maven-plugin/src/test/remote-repo/org/apache/maven/test/maven-artifact01/1.0-SNAPSHOT/maven-artifact01-1.0-SNAPSHOT.jar
A         esa-maven-plugin/src/test/remote-repo/org/apache/maven/test/maven-artifact02
A         esa-maven-plugin/src/test/remote-repo/org/apache/maven/test/maven-artifact02/1.0-SNAPSHOT
A         esa-maven-plugin/src/test/remote-repo/org/apache/maven/test/maven-artifact02/1.0-SNAPSHOT/maven-artifact02-1.0-SNAPSHOT.pom
AU        esa-maven-plugin/src/test/remote-repo/org/apache/maven/test/maven-artifact02/1.0-SNAPSHOT/maven-artifact02-1.0-SNAPSHOT.jar
A         esa-maven-plugin/src/test/remote-repo/org/apache/maven/test/maven-artifact03
A         esa-maven-plugin/src/test/remote-repo/org/apache/maven/test/maven-artifact03/1.1-SNAPSHOT
A         esa-maven-plugin/src/test/remote-repo/org/apache/maven/test/maven-artifact03/1.1-SNAPSHOT/maven-artifact03-1.1-SNAPSHOT.pom
AU        esa-maven-plugin/src/test/remote-repo/org/apache/maven/test/maven-artifact03/1.1-SNAPSHOT/maven-artifact03-1.1-SNAPSHOT.jar
A         esa-maven-plugin/src/test/remote-repo/org/apache/maven/test/maven-artifact04
A         esa-maven-plugin/src/test/remote-repo/org/apache/maven/test/maven-artifact04/1.2-SNAPSHOT
AU        esa-maven-plugin/src/test/remote-repo/org/apache/maven/test/maven-artifact04/1.2-SNAPSHOT/maven-artifact04-1.2-SNAPSHOT.esa
A         esa-maven-plugin/src/test/remote-repo/org/apache/maven/test/maven-artifact04/1.2-SNAPSHOT/maven-artifact04-1.2-SNAPSHOT.pom
A         esa-maven-plugin/src/test/java
A         esa-maven-plugin/src/test/java/org
A         esa-maven-plugin/src/test/java/org/apache
A         esa-maven-plugin/src/test/java/org/apache/aries
A         esa-maven-plugin/src/test/java/org/apache/aries/plugin
A         esa-maven-plugin/src/test/java/org/apache/aries/plugin/esa
A         esa-maven-plugin/src/test/java/org/apache/aries/plugin/esa/EsaMojoTest.java
A         esa-maven-plugin/src/test/java/org/apache/aries/plugin/esa/stubs
A         esa-maven-plugin/src/test/java/org/apache/aries/plugin/esa/stubs/BasicEsaStartOrder.java
A         esa-maven-plugin/src/test/java/org/apache/aries/plugin/esa/stubs/EsaArtifactStub.java
A         esa-maven-plugin/src/test/java/org/apache/aries/plugin/esa/stubs/EsaMavenProjectStub.java
A         esa-maven-plugin/src/test/java/org/apache/aries/plugin/esa/stubs/EsaMavenProjectStub2.java
A         esa-maven-plugin/src/test/java/org/apache/aries/plugin/esa/stubs/EsaMavenProjectStub3.java
A         esa-maven-plugin/src/test/java/org/apache/aries/plugin/esa/stubs/EsaMavenProjectStub4.java
A         esa-maven-plugin/src/test/java/org/apache/aries/plugin/esa/stubs/EsaMavenProjectStub5.java
A         esa-maven-plugin/src/test/java/org/apache/aries/plugin/esa/stubs/EsaMavenProjectStub6.java
A         esa-maven-plugin/src/test/java/org/apache/aries/plugin/esa/stubs/EsaMavenProjectStub7.java
AU        esa-maven-plugin/src/test/java/org/apache/aries/plugin/esa/stubs/EsaMavenProjectStub8.java
AU        esa-maven-plugin/src/test/java/org/apache/aries/plugin/esa/stubs/EsaMavenProjectStub9.java
A         esa-maven-plugin/pom.xml
 U        .
At revision 1598669
[aries-current-snapshots] $ /home/jenkins/jenkins-slave/tools/hudson.tasks.Maven_MavenInstallation/Maven_3.0.3/bin/mvn
-Dmaven.repo.local=<https://builds.apache.org/job/AriesWithSnapshotDependencies/ws/.repository>
-U -cpu -e -B -f parent/pom.xml clean install
[INFO] Error stacktraces are turned on.
[WARNING] Command line option -cpu is deprecated and will be removed in future Maven versions.
[INFO] Scanning for projects...
Downloading: http://download.eclipse.org/rt/eclipselink/maven.repo/org/apache/apache/14/apache-14.pom
Downloading: http://repo1.maven.org/maven2/org/apache/apache/14/apache-14.pom
Downloaded: http://repo1.maven.org/maven2/org/apache/apache/14/apache-14.pom (15 KB at 27.6
KB/sec)
[INFO]                                                                         
[INFO] ------------------------------------------------------------------------
[INFO] Building Aries :: Parent POM 1.0.1-SNAPSHOT
[INFO] ------------------------------------------------------------------------
Downloading: http://repo1.maven.org/maven2/org/apache/maven/plugins/maven-remote-resources-plugin/1.5/maven-remote-resources-plugin-1.5.pom
Downloaded: http://repo1.maven.org/maven2/org/apache/maven/plugins/maven-remote-resources-plugin/1.5/maven-remote-resources-plugin-1.5.pom
(14 KB at 93.1 KB/sec)
Downloading: http://repo1.maven.org/maven2/org/apache/maven/plugins/maven-remote-resources-plugin/1.5/maven-remote-resources-plugin-1.5.jar
Downloaded: http://repo1.maven.org/maven2/org/apache/maven/plugins/maven-remote-resources-plugin/1.5/maven-remote-resources-plugin-1.5.jar
(68 KB at 940.8 KB/sec)
Downloading: http://repo1.maven.org/maven2/org/apache/maven/plugins/maven-site-plugin/3.3/maven-site-plugin-3.3.pom
Downloaded: http://repo1.maven.org/maven2/org/apache/maven/plugins/maven-site-plugin/3.3/maven-site-plugin-3.3.pom
(21 KB at 5.5 KB/sec)
Downloading: http://repo1.maven.org/maven2/org/apache/maven/plugins/maven-site-plugin/3.3/maven-site-plugin-3.3.jar
Downloaded: http://repo1.maven.org/maven2/org/apache/maven/plugins/maven-site-plugin/3.3/maven-site-plugin-3.3.jar
(122 KB at 264.0 KB/sec)
Downloading: http://repo1.maven.org/maven2/org/apache/maven/plugins/maven-clean-plugin/2.5/maven-clean-plugin-2.5.pom
Downloaded: http://repo1.maven.org/maven2/org/apache/maven/plugins/maven-clean-plugin/2.5/maven-clean-plugin-2.5.pom
(4 KB at 2.8 KB/sec)
Downloading: http://repo1.maven.org/maven2/org/apache/maven/plugins/maven-clean-plugin/2.5/maven-clean-plugin-2.5.jar
Downloaded: http://repo1.maven.org/maven2/org/apache/maven/plugins/maven-clean-plugin/2.5/maven-clean-plugin-2.5.jar
(25 KB at 829.5 KB/sec)
Downloading: http://repo1.maven.org/maven2/org/apache/maven/plugins/maven-enforcer-plugin/1.3.1/maven-enforcer-plugin-1.3.1.pom
Downloaded: http://repo1.maven.org/maven2/org/apache/maven/plugins/maven-enforcer-plugin/1.3.1/maven-enforcer-plugin-1.3.1.pom
(7 KB at 19.4 KB/sec)
Downloading: http://repo1.maven.org/maven2/org/apache/maven/enforcer/enforcer/1.3.1/enforcer-1.3.1.pom
Downloaded: http://repo1.maven.org/maven2/org/apache/maven/enforcer/enforcer/1.3.1/enforcer-1.3.1.pom
(12 KB at 51.6 KB/sec)
Downloading: http://repo1.maven.org/maven2/org/apache/maven/plugins/maven-enforcer-plugin/1.3.1/maven-enforcer-plugin-1.3.1.jar
Downloaded: http://repo1.maven.org/maven2/org/apache/maven/plugins/maven-enforcer-plugin/1.3.1/maven-enforcer-plugin-1.3.1.jar
(26 KB at 835.6 KB/sec)
Downloading: http://repo1.maven.org/maven2/org/apache/maven/plugins/maven-install-plugin/2.5.1/maven-install-plugin-2.5.1.pom
Downloaded: http://repo1.maven.org/maven2/org/apache/maven/plugins/maven-install-plugin/2.5.1/maven-install-plugin-2.5.1.pom
(8 KB at 80.8 KB/sec)
Downloading: http://repo1.maven.org/maven2/org/apache/maven/plugins/maven-install-plugin/2.5.1/maven-install-plugin-2.5.1.jar
Downloaded: http://repo1.maven.org/maven2/org/apache/maven/plugins/maven-install-plugin/2.5.1/maven-install-plugin-2.5.1.jar
(33 KB at 1070.5 KB/sec)
[INFO] 
[INFO] --- maven-clean-plugin:2.5:clean (default-clean) @ parent ---
[INFO] 
[INFO] --- maven-enforcer-plugin:1.3.1:enforce (default) @ parent ---
Downloading: http://repo1.maven.org/maven2/org/apache/maven/enforcer/enforcer-api/1.3.1/enforcer-api-1.3.1.pom
Downloaded: http://repo1.maven.org/maven2/org/apache/maven/enforcer/enforcer-api/1.3.1/enforcer-api-1.3.1.pom
(3 KB at 2.3 KB/sec)
Downloading: http://repo1.maven.org/maven2/junit/junit/4.11/junit-4.11.pom
Downloaded: http://repo1.maven.org/maven2/junit/junit/4.11/junit-4.11.pom (3 KB at 36.9 KB/sec)
Downloading: http://repo1.maven.org/maven2/org/hamcrest/hamcrest-core/1.3/hamcrest-core-1.3.pom
Downloaded: http://repo1.maven.org/maven2/org/hamcrest/hamcrest-core/1.3/hamcrest-core-1.3.pom
(766 B at 8.1 KB/sec)
Downloading: http://repo1.maven.org/maven2/org/hamcrest/hamcrest-parent/1.3/hamcrest-parent-1.3.pom
Downloaded: http://repo1.maven.org/maven2/org/hamcrest/hamcrest-parent/1.3/hamcrest-parent-1.3.pom
(2 KB at 20.7 KB/sec)
Downloading: http://repo1.maven.org/maven2/org/apache/maven/enforcer/enforcer-rules/1.3.1/enforcer-rules-1.3.1.pom
Downloaded: http://repo1.maven.org/maven2/org/apache/maven/enforcer/enforcer-rules/1.3.1/enforcer-rules-1.3.1.pom
(4 KB at 40.5 KB/sec)
Downloading: http://repo1.maven.org/maven2/org/apache/maven/shared/maven-dependency-tree/2.1/maven-dependency-tree-2.1.pom
Downloaded: http://repo1.maven.org/maven2/org/apache/maven/shared/maven-dependency-tree/2.1/maven-dependency-tree-2.1.pom
(7 KB at 47.0 KB/sec)
Downloading: http://repo1.maven.org/maven2/org/eclipse/aether/aether-util/0.9.0.M2/aether-util-0.9.0.M2.pom
Downloaded: http://repo1.maven.org/maven2/org/eclipse/aether/aether-util/0.9.0.M2/aether-util-0.9.0.M2.pom
(2 KB at 1.1 KB/sec)
Downloading: http://repo1.maven.org/maven2/org/eclipse/aether/aether/0.9.0.M2/aether-0.9.0.M2.pom
Downloaded: http://repo1.maven.org/maven2/org/eclipse/aether/aether/0.9.0.M2/aether-0.9.0.M2.pom
(28 KB at 92.6 KB/sec)
Downloading: http://repo1.maven.org/maven2/org/codehaus/plexus/plexus-i18n/1.0-beta-6/plexus-i18n-1.0-beta-6.pom
Downloaded: http://repo1.maven.org/maven2/org/codehaus/plexus/plexus-i18n/1.0-beta-6/plexus-i18n-1.0-beta-6.pom
(771 B at 3.8 KB/sec)
Downloading: http://repo1.maven.org/maven2/org/codehaus/plexus/plexus-components/1.1.4/plexus-components-1.1.4.pom
Downloaded: http://repo1.maven.org/maven2/org/codehaus/plexus/plexus-components/1.1.4/plexus-components-1.1.4.pom
(3 KB at 16.1 KB/sec)
Downloading: http://repo1.maven.org/maven2/org/apache/maven/enforcer/enforcer-api/1.3.1/enforcer-api-1.3.1.jar
Downloading: http://repo1.maven.org/maven2/org/apache/maven/enforcer/enforcer-rules/1.3.1/enforcer-rules-1.3.1.jar
Downloading: http://repo1.maven.org/maven2/org/apache/maven/shared/maven-dependency-tree/2.1/maven-dependency-tree-2.1.jar
Downloading: http://repo1.maven.org/maven2/org/eclipse/aether/aether-util/0.9.0.M2/aether-util-0.9.0.M2.jar
Downloading: http://repo1.maven.org/maven2/org/codehaus/plexus/plexus-i18n/1.0-beta-6/plexus-i18n-1.0-beta-6.jar
Downloaded: http://repo1.maven.org/maven2/org/apache/maven/enforcer/enforcer-rules/1.3.1/enforcer-rules-1.3.1.jar
(86 KB at 91.0 KB/sec)
Downloaded: http://repo1.maven.org/maven2/org/eclipse/aether/aether-util/0.9.0.M2/aether-util-0.9.0.M2.jar
(131 KB at 137.9 KB/sec)
Downloaded: http://repo1.maven.org/maven2/org/apache/maven/enforcer/enforcer-api/1.3.1/enforcer-api-1.3.1.jar
(10 KB at 9.7 KB/sec)
Downloaded: http://repo1.maven.org/maven2/org/codehaus/plexus/plexus-i18n/1.0-beta-6/plexus-i18n-1.0-beta-6.jar
(12 KB at 11.7 KB/sec)
Downloaded: http://repo1.maven.org/maven2/org/apache/maven/shared/maven-dependency-tree/2.1/maven-dependency-tree-2.1.jar
(59 KB at 55.7 KB/sec)
[WARNING] Rule 1: org.apache.maven.plugins.enforcer.RequireJavaVersion failed with message:
Detected JDK Version: 1.6.0-45 is not in the allowed range [1.7,).
[INFO] ------------------------------------------------------------------------
[INFO] BUILD FAILURE
[INFO] ------------------------------------------------------------------------
[INFO] Total time: 1:06.286s
[INFO] Finished at: Fri May 30 17:06:12 UTC 2014
[INFO] Final Memory: 5M/111M
[INFO] ------------------------------------------------------------------------
[ERROR] Failed to execute goal org.apache.maven.plugins:maven-enforcer-plugin:1.3.1:enforce
(default) on project parent: Some Enforcer rules have failed. Look above for specific messages
explaining why the rule failed. -> [Help 1]
org.apache.maven.lifecycle.LifecycleExecutionException: Failed to execute goal org.apache.maven.plugins:maven-enforcer-plugin:1.3.1:enforce
(default) on project parent: Some Enforcer rules have failed. Look above for specific messages
explaining why the rule failed.
	at org.apache.maven.lifecycle.internal.MojoExecutor.execute(MojoExecutor.java:217)
	at org.apache.maven.lifecycle.internal.MojoExecutor.execute(MojoExecutor.java:153)
	at org.apache.maven.lifecycle.internal.MojoExecutor.execute(MojoExecutor.java:145)
	at org.apache.maven.lifecycle.internal.LifecycleModuleBuilder.buildProject(LifecycleModuleBuilder.java:84)
	at org.apache.maven.lifecycle.internal.LifecycleModuleBuilder.buildProject(LifecycleModuleBuilder.java:59)
	at org.apache.maven.lifecycle.internal.LifecycleStarter.singleThreadedBuild(LifecycleStarter.java:183)
	at org.apache.maven.lifecycle.internal.LifecycleStarter.execute(LifecycleStarter.java:161)
	at org.apache.maven.DefaultMaven.doExecute(DefaultMaven.java:319)
	at org.apache.maven.DefaultMaven.execute(DefaultMaven.java:156)
	at org.apache.maven.cli.MavenCli.execute(MavenCli.java:537)
	at org.apache.maven.cli.MavenCli.doMain(MavenCli.java:196)
	at org.apache.maven.cli.MavenCli.main(MavenCli.java:141)
	at sun.reflect.NativeMethodAccessorImpl.invoke0(Native Method)
	at sun.reflect.NativeMethodAccessorImpl.invoke(NativeMethodAccessorImpl.java:39)
	at sun.reflect.DelegatingMethodAccessorImpl.invoke(DelegatingMethodAccessorImpl.java:25)
	at java.lang.reflect.Method.invoke(Method.java:597)
	at org.codehaus.plexus.classworlds.launcher.Launcher.launchEnhanced(Launcher.java:290)
	at org.codehaus.plexus.classworlds.launcher.Launcher.launch(Launcher.java:230)
	at org.codehaus.plexus.classworlds.launcher.Launcher.mainWithExitCode(Launcher.java:409)
	at org.codehaus.plexus.classworlds.launcher.Launcher.main(Launcher.java:352)
Caused by: org.apache.maven.plugin.MojoExecutionException: Some Enforcer rules have failed.
Look above for specific messages explaining why the rule failed.
	at org.apache.maven.plugins.enforcer.EnforceMojo.execute(EnforceMojo.java:209)
	at org.apache.maven.plugin.DefaultBuildPluginManager.executeMojo(DefaultBuildPluginManager.java:101)
	at org.apache.maven.lifecycle.internal.MojoExecutor.execute(MojoExecutor.java:209)
	... 19 more
[ERROR] 
[ERROR] Re-run Maven using the -X switch to enable full debug logging.
[ERROR] 
[ERROR] For more information about the errors and possible solutions, please read the following
articles:
[ERROR] [Help 1] http://cwiki.apache.org/confluence/display/MAVEN/MojoExecutionException
Build step 'Invoke top-level Maven targets' marked build as failure

Mime
View raw message