aries-dev mailing list archives

Site index · List index
Message view « Date » · « Thread »
Top « Date » · « Thread »
From Apache Jenkins Server <jenk...@builds.apache.org>
Subject Build failed in Jenkins: AriesWithSnapshotDependencies #453
Date Fri, 30 May 2014 12:57:26 GMT
See <https://builds.apache.org/job/AriesWithSnapshotDependencies/453/changes>

Changes:

[jbonofre] [ARIES-1006] Refactoring of the parent pom, upgrade to OSGi 4.3.1 and full Java7
compilation support

------------------------------------------
[...truncated 6247 lines...]
AU        jpa/jpa-container-context/src/main/java/org/apache/aries/jpa/container/context/transaction/impl/JTAPersistenceContextRegistry.java
A         jpa/jpa-container-context/src/main/java/org/apache/aries/jpa/container/context/impl
AU        jpa/jpa-container-context/src/main/java/org/apache/aries/jpa/container/context/impl/NLS.java
AU        jpa/jpa-container-context/src/main/java/org/apache/aries/jpa/container/context/impl/ManagedPersistenceContextFactory.java
A         jpa/jpa-container-context/src/main/java/org/apache/aries/jpa/container/context/impl/QuiesceParticipantImpl.java
AU        jpa/jpa-container-context/src/main/java/org/apache/aries/jpa/container/context/impl/GlobalPersistenceManager.java
AU        jpa/jpa-container-context/src/main/java/org/apache/aries/jpa/container/context/impl/PersistenceContextManager.java
AU        jpa/jpa-container-context/pom.xml
A         jpa/jpa-blueprint-aries
A         jpa/jpa-blueprint-aries/NOTICE
A         jpa/jpa-blueprint-aries/LICENSE
A         jpa/jpa-blueprint-aries/src
A         jpa/jpa-blueprint-aries/src/main
A         jpa/jpa-blueprint-aries/src/main/java
A         jpa/jpa-blueprint-aries/src/main/java/org
A         jpa/jpa-blueprint-aries/src/main/java/org/apache
A         jpa/jpa-blueprint-aries/src/main/java/org/apache/aries
A         jpa/jpa-blueprint-aries/src/main/java/org/apache/aries/jpa
A         jpa/jpa-blueprint-aries/src/main/java/org/apache/aries/jpa/blueprint
A         jpa/jpa-blueprint-aries/src/main/java/org/apache/aries/jpa/blueprint/aries
A         jpa/jpa-blueprint-aries/src/main/java/org/apache/aries/jpa/blueprint/aries/impl
AU        jpa/jpa-blueprint-aries/src/main/java/org/apache/aries/jpa/blueprint/aries/impl/NSHandler.java
A         jpa/jpa-blueprint-aries/src/main/resources
A         jpa/jpa-blueprint-aries/src/main/resources/org
A         jpa/jpa-blueprint-aries/src/main/resources/org/apache
A         jpa/jpa-blueprint-aries/src/main/resources/org/apache/aries
A         jpa/jpa-blueprint-aries/src/main/resources/org/apache/aries/jpa
A         jpa/jpa-blueprint-aries/src/main/resources/org/apache/aries/jpa/blueprint
A         jpa/jpa-blueprint-aries/src/main/resources/org/apache/aries/jpa/blueprint/aries
A         jpa/jpa-blueprint-aries/src/main/resources/org/apache/aries/jpa/blueprint/aries/nls
AU        jpa/jpa-blueprint-aries/src/main/resources/org/apache/aries/jpa/blueprint/aries/nls/ariesBlueprintJpaMessages.properties
A         jpa/jpa-blueprint-aries/src/main/resources/org/apache/aries/jpa/blueprint/namespace
AU        jpa/jpa-blueprint-aries/src/main/resources/org/apache/aries/jpa/blueprint/namespace/jpa.xsd
A         jpa/jpa-blueprint-aries/src/main/resources/org/apache/aries/jpa/blueprint/namespace/jpa_110.xsd
A         jpa/jpa-blueprint-aries/src/main/resources/OSGI-INF
A         jpa/jpa-blueprint-aries/src/main/resources/OSGI-INF/blueprint
AU        jpa/jpa-blueprint-aries/src/main/resources/OSGI-INF/blueprint/jpa.xml
A         jpa/jpa-blueprint-aries/src/test
A         jpa/jpa-blueprint-aries/src/test/resources
AU        jpa/jpa-blueprint-aries/src/test/resources/jpa.xml
A         jpa/jpa-blueprint-aries/src/test/resources/jpa_110.xml
A         jpa/jpa-blueprint-aries/src/test/java
A         jpa/jpa-blueprint-aries/src/test/java/org
A         jpa/jpa-blueprint-aries/src/test/java/org/apache
A         jpa/jpa-blueprint-aries/src/test/java/org/apache/aries
A         jpa/jpa-blueprint-aries/src/test/java/org/apache/aries/jpa
A         jpa/jpa-blueprint-aries/src/test/java/org/apache/aries/jpa/blueprint
A         jpa/jpa-blueprint-aries/src/test/java/org/apache/aries/jpa/blueprint/aries
A         jpa/jpa-blueprint-aries/src/test/java/org/apache/aries/jpa/blueprint/aries/test
AU        jpa/jpa-blueprint-aries/src/test/java/org/apache/aries/jpa/blueprint/aries/test/NSHandlerTest.java
AU        jpa/jpa-blueprint-aries/pom.xml
A         jpa/jpa-container-itest
A         jpa/jpa-container-itest/LICENSE
A         jpa/jpa-container-itest/src
A         jpa/jpa-container-itest/src/test
A         jpa/jpa-container-itest/src/test/resources
A         jpa/jpa-container-itest/src/test/resources/META-INF
A         jpa/jpa-container-itest/src/test/resources/META-INF/platform-equinox
A         jpa/jpa-container-itest/src/test/resources/META-INF/platform-equinox/definition-3.7.0.V20110613.xml
A         jpa/jpa-container-itest/src/test/resources/ss-runner.properties
A         jpa/jpa-container-itest/src/test/java
A         jpa/jpa-container-itest/src/test/java/org
A         jpa/jpa-container-itest/src/test/java/org/ops4j
A         jpa/jpa-container-itest/src/test/java/org/ops4j/pax
A         jpa/jpa-container-itest/src/test/java/org/ops4j/pax/runner
A         jpa/jpa-container-itest/src/test/java/org/ops4j/pax/runner/platform
A         jpa/jpa-container-itest/src/test/java/org/ops4j/pax/runner/platform/equinox
A         jpa/jpa-container-itest/src/test/java/org/ops4j/pax/runner/platform/equinox/internal
A         jpa/jpa-container-itest/src/test/java/org/ops4j/pax/runner/platform/equinox/internal/SsActivator.java
A         jpa/jpa-container-itest/src/test/java/org/apache
A         jpa/jpa-container-itest/src/test/java/org/apache/aries
A         jpa/jpa-container-itest/src/test/java/org/apache/aries/jpa
A         jpa/jpa-container-itest/src/test/java/org/apache/aries/jpa/quiesce
A         jpa/jpa-container-itest/src/test/java/org/apache/aries/jpa/quiesce/itest
A         jpa/jpa-container-itest/src/test/java/org/apache/aries/jpa/quiesce/itest/QuiesceJPATest.java
A         jpa/jpa-container-itest/src/test/java/org/apache/aries/jpa/container
A         jpa/jpa-container-itest/src/test/java/org/apache/aries/jpa/container/itest
AU        jpa/jpa-container-itest/src/test/java/org/apache/aries/jpa/container/itest/JPAContainerTest.java
A         jpa/jpa-container-itest/src/test/java/org/apache/aries/jpa/container/itest/JPAContainerDataSourceFactoryTest.java
A         jpa/jpa-container-itest/src/test/java/org/apache/aries/jpa/blueprint
A         jpa/jpa-container-itest/src/test/java/org/apache/aries/jpa/blueprint/aries
A         jpa/jpa-container-itest/src/test/java/org/apache/aries/jpa/blueprint/aries/itest
AU        jpa/jpa-container-itest/src/test/java/org/apache/aries/jpa/blueprint/aries/itest/JPAInjectionTest.java
A         jpa/jpa-container-itest/src/test/java/org/apache/aries/jpa/context
A         jpa/jpa-container-itest/src/test/java/org/apache/aries/jpa/context/itest
A         jpa/jpa-container-itest/src/test/java/org/apache/aries/jpa/context/itest/OpenjpaContextTest.java
A         jpa/jpa-container-itest/src/test/java/org/apache/aries/jpa/context/itest/EclipseLinkStartupTest.java
A         jpa/jpa-container-itest/src/test/java/org/apache/aries/jpa/context/itest/EclipseLinkContextTest.java
AU        jpa/jpa-container-itest/src/test/java/org/apache/aries/jpa/context/itest/JPAContextTest.java
A         jpa/jpa-container-itest/src/test/java/org/apache/aries/jpa/advanced
A         jpa/jpa-container-itest/src/test/java/org/apache/aries/jpa/advanced/features
A         jpa/jpa-container-itest/src/test/java/org/apache/aries/jpa/advanced/features/itest
A         jpa/jpa-container-itest/src/test/java/org/apache/aries/jpa/advanced/features/itest/OpenjpaWeavingAndAnnotationScanningTest.java
A         jpa/jpa-container-itest/src/test/java/org/apache/aries/jpa/advanced/features/itest/EclipseLinkWeavingAndAnnotationScanningTest.java
A         jpa/jpa-container-itest/src/test/java/org/apache/aries/jpa/advanced/features/itest/JPAWeavingAndAnnotationScanningTest.java
AU        jpa/jpa-container-itest/pom.xml
A         jpa/jpa-container-itest/NOTICE
A         jpa/NOTICE
A         jpa/jpa-api
A         jpa/jpa-api/src
A         jpa/jpa-api/src/main
A         jpa/jpa-api/src/main/java
A         jpa/jpa-api/src/main/java/org
A         jpa/jpa-api/src/main/java/org/apache
A         jpa/jpa-api/src/main/java/org/apache/aries
A         jpa/jpa-api/src/main/java/org/apache/aries/jpa
A         jpa/jpa-api/src/main/java/org/apache/aries/jpa/container
AU        jpa/jpa-api/src/main/java/org/apache/aries/jpa/container/ManagedPersistenceUnitInfo.java
AU        jpa/jpa-api/src/main/java/org/apache/aries/jpa/container/PersistenceUnitConstants.java
A         jpa/jpa-api/src/main/java/org/apache/aries/jpa/container/parsing
A         jpa/jpa-api/src/main/java/org/apache/aries/jpa/container/parsing/packageinfo
AU        jpa/jpa-api/src/main/java/org/apache/aries/jpa/container/parsing/PersistenceDescriptorParserException.java
AU        jpa/jpa-api/src/main/java/org/apache/aries/jpa/container/parsing/PersistenceDescriptorParser.java
AU        jpa/jpa-api/src/main/java/org/apache/aries/jpa/container/parsing/ParsedPersistenceUnit.java
AU        jpa/jpa-api/src/main/java/org/apache/aries/jpa/container/parsing/PersistenceDescriptor.java
A         jpa/jpa-api/src/main/java/org/apache/aries/jpa/container/context
A         jpa/jpa-api/src/main/java/org/apache/aries/jpa/container/context/packageinfo
A         jpa/jpa-api/src/main/java/org/apache/aries/jpa/container/context/JTAPersistenceContextManager.java
AU        jpa/jpa-api/src/main/java/org/apache/aries/jpa/container/context/PersistenceContextProvider.java
AU        jpa/jpa-api/src/main/java/org/apache/aries/jpa/container/ManagedPersistenceUnitInfoFactory.java
A         jpa/jpa-api/src/main/java/org/apache/aries/jpa/container/packageinfo
AU        jpa/jpa-api/pom.xml
A         jpa/jpa-api/NOTICE
A         jpa/jpa-api/LICENSE
A         jpa/jpa-container-testbundle
AU        jpa/jpa-container-testbundle/pom.xml
A         jpa/jpa-container-testbundle/NOTICE
A         jpa/jpa-container-testbundle/LICENSE
A         jpa/jpa-container-testbundle/src
A         jpa/jpa-container-testbundle/src/main
A         jpa/jpa-container-testbundle/src/main/resources
A         jpa/jpa-container-testbundle/src/main/resources/OSGI-INF
A         jpa/jpa-container-testbundle/src/main/resources/OSGI-INF/blueprint
A         jpa/jpa-container-testbundle/src/main/resources/OSGI-INF/blueprint/config.xml
A         jpa/jpa-container-testbundle/src/main/resources/META-INF
A         jpa/jpa-container-testbundle/src/main/resources/META-INF/persistence.xml
A         jpa/jpa-container-testbundle/src/main/java
A         jpa/jpa-container-testbundle/src/main/java/org
A         jpa/jpa-container-testbundle/src/main/java/org/apache
A         jpa/jpa-container-testbundle/src/main/java/org/apache/aries
A         jpa/jpa-container-testbundle/src/main/java/org/apache/aries/jpa
A         jpa/jpa-container-testbundle/src/main/java/org/apache/aries/jpa/container
A         jpa/jpa-container-testbundle/src/main/java/org/apache/aries/jpa/container/itest
A         jpa/jpa-container-testbundle/src/main/java/org/apache/aries/jpa/container/itest/entities
AU        jpa/jpa-container-testbundle/src/main/java/org/apache/aries/jpa/container/itest/entities/Car.java
A         jpa/jpa-container-testbundle/src/main/java/org/apache/aries/jpa/container/itest/entities/packageinfo
A         jpa/jpa-container-testbundle-eclipselink
A         jpa/jpa-container-testbundle-eclipselink/src
A         jpa/jpa-container-testbundle-eclipselink/src/main
A         jpa/jpa-container-testbundle-eclipselink/src/main/resources
A         jpa/jpa-container-testbundle-eclipselink/src/main/resources/META-INF
A         jpa/jpa-container-testbundle-eclipselink/src/main/resources/META-INF/persistence.xml
A         jpa/jpa-container-testbundle-eclipselink/src/main/resources/OSGI-INF
A         jpa/jpa-container-testbundle-eclipselink/src/main/resources/OSGI-INF/blueprint
A         jpa/jpa-container-testbundle-eclipselink/src/main/resources/OSGI-INF/blueprint/config.xml
A         jpa/jpa-container-testbundle-eclipselink/src/main/java
A         jpa/jpa-container-testbundle-eclipselink/src/main/java/org
A         jpa/jpa-container-testbundle-eclipselink/src/main/java/org/apache
A         jpa/jpa-container-testbundle-eclipselink/src/main/java/org/apache/aries
A         jpa/jpa-container-testbundle-eclipselink/src/main/java/org/apache/aries/jpa
A         jpa/jpa-container-testbundle-eclipselink/src/main/java/org/apache/aries/jpa/container
A         jpa/jpa-container-testbundle-eclipselink/src/main/java/org/apache/aries/jpa/container/itest
A         jpa/jpa-container-testbundle-eclipselink/src/main/java/org/apache/aries/jpa/container/itest/entities
A         jpa/jpa-container-testbundle-eclipselink/src/main/java/org/apache/aries/jpa/container/itest/entities/Car.java
A         jpa/jpa-container-testbundle-eclipselink/src/main/java/org/apache/aries/jpa/container/itest/entities/packageinfo
A         jpa/jpa-container-testbundle-eclipselink/pom.xml
A         jpa/jpa-container-testbundle-eclipselink/NOTICE
A         jpa/jpa-container-testbundle-eclipselink/LICENSE
AU        jpa/LICENSE
A         jpa/jpa-blueprint-testbundle
A         jpa/jpa-blueprint-testbundle/src
A         jpa/jpa-blueprint-testbundle/src/main
A         jpa/jpa-blueprint-testbundle/src/main/resources
A         jpa/jpa-blueprint-testbundle/src/main/resources/OSGI-INF
A         jpa/jpa-blueprint-testbundle/src/main/resources/OSGI-INF/blueprint
AU        jpa/jpa-blueprint-testbundle/src/main/resources/OSGI-INF/blueprint/injection.xml
A         jpa/jpa-blueprint-testbundle/src/main/resources/OSGI-INF/blueprint/injection2.xml
A         jpa/jpa-blueprint-testbundle/src/main/resources/OSGI-INF/persistence
AU        jpa/jpa-blueprint-testbundle/src/main/resources/OSGI-INF/persistence/persistence.xml
A         jpa/jpa-blueprint-testbundle/src/main/java
A         jpa/jpa-blueprint-testbundle/src/main/java/org
A         jpa/jpa-blueprint-testbundle/src/main/java/org/apache
A         jpa/jpa-blueprint-testbundle/src/main/java/org/apache/aries
A         jpa/jpa-blueprint-testbundle/src/main/java/org/apache/aries/jpa
A         jpa/jpa-blueprint-testbundle/src/main/java/org/apache/aries/jpa/blueprint
A         jpa/jpa-blueprint-testbundle/src/main/java/org/apache/aries/jpa/blueprint/itest
AU        jpa/jpa-blueprint-testbundle/src/main/java/org/apache/aries/jpa/blueprint/itest/JPATestBean.java
A         jpa/jpa-blueprint-testbundle/src/main/java/org/apache/aries/jpa/blueprint/itest/entities
AU        jpa/jpa-blueprint-testbundle/src/main/java/org/apache/aries/jpa/blueprint/itest/entities/Car.java
A         jpa/jpa-blueprint-testbundle/src/main/java/org/apache/aries/jpa/blueprint/itest/entities/packageinfo
AU        jpa/jpa-blueprint-testbundle/pom.xml
A         jpa/jpa-blueprint-testbundle/NOTICE
A         jpa/jpa-blueprint-testbundle/LICENSE
 U        .
At revision 1598573
[aries-current-snapshots] $ /home/jenkins/jenkins-slave/tools/hudson.tasks.Maven_MavenInstallation/Maven_3.0.3/bin/mvn
-Dmaven.repo.local=<https://builds.apache.org/job/AriesWithSnapshotDependencies/ws/.repository>
-U -cpu -e -B -f parent/pom.xml clean install
[INFO] Error stacktraces are turned on.
[WARNING] Command line option -cpu is deprecated and will be removed in future Maven versions.
[INFO] Scanning for projects...
[INFO]                                                                         
[INFO] ------------------------------------------------------------------------
[INFO] Building Aries :: Parent POM 1.0.1-SNAPSHOT
[INFO] ------------------------------------------------------------------------
[INFO] 
[INFO] --- maven-clean-plugin:2.5:clean (default-clean) @ parent ---
[INFO] 
[INFO] --- maven-enforcer-plugin:1.3.1:enforce (default) @ parent ---
[WARNING] Rule 1: org.apache.maven.plugins.enforcer.RequireJavaVersion failed with message:
Detected JDK Version: 1.6.0-45 is not in the allowed range [1.7,).
[INFO] ------------------------------------------------------------------------
[INFO] BUILD FAILURE
[INFO] ------------------------------------------------------------------------
[INFO] Total time: 5.405s
[INFO] Finished at: Fri May 30 12:57:20 UTC 2014
[INFO] Final Memory: 4M/60M
[INFO] ------------------------------------------------------------------------
[ERROR] Failed to execute goal org.apache.maven.plugins:maven-enforcer-plugin:1.3.1:enforce
(default) on project parent: Some Enforcer rules have failed. Look above for specific messages
explaining why the rule failed. -> [Help 1]
org.apache.maven.lifecycle.LifecycleExecutionException: Failed to execute goal org.apache.maven.plugins:maven-enforcer-plugin:1.3.1:enforce
(default) on project parent: Some Enforcer rules have failed. Look above for specific messages
explaining why the rule failed.
	at org.apache.maven.lifecycle.internal.MojoExecutor.execute(MojoExecutor.java:217)
	at org.apache.maven.lifecycle.internal.MojoExecutor.execute(MojoExecutor.java:153)
	at org.apache.maven.lifecycle.internal.MojoExecutor.execute(MojoExecutor.java:145)
	at org.apache.maven.lifecycle.internal.LifecycleModuleBuilder.buildProject(LifecycleModuleBuilder.java:84)
	at org.apache.maven.lifecycle.internal.LifecycleModuleBuilder.buildProject(LifecycleModuleBuilder.java:59)
	at org.apache.maven.lifecycle.internal.LifecycleStarter.singleThreadedBuild(LifecycleStarter.java:183)
	at org.apache.maven.lifecycle.internal.LifecycleStarter.execute(LifecycleStarter.java:161)
	at org.apache.maven.DefaultMaven.doExecute(DefaultMaven.java:319)
	at org.apache.maven.DefaultMaven.execute(DefaultMaven.java:156)
	at org.apache.maven.cli.MavenCli.execute(MavenCli.java:537)
	at org.apache.maven.cli.MavenCli.doMain(MavenCli.java:196)
	at org.apache.maven.cli.MavenCli.main(MavenCli.java:141)
	at sun.reflect.NativeMethodAccessorImpl.invoke0(Native Method)
	at sun.reflect.NativeMethodAccessorImpl.invoke(NativeMethodAccessorImpl.java:39)
	at sun.reflect.DelegatingMethodAccessorImpl.invoke(DelegatingMethodAccessorImpl.java:25)
	at java.lang.reflect.Method.invoke(Method.java:597)
	at org.codehaus.plexus.classworlds.launcher.Launcher.launchEnhanced(Launcher.java:290)
	at org.codehaus.plexus.classworlds.launcher.Launcher.launch(Launcher.java:230)
	at org.codehaus.plexus.classworlds.launcher.Launcher.mainWithExitCode(Launcher.java:409)
	at org.codehaus.plexus.classworlds.launcher.Launcher.main(Launcher.java:352)
Caused by: org.apache.maven.plugin.MojoExecutionException: Some Enforcer rules have failed.
Look above for specific messages explaining why the rule failed.
	at org.apache.maven.plugins.enforcer.EnforceMojo.execute(EnforceMojo.java:209)
	at org.apache.maven.plugin.DefaultBuildPluginManager.executeMojo(DefaultBuildPluginManager.java:101)
	at org.apache.maven.lifecycle.internal.MojoExecutor.execute(MojoExecutor.java:209)
	... 19 more
[ERROR] 
[ERROR] Re-run Maven using the -X switch to enable full debug logging.
[ERROR] 
[ERROR] For more information about the errors and possible solutions, please read the following
articles:
[ERROR] [Help 1] http://cwiki.apache.org/confluence/display/MAVEN/MojoExecutionException
Build step 'Invoke top-level Maven targets' marked build as failure

Mime
View raw message