aries-dev mailing list archives

Site index · List index
Message view « Date » · « Thread »
Top « Date » · « Thread »
From Apache Jenkins Server <jenk...@builds.apache.org>
Subject Build failed in Jenkins: Aries #1938
Date Fri, 30 May 2014 16:53:06 GMT
See <https://builds.apache.org/job/Aries/1938/changes>

Changes:

[jbonofre] [ARIES-1006] Upgrade to the "new" parent pom and OSGi 4.3.1

[jbonofre] [ARIES-1006] Upgrade to the "new" parent pom and OSGi 4.3.1

------------------------------------------
[...truncated 6289 lines...]
AU        blueprint/blueprint-testbundleb/pom.xml
A         blueprint/blueprint-testbundleb/NOTICE
A         blueprint/blueprint-testbundleb/LICENSE
A         blueprint/blueprint-itests
A         blueprint/blueprint-itests/src
A         blueprint/blueprint-itests/src/test
A         blueprint/blueprint-itests/src/test/java
A         blueprint/blueprint-itests/src/test/java/org
A         blueprint/blueprint-itests/src/test/java/org/apache
A         blueprint/blueprint-itests/src/test/java/org/apache/aries
A         blueprint/blueprint-itests/src/test/java/org/apache/aries/blueprint
A         blueprint/blueprint-itests/src/test/java/org/apache/aries/blueprint/itests
AU        blueprint/blueprint-itests/src/test/java/org/apache/aries/blueprint/itests/MemoryLeakTest.java
AU        blueprint/blueprint-itests/src/test/java/org/apache/aries/blueprint/itests/DeadLockTest.java
AU        blueprint/blueprint-itests/src/test/java/org/apache/aries/blueprint/itests/FragmentTestBundleBlueprintAttribute.java
AU        blueprint/blueprint-itests/src/test/java/org/apache/aries/blueprint/itests/BlueprintContainerTest.java
A         blueprint/blueprint-itests/src/test/java/org/apache/aries/blueprint/itests/BaseBlueprintContainerBTCustomizerTest.java
AU        blueprint/blueprint-itests/src/test/java/org/apache/aries/blueprint/itests/TestConfigAdmin.java
A         blueprint/blueprint-itests/src/test/java/org/apache/aries/blueprint/itests/comp
A         blueprint/blueprint-itests/src/test/java/org/apache/aries/blueprint/itests/comp/ListFactory.java
A         blueprint/blueprint-itests/src/test/java/org/apache/aries/blueprint/itests/comp/Listener.java
A         blueprint/blueprint-itests/src/test/java/org/apache/aries/blueprint/itests/Helper.java
AU        blueprint/blueprint-itests/src/test/java/org/apache/aries/blueprint/itests/TestRegistrationListener.java
AU        blueprint/blueprint-itests/src/test/java/org/apache/aries/blueprint/itests/TestReferences.java
AU        blueprint/blueprint-itests/src/test/java/org/apache/aries/blueprint/itests/BlueprintContainerBTCustomizerTest.java
A         blueprint/blueprint-itests/src/test/java/org/apache/aries/blueprint/itests/QuiesceBlueprintTest.java
A         blueprint/blueprint-itests/src/test/java/org/apache/aries/blueprint/itests/ASMMultiBundleTest.java
AU        blueprint/blueprint-itests/src/test/java/org/apache/aries/blueprint/itests/BlueprintContainer2Test.java
AU        blueprint/blueprint-itests/src/test/java/org/apache/aries/blueprint/itests/AbstractBlueprintIntegrationTest.java
AU        blueprint/blueprint-itests/src/test/java/org/apache/aries/blueprint/itests/MultiInterfacesTest.java
AU        blueprint/blueprint-itests/src/test/java/org/apache/aries/blueprint/itests/BlueprintAnnotationTest.java
AU        blueprint/blueprint-itests/src/test/java/org/apache/aries/blueprint/itests/FragmentTest.java
AU        blueprint/blueprint-itests/src/test/java/org/apache/aries/blueprint/itests/BlueprintContainer2BTCustomizerTest.java
A         blueprint/blueprint-itests/src/test/resources
A         blueprint/blueprint-itests/src/test/resources/log4j.properties
AU        blueprint/blueprint-itests/src/test/resources/bp.xml
AU        blueprint/blueprint-itests/src/test/resources/logback.xml
AU        blueprint/blueprint-itests/src/test/resources/bp2.xml
AU        blueprint/blueprint-itests/pom.xml
A         blueprint/blueprint-itests/NOTICE
A         blueprint/blueprint-itests/LICENSE
A         blueprint/blueprint-web-osgi
AU        blueprint/blueprint-web-osgi/NOTICE
AU        blueprint/blueprint-web-osgi/LICENSE
A         blueprint/blueprint-web-osgi/src
A         blueprint/blueprint-web-osgi/src/main
A         blueprint/blueprint-web-osgi/src/main/java
A         blueprint/blueprint-web-osgi/src/main/java/org
A         blueprint/blueprint-web-osgi/src/main/java/org/apache
A         blueprint/blueprint-web-osgi/src/main/java/org/apache/aries
A         blueprint/blueprint-web-osgi/src/main/java/org/apache/aries/blueprint
A         blueprint/blueprint-web-osgi/src/main/java/org/apache/aries/blueprint/web
AU        blueprint/blueprint-web-osgi/src/main/java/org/apache/aries/blueprint/web/BlueprintContextListener.java
A         blueprint/blueprint-web-osgi/src/main/appended-resources
A         blueprint/blueprint-web-osgi/src/main/appended-resources/META-INF
AU        blueprint/blueprint-web-osgi/src/main/appended-resources/META-INF/NOTICE.vm
A         blueprint/blueprint-web-osgi/src/main/resources
A         blueprint/blueprint-web-osgi/src/test
AU        blueprint/blueprint-web-osgi/pom.xml
A         blueprint/blueprint-web
A         blueprint/blueprint-web/src
A         blueprint/blueprint-web/src/main
A         blueprint/blueprint-web/src/main/java
A         blueprint/blueprint-web/src/main/java/org
A         blueprint/blueprint-web/src/main/java/org/apache
A         blueprint/blueprint-web/src/main/java/org/apache/aries
A         blueprint/blueprint-web/src/main/java/org/apache/aries/blueprint
A         blueprint/blueprint-web/src/main/java/org/apache/aries/blueprint/web
A         blueprint/blueprint-web/src/main/java/org/apache/aries/blueprint/web/BlueprintContextListener.java
A         blueprint/blueprint-web/src/main/java/org/apache/aries/blueprint/web/packageinfo
A         blueprint/blueprint-web/pom.xml
A         blueprint/blueprint-web/NOTICE
A         blueprint/blueprint-web/LICENSE
A         blueprint/NOTICE
A         blueprint/LICENSE
A         blueprint/blueprint-sample
AU        blueprint/blueprint-sample/pom.xml
A         blueprint/blueprint-sample/NOTICE
A         blueprint/blueprint-sample/LICENSE
A         blueprint/blueprint-sample/src
A         blueprint/blueprint-sample/src/main
A         blueprint/blueprint-sample/src/main/resources
A         blueprint/blueprint-sample/src/main/resources/OSGI-INF
A         blueprint/blueprint-sample/src/main/resources/OSGI-INF/blueprint
AU        blueprint/blueprint-sample/src/main/resources/OSGI-INF/blueprint/config.xml
A         blueprint/blueprint-sample/src/main/java
A         blueprint/blueprint-sample/src/main/java/org
A         blueprint/blueprint-sample/src/main/java/org/apache
A         blueprint/blueprint-sample/src/main/java/org/apache/aries
A         blueprint/blueprint-sample/src/main/java/org/apache/aries/blueprint
A         blueprint/blueprint-sample/src/main/java/org/apache/aries/blueprint/sample
AU        blueprint/blueprint-sample/src/main/java/org/apache/aries/blueprint/sample/AccountFactory.java
AU        blueprint/blueprint-sample/src/main/java/org/apache/aries/blueprint/sample/Bar.java
AU        blueprint/blueprint-sample/src/main/java/org/apache/aries/blueprint/sample/CurrencyTypeConverter.java
AU        blueprint/blueprint-sample/src/main/java/org/apache/aries/blueprint/sample/FooRegistrationListener.java
AU        blueprint/blueprint-sample/src/main/java/org/apache/aries/blueprint/sample/DateTypeConverter.java
AU        blueprint/blueprint-sample/src/main/java/org/apache/aries/blueprint/sample/DestroyTest.java
AU        blueprint/blueprint-sample/src/main/java/org/apache/aries/blueprint/sample/DefaultRunnable.java
AU        blueprint/blueprint-sample/src/main/java/org/apache/aries/blueprint/sample/Account.java
AU        blueprint/blueprint-sample/src/main/java/org/apache/aries/blueprint/sample/Activator.java
A         blueprint/blueprint-sample/src/main/java/org/apache/aries/blueprint/sample/DodgyListener.java
AU        blueprint/blueprint-sample/src/main/java/org/apache/aries/blueprint/sample/StaticAccountFactory.java
AU        blueprint/blueprint-sample/src/main/java/org/apache/aries/blueprint/sample/BindingListener.java
AU        blueprint/blueprint-sample/src/main/java/org/apache/aries/blueprint/sample/InterfaceA.java
AU        blueprint/blueprint-sample/src/main/java/org/apache/aries/blueprint/sample/Foo.java
A         blueprint/blueprint-annotation-api
A         blueprint/blueprint-annotation-api/NOTICE
A         blueprint/blueprint-annotation-api/LICENSE
A         blueprint/blueprint-annotation-api/src
A         blueprint/blueprint-annotation-api/src/main
A         blueprint/blueprint-annotation-api/src/main/java
A         blueprint/blueprint-annotation-api/src/main/java/org
A         blueprint/blueprint-annotation-api/src/main/java/org/apache
A         blueprint/blueprint-annotation-api/src/main/java/org/apache/aries
A         blueprint/blueprint-annotation-api/src/main/java/org/apache/aries/blueprint
A         blueprint/blueprint-annotation-api/src/main/java/org/apache/aries/blueprint/annotation
AU        blueprint/blueprint-annotation-api/src/main/java/org/apache/aries/blueprint/annotation/Arg.java
AU        blueprint/blueprint-annotation-api/src/main/java/org/apache/aries/blueprint/annotation/List.java
AU        blueprint/blueprint-annotation-api/src/main/java/org/apache/aries/blueprint/annotation/Inject.java
AU        blueprint/blueprint-annotation-api/src/main/java/org/apache/aries/blueprint/annotation/Bind.java
AU        blueprint/blueprint-annotation-api/src/main/java/org/apache/aries/blueprint/annotation/Unbind.java
A         blueprint/blueprint-annotation-api/src/main/java/org/apache/aries/blueprint/annotation/service
A         blueprint/blueprint-annotation-api/src/main/java/org/apache/aries/blueprint/annotation/service/packageinfo
AU        blueprint/blueprint-annotation-api/src/main/java/org/apache/aries/blueprint/annotation/service/BlueprintAnnotationScanner.java
AU        blueprint/blueprint-annotation-api/src/main/java/org/apache/aries/blueprint/annotation/RegistrationListener.java
AU        blueprint/blueprint-annotation-api/src/main/java/org/apache/aries/blueprint/annotation/Register.java
A         blueprint/blueprint-annotation-api/src/main/java/org/apache/aries/blueprint/annotation/packageinfo
AU        blueprint/blueprint-annotation-api/src/main/java/org/apache/aries/blueprint/annotation/Unregister.java
AU        blueprint/blueprint-annotation-api/src/main/java/org/apache/aries/blueprint/annotation/Destroy.java
AU        blueprint/blueprint-annotation-api/src/main/java/org/apache/aries/blueprint/annotation/Element.java
AU        blueprint/blueprint-annotation-api/src/main/java/org/apache/aries/blueprint/annotation/ReferenceList.java
AU        blueprint/blueprint-annotation-api/src/main/java/org/apache/aries/blueprint/annotation/Reference.java
AU        blueprint/blueprint-annotation-api/src/main/java/org/apache/aries/blueprint/annotation/Service.java
AU        blueprint/blueprint-annotation-api/src/main/java/org/apache/aries/blueprint/annotation/Init.java
AU        blueprint/blueprint-annotation-api/src/main/java/org/apache/aries/blueprint/annotation/Blueprint.java
AU        blueprint/blueprint-annotation-api/src/main/java/org/apache/aries/blueprint/annotation/ReferenceListener.java
AU        blueprint/blueprint-annotation-api/src/main/java/org/apache/aries/blueprint/annotation/Bean.java
AU        blueprint/blueprint-annotation-api/src/main/java/org/apache/aries/blueprint/annotation/ServiceProperty.java
AU        blueprint/blueprint-annotation-api/pom.xml
A         blueprint/blueprint-sample-fragment
A         blueprint/blueprint-sample-fragment/src
A         blueprint/blueprint-sample-fragment/src/main
A         blueprint/blueprint-sample-fragment/src/main/java
A         blueprint/blueprint-sample-fragment/src/main/java/org
A         blueprint/blueprint-sample-fragment/src/main/java/org/apache
A         blueprint/blueprint-sample-fragment/src/main/java/org/apache/aries
A         blueprint/blueprint-sample-fragment/src/main/java/org/apache/aries/blueprint
A         blueprint/blueprint-sample-fragment/src/main/java/org/apache/aries/blueprint/fragment
A         blueprint/blueprint-sample-fragment/src/main/java/org/apache/aries/blueprint/fragment/FragmentBean.java
A         blueprint/blueprint-sample-fragment/pom.xml
A         .gitignore
 U        .
At revision 1598669
Parsing POMs
ERROR: Failed to parse POMs
java.io.IOException: remote file operation failed: <https://builds.apache.org/job/Aries/ws/aries>
at hudson.remoting.Channel@307ef3d2:ubuntu1
	at hudson.FilePath.act(FilePath.java:910)
	at hudson.FilePath.act(FilePath.java:887)
	at hudson.maven.MavenModuleSetBuild$MavenModuleSetBuildExecution.parsePoms(MavenModuleSetBuild.java:943)
	at hudson.maven.MavenModuleSetBuild$MavenModuleSetBuildExecution.doRun(MavenModuleSetBuild.java:671)
	at hudson.model.AbstractBuild$AbstractBuildExecution.run(AbstractBuild.java:585)
	at hudson.model.Run.execute(Run.java:1676)
	at hudson.maven.MavenModuleSetBuild.run(MavenModuleSetBuild.java:519)
	at hudson.model.ResourceController.execute(ResourceController.java:88)
	at hudson.model.Executor.run(Executor.java:231)
Caused by: hudson.remoting.ProxyException: hudson.maven.MavenModuleSetBuild$MavenExecutionException:
org.apache.maven.project.ProjectBuildingException: Some problems were encountered while processing
the POMs:
[ERROR] 'dependencies.dependency.version' for org.eclipse.equinox:cm:jar is missing. @ line
39, column 15
[ERROR] 'dependencies.dependency.version' for org.eclipse.osgi:services:jar is missing. @
line 44, column 15
[ERROR] 'dependencies.dependency.version' for org.eclipse:osgi:jar is missing. @ line 46,
column 21
[ERROR] 'dependencies.dependency.version' for org.ops4j.pax.exam:pax-exam:jar is missing.
@ line 126, column 21
[ERROR] 'dependencies.dependency.version' for org.ops4j.pax.exam:pax-exam-junit:jar is missing.
@ line 132, column 21
[ERROR] 'dependencies.dependency.version' for org.ops4j.pax.exam:pax-exam-container-default:jar
is missing. @ line 138, column 21
[ERROR] 'dependencies.dependency.version' for org.ops4j.pax.exam:pax-exam-junit-extender-impl:jar
is missing. @ line 144, column 21
[ERROR] 'dependencies.dependency.version' for org.ops4j.pax.runner:pax-runner-no-jcl:jar is
missing. @ line 150, column 21
[ERROR] 'dependencies.dependency.version' for org.ops4j.pax.swissbox:pax-swissbox-tinybundles:jar
is missing. @ line 155, column 21
[ERROR] 'dependencies.dependency.version' for org.eclipse.equinox:cm:jar is missing. @ line
203, column 15
[ERROR] 'dependencies.dependency.version' for org.eclipse.osgi:services:jar is missing. @
line 209, column 15
[ERROR] 'dependencies.dependency.version' for org.eclipse:osgi:jar is missing. @ line 38,
column 21
[ERROR] 'dependencies.dependency.version' for org.eclipse.equinox:cm:jar is missing. @ line
42, column 21
[ERROR] 'dependencies.dependency.version' for org.eclipse.osgi:services:jar is missing. @
line 46, column 21
[ERROR] 'dependencies.dependency.version' for org.eclipse:osgi:jar is missing. @ line 33,
column 21
[ERROR] 'dependencies.dependency.version' for org.eclipse.equinox:cm:jar is missing. @ line
38, column 21
[ERROR] 'dependencies.dependency.version' for org.eclipse.osgi:services:jar is missing. @
line 43, column 21
[ERROR] 'dependencies.dependency.version' for org.eclipse:osgi:jar is missing. @ line 47,
column 21
[ERROR] 'dependencies.dependency.version' for org.ops4j.pax.exam:pax-exam:jar is missing.
@ line 90, column 21
[ERROR] 'dependencies.dependency.version' for org.ops4j.pax.exam:pax-exam-junit:jar is missing.
@ line 96, column 21
[ERROR] 'dependencies.dependency.version' for org.ops4j.pax.exam:pax-exam-container-default:jar
is missing. @ line 102, column 21
[ERROR] 'dependencies.dependency.version' for org.ops4j.pax.exam:pax-exam-junit-extender-impl:jar
is missing. @ line 108, column 21
[ERROR] 'dependencies.dependency.version' for org.ops4j.pax.runner:pax-runner-no-jcl:jar is
missing. @ line 114, column 21
[ERROR] 'dependencies.dependency.version' for org.ops4j.pax.swissbox:pax-swissbox-tinybundles:jar
is missing. @ line 119, column 21
[ERROR] 'dependencies.dependency.version' for org.eclipse.equinox:cm:jar is missing. @ line
167, column 15
[ERROR] 'dependencies.dependency.version' for org.eclipse.osgi:services:jar is missing. @
line 173, column 15
[ERROR] 'dependencies.dependency.version' for org.eclipse:osgi:jar is missing. @ line 51,
column 21
[ERROR] 'dependencies.dependency.version' for org.eclipse:osgi:jar is missing. @ line 33,
column 21
[ERROR] 'dependencies.dependency.version' for org.ops4j.pax.exam:pax-exam:jar is missing.
@ line 79, column 15
[ERROR] 'dependencies.dependency.version' for org.ops4j.pax.exam:pax-exam-junit:jar is missing.
@ line 84, column 15
[ERROR] 'dependencies.dependency.version' for org.ops4j.pax.exam:pax-exam-container-default:jar
is missing. @ line 89, column 15
[ERROR] 'dependencies.dependency.version' for org.eclipse:osgi:jar is missing. @ line 189,
column 21

	at hudson.maven.MavenModuleSetBuild$PomParser.invoke(MavenModuleSetBuild.java:1347)
	at hudson.maven.MavenModuleSetBuild$PomParser.invoke(MavenModuleSetBuild.java:1081)
	at hudson.FilePath$FileCallableWrapper.call(FilePath.java:2462)
	at hudson.remoting.UserRequest.perform(UserRequest.java:118)
	at hudson.remoting.UserRequest.perform(UserRequest.java:48)
	at hudson.remoting.Request$2.run(Request.java:328)
	at hudson.remoting.InterceptingExecutorService$1.call(InterceptingExecutorService.java:72)
	at java.util.concurrent.FutureTask.run(FutureTask.java:262)
	at java.util.concurrent.ThreadPoolExecutor.runWorker(ThreadPoolExecutor.java:1145)
	at java.util.concurrent.ThreadPoolExecutor$Worker.run(ThreadPoolExecutor.java:615)
	at java.lang.Thread.run(Thread.java:745)
Caused by: hudson.remoting.ProxyException: org.apache.maven.project.ProjectBuildingException:
Some problems were encountered while processing the POMs:
[ERROR] 'dependencies.dependency.version' for org.eclipse.equinox:cm:jar is missing. @ line
39, column 15
[ERROR] 'dependencies.dependency.version' for org.eclipse.osgi:services:jar is missing. @
line 44, column 15
[ERROR] 'dependencies.dependency.version' for org.eclipse:osgi:jar is missing. @ line 46,
column 21
[ERROR] 'dependencies.dependency.version' for org.ops4j.pax.exam:pax-exam:jar is missing.
@ line 126, column 21
[ERROR] 'dependencies.dependency.version' for org.ops4j.pax.exam:pax-exam-junit:jar is missing.
@ line 132, column 21
[ERROR] 'dependencies.dependency.version' for org.ops4j.pax.exam:pax-exam-container-default:jar
is missing. @ line 138, column 21
[ERROR] 'dependencies.dependency.version' for org.ops4j.pax.exam:pax-exam-junit-extender-impl:jar
is missing. @ line 144, column 21
[ERROR] 'dependencies.dependency.version' for org.ops4j.pax.runner:pax-runner-no-jcl:jar is
missing. @ line 150, column 21
[ERROR] 'dependencies.dependency.version' for org.ops4j.pax.swissbox:pax-swissbox-tinybundles:jar
is missing. @ line 155, column 21
[ERROR] 'dependencies.dependency.version' for org.eclipse.equinox:cm:jar is missing. @ line
203, column 15
[ERROR] 'dependencies.dependency.version' for org.eclipse.osgi:services:jar is missing. @
line 209, column 15
[ERROR] 'dependencies.dependency.version' for org.eclipse:osgi:jar is missing. @ line 38,
column 21
[ERROR] 'dependencies.dependency.version' for org.eclipse.equinox:cm:jar is missing. @ line
42, column 21
[ERROR] 'dependencies.dependency.version' for org.eclipse.osgi:services:jar is missing. @
line 46, column 21
[ERROR] 'dependencies.dependency.version' for org.eclipse:osgi:jar is missing. @ line 33,
column 21
[ERROR] 'dependencies.dependency.version' for org.eclipse.equinox:cm:jar is missing. @ line
38, column 21
[ERROR] 'dependencies.dependency.version' for org.eclipse.osgi:services:jar is missing. @
line 43, column 21
[ERROR] 'dependencies.dependency.version' for org.eclipse:osgi:jar is missing. @ line 47,
column 21
[ERROR] 'dependencies.dependency.version' for org.ops4j.pax.exam:pax-exam:jar is missing.
@ line 90, column 21
[ERROR] 'dependencies.dependency.version' for org.ops4j.pax.exam:pax-exam-junit:jar is missing.
@ line 96, column 21
[ERROR] 'dependencies.dependency.version' for org.ops4j.pax.exam:pax-exam-container-default:jar
is missing. @ line 102, column 21
[ERROR] 'dependencies.dependency.version' for org.ops4j.pax.exam:pax-exam-junit-extender-impl:jar
is missing. @ line 108, column 21
[ERROR] 'dependencies.dependency.version' for org.ops4j.pax.runner:pax-runner-no-jcl:jar is
missing. @ line 114, column 21
[ERROR] 'dependencies.dependency.version' for org.ops4j.pax.swissbox:pax-swissbox-tinybundles:jar
is missing. @ line 119, column 21
[ERROR] 'dependencies.dependency.version' for org.eclipse.equinox:cm:jar is missing. @ line
167, column 15
[ERROR] 'dependencies.dependency.version' for org.eclipse.osgi:services:jar is missing. @
line 173, column 15
[ERROR] 'dependencies.dependency.version' for org.eclipse:osgi:jar is missing. @ line 51,
column 21
[ERROR] 'dependencies.dependency.version' for org.eclipse:osgi:jar is missing. @ line 33,
column 21
[ERROR] 'dependencies.dependency.version' for org.ops4j.pax.exam:pax-exam:jar is missing.
@ line 79, column 15
[ERROR] 'dependencies.dependency.version' for org.ops4j.pax.exam:pax-exam-junit:jar is missing.
@ line 84, column 15
[ERROR] 'dependencies.dependency.version' for org.ops4j.pax.exam:pax-exam-container-default:jar
is missing. @ line 89, column 15
[ERROR] 'dependencies.dependency.version' for org.eclipse:osgi:jar is missing. @ line 189,
column 21

	at org.apache.maven.project.DefaultProjectBuilder.build(DefaultProjectBuilder.java:364)
	at hudson.maven.MavenEmbedder.buildProjects(MavenEmbedder.java:361)
	at hudson.maven.MavenEmbedder.readProjects(MavenEmbedder.java:331)
	at hudson.maven.MavenModuleSetBuild$PomParser.invoke(MavenModuleSetBuild.java:1284)
	... 10 more

Mime
View raw message