aries-dev mailing list archives

Site index · List index
Message view « Date » · « Thread »
Top « Date » · « Thread »
From Apache Jenkins Server <jenk...@builds.apache.org>
Subject Build failed in Jenkins: Aries #1940
Date Sat, 31 May 2014 04:57:22 GMT
See <https://builds.apache.org/job/Aries/1940/changes>

Changes:

[jbonofre] Merge branch 'ARIES-1006' into trunk

------------------------------------------
[...truncated 6289 lines...]
A         transaction/transaction-jms/src/main/java/org/apache/aries/transaction/jms/internal/PooledSession.java
A         transaction/transaction-jms/src/main/java/org/apache/aries/transaction/jms/internal/PooledQueueSender.java
A         transaction/transaction-jms/src/main/java/org/apache/aries/transaction/jms/internal/ConnectionPool.java
A         transaction/transaction-jms/src/main/java/org/apache/aries/transaction/jms/internal/SessionKey.java
A         transaction/transaction-jms/src/main/java/org/apache/aries/transaction/jms/internal/PooledSessionEventListener.java
A         transaction/transaction-jms/src/main/java/org/apache/aries/transaction/jms/internal/PooledTopicPublisher.java
AU        transaction/transaction-jms/src/main/java/org/apache/aries/transaction/jms/internal/PooledConnection.java
AU        transaction/transaction-jms/src/main/java/org/apache/aries/transaction/jms/package.html
A         transaction/transaction-jms/pom.xml
A         transaction/transaction-testbundle
A         transaction/transaction-testbundle/NOTICE
A         transaction/transaction-testbundle/LICENSE
A         transaction/transaction-testbundle/src
A         transaction/transaction-testbundle/src/main
A         transaction/transaction-testbundle/src/main/resources
A         transaction/transaction-testbundle/src/main/resources/OSGI-INF
A         transaction/transaction-testbundle/src/main/resources/OSGI-INF/blueprint
AU        transaction/transaction-testbundle/src/main/resources/OSGI-INF/blueprint/config.xml
A         transaction/transaction-testbundle/src/main/java
A         transaction/transaction-testbundle/src/main/java/org
A         transaction/transaction-testbundle/src/main/java/org/apache
A         transaction/transaction-testbundle/src/main/java/org/apache/aries
A         transaction/transaction-testbundle/src/main/java/org/apache/aries/transaction
A         transaction/transaction-testbundle/src/main/java/org/apache/aries/transaction/test
A         transaction/transaction-testbundle/src/main/java/org/apache/aries/transaction/test/packageinfo
A         transaction/transaction-testbundle/src/main/java/org/apache/aries/transaction/test/impl
AU        transaction/transaction-testbundle/src/main/java/org/apache/aries/transaction/test/impl/TestBeanImpl.java
AU        transaction/transaction-testbundle/src/main/java/org/apache/aries/transaction/test/TestBean.java
AU        transaction/transaction-testbundle/pom.xml
A         transaction/transaction-manager
AU        transaction/transaction-manager/pom.xml
A         transaction/transaction-manager/NOTICE
A         transaction/transaction-manager/LICENSE
A         transaction/transaction-manager/src
A         transaction/transaction-manager/src/test
A         transaction/transaction-manager/src/test/java
A         transaction/transaction-manager/src/test/java/org
A         transaction/transaction-manager/src/test/java/org/apache
A         transaction/transaction-manager/src/test/java/org/apache/aries
A         transaction/transaction-manager/src/test/java/org/apache/aries/transaction
A         transaction/transaction-manager/src/test/java/org/apache/aries/transaction/internal
A         transaction/transaction-manager/src/test/java/org/apache/aries/transaction/internal/XidFactoryImplTest.java
A         transaction/transaction-manager/src/test/java/org/apache/aries/transaction/internal/LogTest.java
A         transaction/transaction-manager/src/main
A         transaction/transaction-manager/src/main/java
A         transaction/transaction-manager/src/main/java/org
A         transaction/transaction-manager/src/main/java/org/apache
A         transaction/transaction-manager/src/main/java/org/apache/aries
A         transaction/transaction-manager/src/main/java/org/apache/aries/transaction
A         transaction/transaction-manager/src/main/java/org/apache/aries/transaction/internal
A         transaction/transaction-manager/src/main/java/org/apache/aries/transaction/internal/AriesTransactionManagerImpl.java
AU        transaction/transaction-manager/src/main/java/org/apache/aries/transaction/internal/AriesPlatformTransactionManager.java
A         transaction/transaction-manager/src/main/java/org/apache/aries/transaction/internal/HOWLLog.java
AU        transaction/transaction-manager/src/main/java/org/apache/aries/transaction/internal/Activator.java
AU        transaction/transaction-manager/src/main/java/org/apache/aries/transaction/internal/NLS.java
A         transaction/transaction-manager/src/main/java/org/apache/aries/transaction/internal/XidFactoryImpl.java
AU        transaction/transaction-manager/src/main/java/org/apache/aries/transaction/internal/TransactionManagerService.java
A         transaction/transaction-manager/src/main/java/org/apache/aries/transaction/exception
A         transaction/transaction-manager/src/main/java/org/apache/aries/transaction/parsing
A         transaction/transaction-manager/src/main/java/org/apache/aries/transaction/AriesTransactionManager.java
A         transaction/transaction-manager/src/main/java/org/objectweb
A         transaction/transaction-manager/src/main/java/org/objectweb/howl
A         transaction/transaction-manager/src/main/java/org/objectweb/howl/log
A         transaction/transaction-manager/src/main/java/org/objectweb/howl/log/Logger.java
A         transaction/transaction-manager/src/main/java/javax
A         transaction/transaction-manager/src/main/java/javax/resource
A         transaction/transaction-manager/src/main/java/javax/resource/spi
AU        transaction/transaction-manager/src/main/java/javax/resource/spi/XATerminator.java
A         transaction/transaction-manager/src/main/resources
A         transaction/transaction-manager/src/main/resources/org
A         transaction/transaction-manager/src/main/resources/org/apache
A         transaction/transaction-manager/src/main/resources/org/apache/aries
A         transaction/transaction-manager/src/main/resources/org/apache/aries/transaction
A         transaction/transaction-manager/src/main/resources/org/apache/aries/transaction/internal
AU        transaction/transaction-manager/src/main/resources/org/apache/aries/transaction/internal/txManager.properties
A         transaction/transaction-itests
A         transaction/transaction-itests/src
A         transaction/transaction-itests/src/test
A         transaction/transaction-itests/src/test/java
A         transaction/transaction-itests/src/test/java/org
A         transaction/transaction-itests/src/test/java/org/ops4j
A         transaction/transaction-itests/src/test/java/org/ops4j/pax
A         transaction/transaction-itests/src/test/java/org/ops4j/pax/runner
A         transaction/transaction-itests/src/test/java/org/ops4j/pax/runner/platform
A         transaction/transaction-itests/src/test/java/org/ops4j/pax/runner/platform/equinox
A         transaction/transaction-itests/src/test/java/org/ops4j/pax/runner/platform/equinox/internal
A         transaction/transaction-itests/src/test/java/org/apache
A         transaction/transaction-itests/src/test/java/org/apache/aries
A         transaction/transaction-itests/src/test/java/org/apache/aries/transaction
A         transaction/transaction-itests/src/test/java/org/apache/aries/transaction/itests
AU        transaction/transaction-itests/src/test/java/org/apache/aries/transaction/itests/InvalidTranAttributeTest.java
AU        transaction/transaction-itests/src/test/java/org/apache/aries/transaction/itests/NotSupportedTranAttributeTest.java
AU        transaction/transaction-itests/src/test/java/org/apache/aries/transaction/itests/RequiresNewTranAttributeTest.java
AU        transaction/transaction-itests/src/test/java/org/apache/aries/transaction/itests/AbstractIntegrationTest.java
AU        transaction/transaction-itests/src/test/java/org/apache/aries/transaction/itests/MandatoryTranAttributeTest.java
AU        transaction/transaction-itests/src/test/java/org/apache/aries/transaction/itests/NeverTranAttributeTest.java
AU        transaction/transaction-itests/src/test/java/org/apache/aries/transaction/itests/SupportsTranAttributeTest.java
AU        transaction/transaction-itests/src/test/java/org/apache/aries/transaction/itests/RequiredTranAttributeTest.java
A         transaction/transaction-itests/src/test/resources
A         transaction/transaction-itests/src/test/resources/META-INF
A         transaction/transaction-itests/src/test/resources/META-INF/platform-equinox
AU        transaction/transaction-itests/pom.xml
A         transaction/transaction-itests/NOTICE
A         transaction/transaction-itests/LICENSE
A         transaction/transaction-itests/derby.log
A         transaction/NOTICE
AU        transaction/LICENSE
A         transaction/transaction-jdbc
A         transaction/transaction-jdbc/src
A         transaction/transaction-jdbc/src/main
A         transaction/transaction-jdbc/src/main/java
A         transaction/transaction-jdbc/src/main/java/org
A         transaction/transaction-jdbc/src/main/java/org/apache
A         transaction/transaction-jdbc/src/main/java/org/apache/aries
A         transaction/transaction-jdbc/src/main/java/org/apache/aries/transaction
A         transaction/transaction-jdbc/src/main/java/org/apache/aries/transaction/jdbc
A         transaction/transaction-jdbc/src/main/java/org/apache/aries/transaction/jdbc/internal
A         transaction/transaction-jdbc/src/main/java/org/apache/aries/transaction/jdbc/internal/ConnectionManagerFactory.java
AU        transaction/transaction-jdbc/src/main/java/org/apache/aries/transaction/jdbc/internal/Activator.java
A         transaction/transaction-jdbc/src/main/java/org/apache/aries/transaction/jdbc/internal/Recovery.java
A         transaction/transaction-jdbc/src/main/java/org/apache/aries/transaction/jdbc/internal/ManagedDataSourceFactory.java
A         transaction/transaction-jdbc/src/main/java/org/apache/aries/transaction/jdbc/internal/XADataSourceMCFFactory.java
A         transaction/transaction-jdbc/src/main/java/org/apache/aries/transaction/jdbc/RecoverableDataSource.java
A         transaction/transaction-jdbc/src/main/resources
A         transaction/transaction-jdbc/src/main/resources/org
A         transaction/transaction-jdbc/src/main/resources/org/apache
A         transaction/transaction-jdbc/src/main/resources/org/apache/aries
A         transaction/transaction-jdbc/src/main/resources/org/apache/aries/transaction
A         transaction/transaction-jdbc/src/main/resources/org/apache/aries/transaction/jdbc
A         transaction/transaction-jdbc/src/main/resources/org/apache/aries/transaction/jdbc/internal
AU        transaction/transaction-jdbc/src/main/resources/org/apache/aries/transaction/jdbc/internal/jdbcWrappers.properties
A         transaction/transaction-jdbc/src/main/resources/OSGI-INF
A         transaction/transaction-jdbc/src/main/resources/OSGI-INF/blueprint
AU        transaction/transaction-jdbc/pom.xml
A         transaction/transaction-jdbc/NOTICE
A         transaction/transaction-jdbc/LICENSE
A         transaction/transaction-wrappers
A         transaction/transaction-wrappers/src
A         transaction/transaction-wrappers/src/main
A         transaction/transaction-wrappers/src/main/resources
A         transaction/transaction-wrappers/src/main/resources/org
A         transaction/transaction-wrappers/src/main/resources/org/apache
A         transaction/transaction-wrappers/src/main/resources/org/apache/aries
A         transaction/transaction-wrappers/src/main/resources/org/apache/aries/transaction
A         transaction/transaction-wrappers/src/main/resources/org/apache/aries/transaction/jdbc
A         transaction/transaction-wrappers/src/main/java
A         transaction/transaction-wrappers/src/main/java/org
A         transaction/transaction-wrappers/src/main/java/org/apache
A         transaction/transaction-wrappers/src/main/java/org/apache/aries
A         transaction/transaction-wrappers/src/main/java/org/apache/aries/transaction
A         transaction/transaction-wrappers/src/main/java/org/apache/aries/transaction/jdbc
 U        .
At revision 1598809
Parsing POMs
ERROR: Failed to parse POMs
java.io.IOException: remote file operation failed: <https://builds.apache.org/job/Aries/ws/aries>
at hudson.remoting.Channel@6788be11:ubuntu1
	at hudson.FilePath.act(FilePath.java:910)
	at hudson.FilePath.act(FilePath.java:887)
	at hudson.maven.MavenModuleSetBuild$MavenModuleSetBuildExecution.parsePoms(MavenModuleSetBuild.java:943)
	at hudson.maven.MavenModuleSetBuild$MavenModuleSetBuildExecution.doRun(MavenModuleSetBuild.java:671)
	at hudson.model.AbstractBuild$AbstractBuildExecution.run(AbstractBuild.java:585)
	at hudson.model.Run.execute(Run.java:1676)
	at hudson.maven.MavenModuleSetBuild.run(MavenModuleSetBuild.java:519)
	at hudson.model.ResourceController.execute(ResourceController.java:88)
	at hudson.model.Executor.run(Executor.java:231)
Caused by: hudson.remoting.ProxyException: hudson.maven.MavenModuleSetBuild$MavenExecutionException:
org.apache.maven.project.ProjectBuildingException: Some problems were encountered while processing
the POMs:
[ERROR] 'dependencies.dependency.version' for org.eclipse.equinox:cm:jar is missing. @ line
39, column 15
[ERROR] 'dependencies.dependency.version' for org.eclipse.osgi:services:jar is missing. @
line 44, column 15
[ERROR] 'dependencies.dependency.version' for org.eclipse:osgi:jar is missing. @ line 46,
column 21
[ERROR] 'dependencies.dependency.version' for org.ops4j.pax.exam:pax-exam:jar is missing.
@ line 126, column 21
[ERROR] 'dependencies.dependency.version' for org.ops4j.pax.exam:pax-exam-junit:jar is missing.
@ line 132, column 21
[ERROR] 'dependencies.dependency.version' for org.ops4j.pax.exam:pax-exam-container-default:jar
is missing. @ line 138, column 21
[ERROR] 'dependencies.dependency.version' for org.ops4j.pax.exam:pax-exam-junit-extender-impl:jar
is missing. @ line 144, column 21
[ERROR] 'dependencies.dependency.version' for org.ops4j.pax.runner:pax-runner-no-jcl:jar is
missing. @ line 150, column 21
[ERROR] 'dependencies.dependency.version' for org.ops4j.pax.swissbox:pax-swissbox-tinybundles:jar
is missing. @ line 155, column 21
[ERROR] 'dependencies.dependency.version' for org.eclipse.equinox:cm:jar is missing. @ line
203, column 15
[ERROR] 'dependencies.dependency.version' for org.eclipse.osgi:services:jar is missing. @
line 209, column 15
[ERROR] 'dependencies.dependency.version' for org.eclipse:osgi:jar is missing. @ line 38,
column 21
[ERROR] 'dependencies.dependency.version' for org.eclipse.equinox:cm:jar is missing. @ line
42, column 21
[ERROR] 'dependencies.dependency.version' for org.eclipse.osgi:services:jar is missing. @
line 46, column 21
[ERROR] 'dependencies.dependency.version' for org.eclipse:osgi:jar is missing. @ line 33,
column 21
[ERROR] 'dependencies.dependency.version' for org.eclipse.equinox:cm:jar is missing. @ line
38, column 21
[ERROR] 'dependencies.dependency.version' for org.eclipse.osgi:services:jar is missing. @
line 43, column 21
[ERROR] 'dependencies.dependency.version' for org.eclipse:osgi:jar is missing. @ line 47,
column 21
[ERROR] 'dependencies.dependency.version' for org.ops4j.pax.exam:pax-exam:jar is missing.
@ line 90, column 21
[ERROR] 'dependencies.dependency.version' for org.ops4j.pax.exam:pax-exam-junit:jar is missing.
@ line 96, column 21
[ERROR] 'dependencies.dependency.version' for org.ops4j.pax.exam:pax-exam-container-default:jar
is missing. @ line 102, column 21
[ERROR] 'dependencies.dependency.version' for org.ops4j.pax.exam:pax-exam-junit-extender-impl:jar
is missing. @ line 108, column 21
[ERROR] 'dependencies.dependency.version' for org.ops4j.pax.runner:pax-runner-no-jcl:jar is
missing. @ line 114, column 21
[ERROR] 'dependencies.dependency.version' for org.ops4j.pax.swissbox:pax-swissbox-tinybundles:jar
is missing. @ line 119, column 21
[ERROR] 'dependencies.dependency.version' for org.eclipse.equinox:cm:jar is missing. @ line
167, column 15
[ERROR] 'dependencies.dependency.version' for org.eclipse.osgi:services:jar is missing. @
line 173, column 15
[ERROR] 'dependencies.dependency.version' for org.eclipse:osgi:jar is missing. @ line 51,
column 21
[ERROR] 'dependencies.dependency.version' for org.eclipse:osgi:jar is missing. @ line 33,
column 21
[ERROR] 'dependencies.dependency.version' for org.ops4j.pax.exam:pax-exam:jar is missing.
@ line 79, column 15
[ERROR] 'dependencies.dependency.version' for org.ops4j.pax.exam:pax-exam-junit:jar is missing.
@ line 84, column 15
[ERROR] 'dependencies.dependency.version' for org.ops4j.pax.exam:pax-exam-container-default:jar
is missing. @ line 89, column 15
[ERROR] 'dependencies.dependency.version' for org.eclipse:osgi:jar is missing. @ line 189,
column 21

	at hudson.maven.MavenModuleSetBuild$PomParser.invoke(MavenModuleSetBuild.java:1347)
	at hudson.maven.MavenModuleSetBuild$PomParser.invoke(MavenModuleSetBuild.java:1081)
	at hudson.FilePath$FileCallableWrapper.call(FilePath.java:2462)
	at hudson.remoting.UserRequest.perform(UserRequest.java:118)
	at hudson.remoting.UserRequest.perform(UserRequest.java:48)
	at hudson.remoting.Request$2.run(Request.java:328)
	at hudson.remoting.InterceptingExecutorService$1.call(InterceptingExecutorService.java:72)
	at java.util.concurrent.FutureTask.run(FutureTask.java:262)
	at java.util.concurrent.ThreadPoolExecutor.runWorker(ThreadPoolExecutor.java:1145)
	at java.util.concurrent.ThreadPoolExecutor$Worker.run(ThreadPoolExecutor.java:615)
	at java.lang.Thread.run(Thread.java:745)
Caused by: hudson.remoting.ProxyException: org.apache.maven.project.ProjectBuildingException:
Some problems were encountered while processing the POMs:
[ERROR] 'dependencies.dependency.version' for org.eclipse.equinox:cm:jar is missing. @ line
39, column 15
[ERROR] 'dependencies.dependency.version' for org.eclipse.osgi:services:jar is missing. @
line 44, column 15
[ERROR] 'dependencies.dependency.version' for org.eclipse:osgi:jar is missing. @ line 46,
column 21
[ERROR] 'dependencies.dependency.version' for org.ops4j.pax.exam:pax-exam:jar is missing.
@ line 126, column 21
[ERROR] 'dependencies.dependency.version' for org.ops4j.pax.exam:pax-exam-junit:jar is missing.
@ line 132, column 21
[ERROR] 'dependencies.dependency.version' for org.ops4j.pax.exam:pax-exam-container-default:jar
is missing. @ line 138, column 21
[ERROR] 'dependencies.dependency.version' for org.ops4j.pax.exam:pax-exam-junit-extender-impl:jar
is missing. @ line 144, column 21
[ERROR] 'dependencies.dependency.version' for org.ops4j.pax.runner:pax-runner-no-jcl:jar is
missing. @ line 150, column 21
[ERROR] 'dependencies.dependency.version' for org.ops4j.pax.swissbox:pax-swissbox-tinybundles:jar
is missing. @ line 155, column 21
[ERROR] 'dependencies.dependency.version' for org.eclipse.equinox:cm:jar is missing. @ line
203, column 15
[ERROR] 'dependencies.dependency.version' for org.eclipse.osgi:services:jar is missing. @
line 209, column 15
[ERROR] 'dependencies.dependency.version' for org.eclipse:osgi:jar is missing. @ line 38,
column 21
[ERROR] 'dependencies.dependency.version' for org.eclipse.equinox:cm:jar is missing. @ line
42, column 21
[ERROR] 'dependencies.dependency.version' for org.eclipse.osgi:services:jar is missing. @
line 46, column 21
[ERROR] 'dependencies.dependency.version' for org.eclipse:osgi:jar is missing. @ line 33,
column 21
[ERROR] 'dependencies.dependency.version' for org.eclipse.equinox:cm:jar is missing. @ line
38, column 21
[ERROR] 'dependencies.dependency.version' for org.eclipse.osgi:services:jar is missing. @
line 43, column 21
[ERROR] 'dependencies.dependency.version' for org.eclipse:osgi:jar is missing. @ line 47,
column 21
[ERROR] 'dependencies.dependency.version' for org.ops4j.pax.exam:pax-exam:jar is missing.
@ line 90, column 21
[ERROR] 'dependencies.dependency.version' for org.ops4j.pax.exam:pax-exam-junit:jar is missing.
@ line 96, column 21
[ERROR] 'dependencies.dependency.version' for org.ops4j.pax.exam:pax-exam-container-default:jar
is missing. @ line 102, column 21
[ERROR] 'dependencies.dependency.version' for org.ops4j.pax.exam:pax-exam-junit-extender-impl:jar
is missing. @ line 108, column 21
[ERROR] 'dependencies.dependency.version' for org.ops4j.pax.runner:pax-runner-no-jcl:jar is
missing. @ line 114, column 21
[ERROR] 'dependencies.dependency.version' for org.ops4j.pax.swissbox:pax-swissbox-tinybundles:jar
is missing. @ line 119, column 21
[ERROR] 'dependencies.dependency.version' for org.eclipse.equinox:cm:jar is missing. @ line
167, column 15
[ERROR] 'dependencies.dependency.version' for org.eclipse.osgi:services:jar is missing. @
line 173, column 15
[ERROR] 'dependencies.dependency.version' for org.eclipse:osgi:jar is missing. @ line 51,
column 21
[ERROR] 'dependencies.dependency.version' for org.eclipse:osgi:jar is missing. @ line 33,
column 21
[ERROR] 'dependencies.dependency.version' for org.ops4j.pax.exam:pax-exam:jar is missing.
@ line 79, column 15
[ERROR] 'dependencies.dependency.version' for org.ops4j.pax.exam:pax-exam-junit:jar is missing.
@ line 84, column 15
[ERROR] 'dependencies.dependency.version' for org.ops4j.pax.exam:pax-exam-container-default:jar
is missing. @ line 89, column 15
[ERROR] 'dependencies.dependency.version' for org.eclipse:osgi:jar is missing. @ line 189,
column 21

	at org.apache.maven.project.DefaultProjectBuilder.build(DefaultProjectBuilder.java:364)
	at hudson.maven.MavenEmbedder.buildProjects(MavenEmbedder.java:361)
	at hudson.maven.MavenEmbedder.readProjects(MavenEmbedder.java:331)
	at hudson.maven.MavenModuleSetBuild$PomParser.invoke(MavenModuleSetBuild.java:1284)
	... 10 more

Mime
View raw message