aries-dev mailing list archives

Site index · List index
Message view « Date » · « Thread »
Top « Date » · « Thread »
From Apache Jenkins Server <jenk...@builds.apache.org>
Subject Build failed in Jenkins: AriesWithSnapshotDependencies #481
Date Wed, 11 Jun 2014 09:25:49 GMT
See <https://builds.apache.org/job/AriesWithSnapshotDependencies/481/changes>

Changes:

[gnodet] Switch jmx itests to asm 5

------------------------------------------
[...truncated 31863 lines...]
[INFO] --- versions-maven-plugin:1.1:use-latest-versions (default-cli) @ org.apache.aries.samples.blueprint.idverifier.client
---
[INFO]                                                                         
[INFO] ------------------------------------------------------------------------
[INFO] Building Apache Aries Blueprint Sample - ID Verifier Assembly 1.0.1-SNAPSHOT
[INFO] ------------------------------------------------------------------------
[INFO] 
[INFO] --- versions-maven-plugin:1.1:use-latest-versions (default-cli) @ org.apache.aries.samples.blueprint.idverifier.assembly
---
[INFO]                                                                         
[INFO] ------------------------------------------------------------------------
[INFO] Building Apache Aries Twitter sample 1.0.1-SNAPSHOT
[INFO] ------------------------------------------------------------------------
[INFO] 
[INFO] --- versions-maven-plugin:1.1:use-latest-versions (default-cli) @ twitter ---
[INFO]                                                                         
[INFO] ------------------------------------------------------------------------
[INFO] Building Apache Aries Bundlise Twitter4j 1.0.1-SNAPSHOT
[INFO] ------------------------------------------------------------------------
[INFO] 
[INFO] --- versions-maven-plugin:1.1:use-latest-versions (default-cli) @ org.apache.aries.samples.twitter.twitter4j
---
[INFO]                                                                         
[INFO] ------------------------------------------------------------------------
[INFO] Building Apache Aries Twitter bundle 1.0.1-SNAPSHOT
[INFO] ------------------------------------------------------------------------
[INFO] 
[INFO] --- versions-maven-plugin:1.1:use-latest-versions (default-cli) @ org.apache.aries.samples.twitter.bundle
---
[INFO]                                                                         
[INFO] ------------------------------------------------------------------------
[INFO] Building Apache Aries Twitter EBA 1.0.1-SNAPSHOT
[INFO] ------------------------------------------------------------------------
[INFO] 
[INFO] --- versions-maven-plugin:1.1:use-latest-versions (default-cli) @ org.apache.aries.samples.twitter.eba
---
[INFO]                                                                         
[INFO] ------------------------------------------------------------------------
[INFO] Building Apache Aries Twitter sample integration tests 1.0.1-SNAPSHOT
[INFO] ------------------------------------------------------------------------
[INFO] 
[INFO] --- versions-maven-plugin:1.1:use-latest-versions (default-cli) @ org.apache.aries.samples.twitter.itests
---
[INFO] Updated org.apache.aries.proxy:org.apache.aries.proxy:jar:null:1.0.0 to version 1.0.2-SNAPSHOT
[INFO]                                                                         
[INFO] ------------------------------------------------------------------------
[INFO] Building Apache Aries 1.0.0-SNAPSHOT
[INFO] ------------------------------------------------------------------------
[INFO] 
[INFO] --- versions-maven-plugin:2.1:use-latest-versions (default-cli) @ aries ---
[INFO] Major version changes allowed
[INFO] ------------------------------------------------------------------------
[INFO] Reactor Summary:
[INFO] 
[INFO] org.apache.aries.versioning.checker ............... SUCCESS [0.577s]
[INFO] org.apache.aries.versioning.plugin Maven Mojo ..... SUCCESS [0.035s]
[INFO] Aries :: Parent POM ............................... SUCCESS [0.250s]
[INFO] Aries Maven EBA Plugin ............................ SUCCESS [0.062s]
[INFO] Apache Aries Unit Test Support .................... SUCCESS [0.011s]
[INFO] Apache Aries Test Support ......................... SUCCESS [0.010s]
[INFO] Apache Aries Util classes compiled under r 42 framework  SUCCESS [0.016s]
[INFO] Apache Aries Util ................................. SUCCESS [0.222s]
[INFO] Apache Aries Util ................................. SUCCESS [0.010s]
[INFO] Apache Aries Semantic Versioning Checker .......... SUCCESS [0.010s]
[INFO] Apache Aries Proxy API ............................ SUCCESS [0.015s]
[INFO] Apache Aries Proxy Service ........................ SUCCESS [0.022s]
[INFO] Apache Aries Proxy Bundle ......................... SUCCESS [0.015s]
[INFO] Apache Aries Proxy iTests ......................... SUCCESS [0.038s]
[INFO] Apache Aries Class Proxy .......................... SUCCESS [0.010s]
[INFO] Apache Aries Quiesce API .......................... SUCCESS [0.013s]
[INFO] Apache Aries Quiesce Manager ...................... SUCCESS [0.020s]
[INFO] Aries Quiesce Manager iTests ...................... SUCCESS [0.043s]
[INFO] Apache Aries Quiesce .............................. SUCCESS [0.010s]
[INFO] Apache Aries Blueprint API ........................ SUCCESS [0.011s]
[INFO] Apache Aries Blueprint Parser ..................... SUCCESS [0.015s]
[INFO] Apache Aries Blueprint Core ....................... SUCCESS [0.091s]
[INFO] Apache Aries Blueprint CM ......................... SUCCESS [0.050s]
[INFO] Apache Aries Blueprint Bundle ..................... SUCCESS [0.121s]
[INFO] Apache Aries Blueprint Compatiblity Fragment Bundle  SUCCESS [0.012s]
[INFO] Apache Aries Blueprint Core Compatiblity Fragment Bundle  SUCCESS [0.020s]
[INFO] Apache Aries Blueprint no-OSGI .................... SUCCESS [0.041s]
[INFO] Apache Aries Blueprint Web ........................ SUCCESS [0.018s]
[INFO] Apache Aries Blueprint Web OSGI ................... SUCCESS [0.016s]
[INFO] Apache Aries Blueprint JEXL evaluator ............. SUCCESS [0.017s]
[INFO] Apache Aries Blueprint Sample ..................... SUCCESS [0.015s]
[INFO] Apache Aries Blueprint Annotation API ............. SUCCESS [0.011s]
[INFO] Apache Aries Blueprint Annotation Impl ............ SUCCESS [0.028s]
[INFO] Apache Aries Blueprint Sample for Testing Annotation  SUCCESS [0.022s]
[INFO] Apache Aries Blueprint Sample Fragment for Testing Annotation  SUCCESS [0.022s]
[INFO] Apache Aries Blueprint WAR Sample ................. SUCCESS [0.095s]
[INFO] Apache Aries Blueprint Test Bundle A .............. SUCCESS [0.046s]
[INFO] Apache Aries Blueprint Test Bundle B .............. SUCCESS [0.030s]
[INFO] Apache Aries Blueprint Test Quiesce Bundle ........ SUCCESS [0.021s]
[INFO] Apache Aries Blueprint iTests ..................... SUCCESS [0.155s]
[INFO] Apache Aries Blueprint ............................ SUCCESS [0.009s]
[INFO] Apache Aries JNDI API ............................. SUCCESS [0.008s]
[INFO] Apache Aries JNDI Core ............................ SUCCESS [0.030s]
[INFO] Apache Aries JNDI URL Handler ..................... SUCCESS [0.045s]
[INFO] Apache Aries JNDI RMI Handler ..................... SUCCESS [0.020s]
[INFO] Apache Aries JNDI Bundle .......................... SUCCESS [0.061s]
[INFO] Apache Aries JNDI Support for Legacy Runtimes ..... SUCCESS [0.008s]
[INFO] Apache Aries JNDI "business logic" test bundle for Aries jndi-url iTests  SUCCESS [0.008s]
[INFO] Apache Aries JNDI Test Bundle for Aries jndi-url iTests  SUCCESS [0.007s]
[INFO] Apache Aries JNDI iTests for jndi-url ............. SUCCESS [0.110s]
[INFO] Apache Aries JNDI ................................. SUCCESS [0.008s]
[INFO] Apache Aries Transaction Manager .................. SUCCESS [0.035s]
[INFO] Apache Aries Transaction Blueprint ................ SUCCESS [0.022s]
[INFO] Apache Aries Transaction Enlisting JDBC Datasource  SUCCESS [0.039s]
[INFO] Apache Aries JMS Pool ............................. SUCCESS [0.024s]
[INFO] Apache Aries Transaction Test Datasource Configuration  SUCCESS [0.008s]
[INFO] Apache Aries Transaction Test Bundle .............. SUCCESS [0.008s]
[INFO] Apache Aries Transaction Integration Tests ........ SUCCESS [0.047s]
[INFO] Apache Aries Transaction - reactor pom ............ SUCCESS [0.008s]
[INFO] Apache Aries Web Url handler ...................... SUCCESS [0.014s]
[INFO] Apache Aries Web integration tests ................ SUCCESS [0.064s]
[INFO] Apache Aries Web Component ........................ SUCCESS [0.008s]
[INFO] Apache Aries Application API ...................... SUCCESS [0.014s]
[INFO] Apache Aries Application Utils .................... SUCCESS [0.028s]
[INFO] Apache Aries Application Bundle ................... SUCCESS [0.053s]
[INFO] Apache Aries Application Converters ............... SUCCESS [0.028s]
[INFO] Apache Aries Application Default local platform ... SUCCESS [0.011s]
[INFO] Apache Aries Application Deployment Management .... SUCCESS [0.028s]
[INFO] Apache Aries Application Installer ................ SUCCESS [0.020s]
[INFO] Apache Aries Application itests sample application interface  SUCCESS [0.007s]
[INFO] Apache Aries Application integration tests ........ SUCCESS [0.125s]
[INFO] Apache Aries Application Management ............... SUCCESS [0.014s]
[INFO] Apache Aries Application Modelling ................ SUCCESS [0.021s]
[INFO] Apache Aries Application Modelling Standalone ..... SUCCESS [0.022s]
[INFO] Apache Aries Application Modelling tests .......... SUCCESS [0.014s]
[INFO] Apache Aries Application No-op Resolver ........... SUCCESS [0.009s]
[INFO] Apache Aries Application OBR Resolver ............. SUCCESS [0.014s]
[INFO] Apache Aries Application Resolve CM Transform ..... SUCCESS [0.011s]
[INFO] Apache Aries Application Resolve CM Transform iTests  SUCCESS [0.027s]
[INFO] Apache Aries Application Runtime .................. SUCCESS [0.011s]
[INFO] Apache Aries Isolated Application Runtime ......... SUCCESS [0.014s]
[INFO] Apache Aries Bundle Framework provider ............ SUCCESS [0.014s]
[INFO] Apache Aries Bundle Framework Manager provider .... SUCCESS [0.015s]
[INFO] Apache Aries repository generator tool ............ SUCCESS [0.051s]
[INFO] Apache Aries Bundle Repository provider ........... SUCCESS [0.045s]
[INFO] Application distribution .......................... SUCCESS [0.024s]
[INFO] Application distribution for isolated application support  SUCCESS [0.028s]
[INFO] Apache Aries Application .......................... SUCCESS [0.006s]
[INFO] Apache Aries Subsystem API ........................ SUCCESS [0.008s]
[INFO] Apache Aries Subsystem Core ....................... SUCCESS [0.016s]
[INFO] Apache Aries Subsystem OBR ........................ SUCCESS [0.009s]
[INFO] Apache Aries Subsystem iTests interfaces bundle ... SUCCESS [0.005s]
[INFO] Apache Aries Subsystem iTests ..................... SUCCESS [0.042s]
[INFO] Apache Aries Subsystems Bundle .................... SUCCESS [0.023s]
[INFO] Apache Aries Subsystem ............................ SUCCESS [0.006s]
[INFO] Aries EJB Modelling Integration ................... SUCCESS [0.012s]
[INFO] Aries EJB Modelling iTests ........................ SUCCESS [0.041s]
[INFO] Aries OpenEJB Runtime Extender .................... SUCCESS [0.013s]
[INFO] Aries EJB Extender iTests ......................... SUCCESS [0.039s]
[INFO] Aries EJB Component ............................... SUCCESS [0.005s]
[INFO] Apache Aries JMX API .............................. SUCCESS [0.005s]
[INFO] Apache Aries JMX Blueprint API .................... SUCCESS [0.005s]
[INFO] Apache Aries JMX Core ............................. SUCCESS [0.009s]
[INFO] Apache Aries JMX Core via Whiteboards ............. SUCCESS [0.009s]
[INFO] Apache Aries Whiteboard support for JMX DynamicMBean services  SUCCESS [0.008s]
[INFO] Apache Aries JMX Blueprint Core ................... SUCCESS [0.009s]
[INFO] Apache Aries JMX Bundle ........................... SUCCESS [0.007s]
[INFO] Apache Aries JMX Blueprint Bundle ................. SUCCESS [0.009s]
[INFO] Apache Aries JMX integration tests ................ SUCCESS [0.021s]
[INFO] Apache Aries JMX .................................. SUCCESS [0.005s]
[INFO] Aries JPA Container API ........................... SUCCESS [0.005s]
[INFO] Aries JPA Container ............................... SUCCESS [0.011s]
[INFO] Aries JPA Container Managed Contexts .............. SUCCESS [0.012s]
[INFO] Aries JPA Container blueprint integration for Aries blueprint  SUCCESS [0.009s]
[INFO] Test Bundle for Aries JPA Container iTests ........ SUCCESS [0.005s]
[INFO] Test Bundle for Aries JPA Container advanced iTests  SUCCESS [0.005s]
[INFO] Aries JPA iTests .................................. SUCCESS [0.046s]
[INFO] Test Bundle for Aries JPA Blueprint iTests ........ SUCCESS [0.005s]
[INFO] Aries JPA Component ............................... SUCCESS [0.004s]
[INFO] Apache Aries SPI Fly Core (internal module) ....... SUCCESS [0.006s]
[INFO] Apache Aries SPI Fly Weaver (internal module) ..... SUCCESS [0.006s]
[INFO] Apache Aries SPI Fly Dynamic Weaving Bundle ....... SUCCESS [0.006s]
[INFO] Apache Aries SPI Fly Static Weaving Tool .......... SUCCESS [0.007s]
[INFO] Apache Aries SPI Fly Static Weaving Bundle ........ SUCCESS [0.005s]
[INFO] Apache Aries SPI Fly Examples ..................... SUCCESS [0.004s]
[INFO] Apache Aries Example SPI Interface ................ SUCCESS [0.005s]
[INFO] Apache Aries Example SPI Provider Jar 1 ........... SUCCESS [0.005s]
[INFO] Apache Aries Example SPI Provider Bundle 1 ........ SUCCESS [0.006s]
[INFO] Apache Aries Example SPI Provider Bundle 2 ........ SUCCESS [0.006s]
[INFO] Apache Aries Example SPI Client Jar 1 ............. SUCCESS [0.005s]
[INFO] Apache Aries Example SPI Client Bundle 1 .......... SUCCESS [0.007s]
[INFO] Apache Aries Example SPI Client Bundle 2 .......... SUCCESS [0.005s]
[INFO] Apache Aries Example SPI Provider Consumer Bundle . SUCCESS [0.007s]
[INFO] Apache Aries Example Resource Provider Bundle ..... SUCCESS [0.005s]
[INFO] Apache Aries Example Resource Client Bundle ....... SUCCESS [0.004s]
[INFO] Apache Aries SPI Fly .............................. SUCCESS [0.004s]
[INFO] Apache Aries Samples .............................. SUCCESS [0.187s]
[INFO] Apache Aries blog sample .......................... SUCCESS [0.082s]
[INFO] Apache Aries blog sample API ...................... SUCCESS [0.067s]
[INFO] Apache Aries blog sample transaction enlisting JDBC datasource  SUCCESS [0.072s]
[INFO] Apache Aries blog sample assembly ................. SUCCESS [0.129s]
[INFO] Apache Aries blog sample .......................... SUCCESS [0.102s]
[INFO] Apache Aries blog sample web component ............ SUCCESS [0.071s]
[INFO] Apache Aries blog sample persistence .............. SUCCESS [0.069s]
[INFO] Apache Aries Blog Sample EBA using JDBC ........... SUCCESS [0.365s]
[INFO] Apache Aries blog sample persistence .............. SUCCESS [0.079s]
[INFO] Apache Aries Blog Sample EBA using JPA ............ SUCCESS [0.110s]
[INFO] Apache Aries blog sample commenting EJB ........... SUCCESS [0.113s]
[INFO] Apache Aries Blog sample iTests ................... SUCCESS [0.174s]
[INFO] AriesTrader :: Performance Benchmark Sample ....... SUCCESS [0.058s]
[INFO] AriesTrader :: Modules ............................ SUCCESS [0.073s]
[INFO] AriesTrader :: Modules - Util ..................... SUCCESS [0.064s]
[INFO] AriesTrader :: Modules - API ...................... SUCCESS [0.096s]
[INFO] AriesTrader :: Modules - Core ..................... SUCCESS [0.068s]
[INFO] AriesTrader :: Modules - Web ...................... SUCCESS [0.068s]
[INFO] AriesTrader :: Modules - Beans .................... SUCCESS [0.063s]
[INFO] AriesTrader :: Modules - Entities ................. SUCCESS [0.075s]
[INFO] AriesTrader :: Modules - Derby DataSource ......... SUCCESS [0.060s]
[INFO] AriesTrader :: Modules - Persist JDBC ............. SUCCESS [0.064s]
[INFO] AriesTrader :: Modules - Persist JPA App Managed .. SUCCESS [0.066s]
[INFO] AriesTrader :: Modules - Persist JPA Container Managed  SUCCESS [0.094s]
[INFO] AriesTrader :: Assemblies ......................... SUCCESS [0.064s]
[INFO] AriesTrader :: Assemblies - EBA - JDBC ............ SUCCESS [0.077s]
[INFO] AriesTrader :: Assemblies - EBA - ALL ............. SUCCESS [0.078s]
[INFO] Equinox test harness that can be used to install sample EBAs  SUCCESS [0.116s]
[INFO] Apache Aries Blueprint samples .................... SUCCESS [0.048s]
[INFO] Apache Aries Blueprint HelloWorld ................. SUCCESS [0.086s]
[INFO] Apache Aries Blueprint HelloWorld API ............. SUCCESS [0.048s]
[INFO] Apache Aries Blueprint HelloWorldServer ........... SUCCESS [0.051s]
[INFO] Apache Aries Blueprint HelloWorldClient ........... SUCCESS [0.051s]
[INFO] Apache Aries Blueprint HelloWorld Assembly ........ SUCCESS [0.065s]
[INFO] Apache Aries Blueprint HelloWorld EBA ............. SUCCESS [0.059s]
[INFO] Apache Aries Blueprint sample iTests .............. SUCCESS [0.083s]
[INFO] Apache Aries Blueprint Sample - ID Verifier ....... SUCCESS [0.051s]
[INFO] Apache Aries Blueprint Sample - ID Verifier API ... SUCCESS [0.048s]
[INFO] Apache Aries Blueprint Sample - ID Verifier Server  SUCCESS [0.084s]
[INFO] Apache Aries Blueprint Sample - ID Verifier Client  SUCCESS [0.054s]
[INFO] Apache Aries Blueprint Sample - ID Verifier Assembly  SUCCESS [0.067s]
[INFO] Apache Aries Twitter sample ....................... SUCCESS [0.048s]
[INFO] Apache Aries Bundlise Twitter4j ................... SUCCESS [0.317s]
[INFO] Apache Aries Twitter bundle ....................... SUCCESS [0.050s]
[INFO] Apache Aries Twitter EBA .......................... SUCCESS [0.051s]
[INFO] Apache Aries Twitter sample integration tests ..... SUCCESS [0.102s]
[INFO] Apache Aries ...................................... SUCCESS [0.466s]
[INFO] ------------------------------------------------------------------------
[INFO] BUILD SUCCESS
[INFO] ------------------------------------------------------------------------
[INFO] Total time: 12.868s
[INFO] Finished at: Wed Jun 11 09:25:41 UTC 2014
[INFO] Final Memory: 69M/354M
[INFO] ------------------------------------------------------------------------
[aries-current-snapshots] $ /home/jenkins/jenkins-slave/tools/hudson.tasks.Maven_MavenInstallation/Maven_3.0.3/bin/mvn
-Dmaven.repo.local=<https://builds.apache.org/job/AriesWithSnapshotDependencies/ws/.repository>
versions:use-latest-versions -Dincludes=org.apache.aries*:*:*:* -Dexcludes=org.apache.aries.versioning*:*:*:*
-DexcludeReactor=false -DallowSnapshots=true -DallowMajorUpdates=true -DallowMinorUpdates=true
[INFO] Scanning for projects...
[ERROR] The projects in the reactor contain a cyclic reference: Edge between 'Vertex{label='org.apache.aries.versioning:org.apache.aries.versioning.plugin:0.3.0-SNAPSHOT'}'
and 'Vertex{label='org.apache.aries.versioning:org.apache.aries.versioning.checker:0.2.1-SNAPSHOT'}'
introduces to cycle in the graph org.apache.aries.versioning:org.apache.aries.versioning.checker:0.2.1-SNAPSHOT
--> org.apache.aries:org.apache.aries.util:1.1.1-SNAPSHOT --> org.apache.aries.testsupport:org.apache.aries.testsupport.unit:2.0.0-SNAPSHOT
--> org.apache.aries:parent:1.0.1-SNAPSHOT --> org.apache.aries.versioning:org.apache.aries.versioning.plugin:0.3.0-SNAPSHOT
--> org.apache.aries.versioning:org.apache.aries.versioning.checker:0.2.1-SNAPSHOT ->
[Help 1]
[ERROR] 
[ERROR] To see the full stack trace of the errors, re-run Maven with the -e switch.
[ERROR] Re-run Maven using the -X switch to enable full debug logging.
[ERROR] 
[ERROR] For more information about the errors and possible solutions, please read the following
articles:
[ERROR] [Help 1] http://cwiki.apache.org/confluence/display/MAVEN/ProjectCycleException
Build step 'Invoke top-level Maven targets' marked build as failure

Mime
View raw message