aries-dev mailing list archives

Site index · List index
Message view « Date » · « Thread »
Top « Date » · « Thread »
From Apache Jenkins Server <jenk...@builds.apache.org>
Subject Build failed in Jenkins: AriesWithSnapshotDependencies #512
Date Wed, 25 Jun 2014 08:39:06 GMT
See <https://builds.apache.org/job/AriesWithSnapshotDependencies/512/changes>

Changes:

[cschneider] Simplify customizer tests

[cschneider] Improve DataSourceFactoryTest to require no external bundle

------------------------------------------
[...truncated 15543 lines...]
[INFO] Apache Aries Blueprint Compatiblity Fragment Bundle  SUCCESS [0.327s]
[INFO] Apache Aries Blueprint Core Compatiblity Fragment Bundle  SUCCESS [0.623s]
[INFO] Apache Aries Blueprint no-OSGI .................... SUCCESS [1.444s]
[INFO] Apache Aries Blueprint Web ........................ SUCCESS [3.086s]
[INFO] Apache Aries Blueprint Web OSGI ................... SUCCESS [2.424s]
[INFO] Apache Aries Blueprint JEXL evaluator ............. SUCCESS [1.390s]
[INFO] Apache Aries Blueprint Sample ..................... SUCCESS [0.787s]
[INFO] Apache Aries Blueprint Annotation API ............. SUCCESS [1.017s]
[INFO] Apache Aries Blueprint Annotation Impl ............ SUCCESS [6.142s]
[INFO] Apache Aries Blueprint Sample for Testing Annotation  SUCCESS [0.341s]
[INFO] Apache Aries Blueprint Sample Fragment for Testing Annotation  SUCCESS [0.302s]
[INFO] Apache Aries Blueprint WAR Sample ................. SUCCESS [2.011s]
[INFO] Apache Aries Blueprint Test Bundle A .............. SUCCESS [0.649s]
[INFO] Apache Aries Blueprint Test Bundle B .............. SUCCESS [0.560s]
[INFO] Apache Aries Blueprint Test Quiesce Bundle ........ SUCCESS [1.754s]
[INFO] Apache Aries Blueprint iTests ..................... SUCCESS [2.568s]
[INFO] Apache Aries Blueprint ............................ SUCCESS [0.021s]
[INFO] Apache Aries JNDI API ............................. SUCCESS [0.266s]
[INFO] Apache Aries JNDI Core ............................ SUCCESS [2.108s]
[INFO] Apache Aries JNDI URL Handler ..................... SUCCESS [0.789s]
[INFO] Apache Aries JNDI RMI Handler ..................... SUCCESS [0.270s]
[INFO] Apache Aries JNDI Bundle .......................... SUCCESS [0.941s]
[INFO] Apache Aries JNDI Support for Legacy Runtimes ..... SUCCESS [0.209s]
[INFO] Apache Aries JNDI "business logic" test bundle for Aries jndi-url iTests  SUCCESS [0.183s]
[INFO] Apache Aries JNDI Test Bundle for Aries jndi-url iTests  SUCCESS [0.377s]
[INFO] Apache Aries JNDI iTests for jndi-url ............. SUCCESS [9.901s]
[INFO] Apache Aries JNDI ................................. SUCCESS [0.016s]
[INFO] Apache Aries Transaction Manager .................. SUCCESS [11.072s]
[INFO] Apache Aries Transaction Blueprint ................ SUCCESS [0.524s]
[INFO] Apache Aries Transaction Enlisting JDBC Datasource  SUCCESS [7.252s]
[INFO] Apache Aries JMS Pool ............................. SUCCESS [2.087s]
[INFO] Apache Aries Transaction Test Datasource Configuration  SUCCESS [2.149s]
[INFO] Apache Aries Transaction Test Bundle .............. SUCCESS [1.021s]
[INFO] Apache Aries Transaction Integration Tests ........ SUCCESS [1.102s]
[INFO] Apache Aries Transaction - reactor pom ............ SUCCESS [0.167s]
[INFO] Apache Aries Web Url handler ...................... SUCCESS [2.286s]
[INFO] Apache Aries Web integration tests ................ SUCCESS [1.682s]
[INFO] Apache Aries Web Component ........................ SUCCESS [0.138s]
[INFO] Apache Aries Application API ...................... SUCCESS [1.738s]
[INFO] Apache Aries Application Utils .................... SUCCESS [2.202s]
[INFO] Apache Aries Application Bundle ................... SUCCESS [2.631s]
[INFO] Apache Aries Application Converters ............... SUCCESS [1.008s]
[INFO] Apache Aries Application Default local platform ... SUCCESS [0.991s]
[INFO] Apache Aries Application Deployment Management .... SUCCESS [0.532s]
[INFO] Apache Aries Application Installer ................ SUCCESS [0.928s]
[INFO] Apache Aries Application itests sample application interface  SUCCESS [0.211s]
[INFO] Apache Aries Application integration tests ........ SUCCESS [3.471s]
[INFO] Apache Aries Application Management ............... SUCCESS [0.480s]
[INFO] Apache Aries Application Modelling ................ SUCCESS [0.557s]
[INFO] Apache Aries Application Modelling Standalone ..... SUCCESS [27.318s]
[INFO] Apache Aries Application Modelling tests .......... SUCCESS [0.884s]
[INFO] Apache Aries Application No-op Resolver ........... SUCCESS [1.383s]
[INFO] Apache Aries Application OBR Resolver ............. SUCCESS [1.779s]
[INFO] Apache Aries Application Resolve CM Transform ..... SUCCESS [0.265s]
[INFO] Apache Aries Application Resolve CM Transform iTests  SUCCESS [0.436s]
[INFO] Apache Aries Application Runtime .................. SUCCESS [0.283s]
[INFO] Apache Aries Isolated Application Runtime ......... SUCCESS [0.432s]
[INFO] Apache Aries Bundle Framework provider ............ SUCCESS [0.360s]
[INFO] Apache Aries Bundle Framework Manager provider .... SUCCESS [0.634s]
[INFO] Apache Aries repository generator tool ............ SUCCESS [2.869s]
[INFO] Apache Aries Bundle Repository provider ........... SUCCESS [0.624s]
[INFO] Application distribution .......................... SUCCESS [1.908s]
[INFO] Application distribution for isolated application support  SUCCESS [1.492s]
[INFO] Apache Aries Application .......................... SUCCESS [0.044s]
[INFO] Apache Aries Subsystem API ........................ SUCCESS [1.026s]
[INFO] Apache Aries Subsystem Core ....................... SUCCESS [4.901s]
[INFO] Apache Aries Subsystem OBR ........................ SUCCESS [0.489s]
[INFO] Apache Aries Subsystem iTests interfaces bundle ... SUCCESS [0.179s]
[INFO] Apache Aries Subsystem iTests ..................... SUCCESS [8.481s]
[INFO] Apache Aries Subsystems Bundle .................... SUCCESS [1.293s]
[INFO] Apache Aries Subsystem ............................ SUCCESS [0.017s]
[INFO] Aries EJB Modelling Integration ................... FAILURE [54.477s]
[INFO] Aries EJB Modelling iTests ........................ SKIPPED
[INFO] Aries OpenEJB Runtime Extender .................... SKIPPED
[INFO] Aries EJB Extender iTests ......................... SKIPPED
[INFO] Aries EJB Component ............................... SKIPPED
[INFO] Apache Aries JMX API .............................. SKIPPED
[INFO] Apache Aries JMX Blueprint API .................... SKIPPED
[INFO] Apache Aries JMX Core ............................. SKIPPED
[INFO] Apache Aries JMX Core via Whiteboards ............. SKIPPED
[INFO] Apache Aries Whiteboard support for JMX DynamicMBean services  SKIPPED
[INFO] Apache Aries JMX Blueprint Core ................... SKIPPED
[INFO] Apache Aries JMX Bundle ........................... SKIPPED
[INFO] Apache Aries JMX Blueprint Bundle ................. SKIPPED
[INFO] Apache Aries JMX integration tests ................ SKIPPED
[INFO] Apache Aries JMX .................................. SKIPPED
[INFO] Aries JPA Container API ........................... SKIPPED
[INFO] Aries JPA Container ............................... SKIPPED
[INFO] Aries JPA Container Managed Contexts .............. SKIPPED
[INFO] Aries JPA Container blueprint integration for Aries blueprint  SKIPPED
[INFO] Test Bundle for Aries JPA Container iTests ........ SKIPPED
[INFO] Test Bundle for Aries JPA Container advanced iTests  SKIPPED
[INFO] Test Bundle for Aries JPA Blueprint iTests ........ SKIPPED
[INFO] Aries JPA iTests .................................. SKIPPED
[INFO] Aries JPA Component ............................... SKIPPED
[INFO] Apache Aries SPI Fly Core (internal module) ....... SKIPPED
[INFO] Apache Aries SPI Fly Weaver (internal module) ..... SKIPPED
[INFO] Apache Aries SPI Fly Dynamic Weaving Bundle ....... SKIPPED
[INFO] Apache Aries SPI Fly Static Weaving Tool .......... SKIPPED
[INFO] Apache Aries SPI Fly Static Weaving Bundle ........ SKIPPED
[INFO] Apache Aries SPI Fly Examples ..................... SKIPPED
[INFO] Apache Aries Example SPI Interface ................ SKIPPED
[INFO] Apache Aries Example SPI Provider Jar 1 ........... SKIPPED
[INFO] Apache Aries Example SPI Provider Bundle 1 ........ SKIPPED
[INFO] Apache Aries Example SPI Provider Bundle 2 ........ SKIPPED
[INFO] Apache Aries Example SPI Client Jar 1 ............. SKIPPED
[INFO] Apache Aries Example SPI Client Bundle 1 .......... SKIPPED
[INFO] Apache Aries Example SPI Client Bundle 2 .......... SKIPPED
[INFO] Apache Aries Example SPI Provider Consumer Bundle . SKIPPED
[INFO] Apache Aries Example Resource Provider Bundle ..... SKIPPED
[INFO] Apache Aries Example Resource Client Bundle ....... SKIPPED
[INFO] Apache Aries SPI Fly .............................. SKIPPED
[INFO] Apache Aries Samples .............................. SKIPPED
[INFO] Apache Aries blog sample .......................... SKIPPED
[INFO] Apache Aries blog sample API ...................... SKIPPED
[INFO] Apache Aries blog sample transaction enlisting JDBC datasource  SKIPPED
[INFO] Apache Aries blog sample assembly ................. SKIPPED
[INFO] Apache Aries blog sample .......................... SKIPPED
[INFO] Apache Aries blog sample web component ............ SKIPPED
[INFO] Apache Aries blog sample persistence .............. SKIPPED
[INFO] Apache Aries Blog Sample EBA using JDBC ........... SKIPPED
[INFO] Apache Aries blog sample persistence .............. SKIPPED
[INFO] Apache Aries Blog Sample EBA using JPA ............ SKIPPED
[INFO] Apache Aries blog sample commenting EJB ........... SKIPPED
[INFO] Apache Aries Blog sample iTests ................... SKIPPED
[INFO] AriesTrader :: Performance Benchmark Sample ....... SKIPPED
[INFO] AriesTrader :: Modules ............................ SKIPPED
[INFO] AriesTrader :: Modules - Util ..................... SKIPPED
[INFO] AriesTrader :: Modules - API ...................... SKIPPED
[INFO] AriesTrader :: Modules - Core ..................... SKIPPED
[INFO] AriesTrader :: Modules - Web ...................... SKIPPED
[INFO] AriesTrader :: Modules - Beans .................... SKIPPED
[INFO] AriesTrader :: Modules - Entities ................. SKIPPED
[INFO] AriesTrader :: Modules - Derby DataSource ......... SKIPPED
[INFO] AriesTrader :: Modules - Persist JDBC ............. SKIPPED
[INFO] AriesTrader :: Modules - Persist JPA App Managed .. SKIPPED
[INFO] AriesTrader :: Modules - Persist JPA Container Managed  SKIPPED
[INFO] AriesTrader :: Assemblies ......................... SKIPPED
[INFO] AriesTrader :: Assemblies - EBA - JDBC ............ SKIPPED
[INFO] AriesTrader :: Assemblies - EBA - ALL ............. SKIPPED
[INFO] Equinox test harness that can be used to install sample EBAs  SKIPPED
[INFO] Apache Aries Blueprint samples .................... SKIPPED
[INFO] Apache Aries Blueprint HelloWorld ................. SKIPPED
[INFO] Apache Aries Blueprint HelloWorld API ............. SKIPPED
[INFO] Apache Aries Blueprint HelloWorldServer ........... SKIPPED
[INFO] Apache Aries Blueprint HelloWorldClient ........... SKIPPED
[INFO] Apache Aries Blueprint HelloWorld Assembly ........ SKIPPED
[INFO] Apache Aries Blueprint HelloWorld EBA ............. SKIPPED
[INFO] Apache Aries Blueprint sample iTests .............. SKIPPED
[INFO] Apache Aries Blueprint Sample - ID Verifier ....... SKIPPED
[INFO] Apache Aries Blueprint Sample - ID Verifier API ... SKIPPED
[INFO] Apache Aries Blueprint Sample - ID Verifier Server  SKIPPED
[INFO] Apache Aries Blueprint Sample - ID Verifier Client  SKIPPED
[INFO] Apache Aries Blueprint Sample - ID Verifier Assembly  SKIPPED
[INFO] Apache Aries Twitter sample ....................... SKIPPED
[INFO] Apache Aries Bundlise Twitter4j ................... SKIPPED
[INFO] Apache Aries Twitter bundle ....................... SKIPPED
[INFO] Apache Aries Twitter EBA .......................... SKIPPED
[INFO] Apache Aries Twitter sample integration tests ..... SKIPPED
[INFO] Apache Aries ...................................... SKIPPED
[INFO] ------------------------------------------------------------------------
[INFO] BUILD FAILURE
[INFO] ------------------------------------------------------------------------
[INFO] Total time: 5:10.658s
[INFO] Finished at: Wed Jun 25 08:39:04 UTC 2014
[INFO] Final Memory: 124M/560M
[INFO] ------------------------------------------------------------------------
[ERROR] Failed to execute goal on project org.apache.aries.ejb.modeller: Could not resolve
dependencies for project org.apache.aries.ejb:org.apache.aries.ejb.modeller:bundle:1.0.1-SNAPSHOT:
The following artifacts could not be resolved: org.apache.geronimo.specs:geronimo-jaxrs_1.1_spec:jar:sources:1.0,
org.apache.geronimo.specs:geronimo-jsp_2.2_spec:jar:sources:1.0: Could not transfer artifact
org.apache.geronimo.specs:geronimo-jaxrs_1.1_spec:jar:sources:1.0 from/to central (http://repo1.maven.org/maven2):
Error transferring file: Server returned HTTP response code: 503 for URL: http://repo1.maven.org/maven2/org/apache/geronimo/specs/geronimo-jaxrs_1.1_spec/1.0/geronimo-jaxrs_1.1_spec-1.0-sources.jar
-> [Help 1]
org.apache.maven.lifecycle.LifecycleExecutionException: Failed to execute goal on project
org.apache.aries.ejb.modeller: Could not resolve dependencies for project org.apache.aries.ejb:org.apache.aries.ejb.modeller:bundle:1.0.1-SNAPSHOT:
The following artifacts could not be resolved: org.apache.geronimo.specs:geronimo-jaxrs_1.1_spec:jar:sources:1.0,
org.apache.geronimo.specs:geronimo-jsp_2.2_spec:jar:sources:1.0: Could not transfer artifact
org.apache.geronimo.specs:geronimo-jaxrs_1.1_spec:jar:sources:1.0 from/to central (http://repo1.maven.org/maven2):
Error transferring file: Server returned HTTP response code: 503 for URL: http://repo1.maven.org/maven2/org/apache/geronimo/specs/geronimo-jaxrs_1.1_spec/1.0/geronimo-jaxrs_1.1_spec-1.0-sources.jar
	at org.apache.maven.lifecycle.internal.LifecycleDependencyResolver.getDependencies(LifecycleDependencyResolver.java:196)
	at org.apache.maven.lifecycle.internal.LifecycleDependencyResolver.resolveProjectDependencies(LifecycleDependencyResolver.java:108)
	at org.apache.maven.lifecycle.internal.MojoExecutor.ensureDependenciesAreResolved(MojoExecutor.java:258)
	at org.apache.maven.lifecycle.internal.MojoExecutor.execute(MojoExecutor.java:201)
	at org.apache.maven.lifecycle.internal.MojoExecutor.execute(MojoExecutor.java:153)
	at org.apache.maven.lifecycle.internal.MojoExecutor.execute(MojoExecutor.java:145)
	at org.apache.maven.lifecycle.internal.LifecycleModuleBuilder.buildProject(LifecycleModuleBuilder.java:84)
	at org.apache.maven.lifecycle.internal.LifecycleModuleBuilder.buildProject(LifecycleModuleBuilder.java:59)
	at org.apache.maven.lifecycle.internal.LifecycleStarter.singleThreadedBuild(LifecycleStarter.java:183)
	at org.apache.maven.lifecycle.internal.LifecycleStarter.execute(LifecycleStarter.java:161)
	at org.apache.maven.DefaultMaven.doExecute(DefaultMaven.java:319)
	at org.apache.maven.DefaultMaven.execute(DefaultMaven.java:156)
	at org.apache.maven.cli.MavenCli.execute(MavenCli.java:537)
	at org.apache.maven.cli.MavenCli.doMain(MavenCli.java:196)
	at org.apache.maven.cli.MavenCli.main(MavenCli.java:141)
	at sun.reflect.NativeMethodAccessorImpl.invoke0(Native Method)
	at sun.reflect.NativeMethodAccessorImpl.invoke(NativeMethodAccessorImpl.java:57)
	at sun.reflect.DelegatingMethodAccessorImpl.invoke(DelegatingMethodAccessorImpl.java:43)
	at java.lang.reflect.Method.invoke(Method.java:606)
	at org.codehaus.plexus.classworlds.launcher.Launcher.launchEnhanced(Launcher.java:290)
	at org.codehaus.plexus.classworlds.launcher.Launcher.launch(Launcher.java:230)
	at org.codehaus.plexus.classworlds.launcher.Launcher.mainWithExitCode(Launcher.java:409)
	at org.codehaus.plexus.classworlds.launcher.Launcher.main(Launcher.java:352)
Caused by: org.apache.maven.project.DependencyResolutionException: Could not resolve dependencies
for project org.apache.aries.ejb:org.apache.aries.ejb.modeller:bundle:1.0.1-SNAPSHOT: The
following artifacts could not be resolved: org.apache.geronimo.specs:geronimo-jaxrs_1.1_spec:jar:sources:1.0,
org.apache.geronimo.specs:geronimo-jsp_2.2_spec:jar:sources:1.0: Could not transfer artifact
org.apache.geronimo.specs:geronimo-jaxrs_1.1_spec:jar:sources:1.0 from/to central (http://repo1.maven.org/maven2):
Error transferring file: Server returned HTTP response code: 503 for URL: http://repo1.maven.org/maven2/org/apache/geronimo/specs/geronimo-jaxrs_1.1_spec/1.0/geronimo-jaxrs_1.1_spec-1.0-sources.jar
	at org.apache.maven.project.DefaultProjectDependenciesResolver.resolve(DefaultProjectDependenciesResolver.java:170)
	at org.apache.maven.lifecycle.internal.LifecycleDependencyResolver.getDependencies(LifecycleDependencyResolver.java:171)
	... 22 more
Caused by: org.sonatype.aether.resolution.DependencyResolutionException: The following artifacts
could not be resolved: org.apache.geronimo.specs:geronimo-jaxrs_1.1_spec:jar:sources:1.0,
org.apache.geronimo.specs:geronimo-jsp_2.2_spec:jar:sources:1.0: Could not transfer artifact
org.apache.geronimo.specs:geronimo-jaxrs_1.1_spec:jar:sources:1.0 from/to central (http://repo1.maven.org/maven2):
Error transferring file: Server returned HTTP response code: 503 for URL: http://repo1.maven.org/maven2/org/apache/geronimo/specs/geronimo-jaxrs_1.1_spec/1.0/geronimo-jaxrs_1.1_spec-1.0-sources.jar
	at org.sonatype.aether.impl.internal.DefaultRepositorySystem.resolveDependencies(DefaultRepositorySystem.java:412)
	at org.apache.maven.project.DefaultProjectDependenciesResolver.resolve(DefaultProjectDependenciesResolver.java:164)
	... 23 more
Caused by: org.sonatype.aether.resolution.ArtifactResolutionException: The following artifacts
could not be resolved: org.apache.geronimo.specs:geronimo-jaxrs_1.1_spec:jar:sources:1.0,
org.apache.geronimo.specs:geronimo-jsp_2.2_spec:jar:sources:1.0: Could not transfer artifact
org.apache.geronimo.specs:geronimo-jaxrs_1.1_spec:jar:sources:1.0 from/to central (http://repo1.maven.org/maven2):
Error transferring file: Server returned HTTP response code: 503 for URL: http://repo1.maven.org/maven2/org/apache/geronimo/specs/geronimo-jaxrs_1.1_spec/1.0/geronimo-jaxrs_1.1_spec-1.0-sources.jar
	at org.sonatype.aether.impl.internal.DefaultArtifactResolver.resolve(DefaultArtifactResolver.java:541)
	at org.sonatype.aether.impl.internal.DefaultArtifactResolver.resolveArtifacts(DefaultArtifactResolver.java:220)
	at org.sonatype.aether.impl.internal.DefaultRepositorySystem.resolveDependencies(DefaultRepositorySystem.java:395)
	... 24 more
Caused by: org.sonatype.aether.transfer.ArtifactTransferException: Could not transfer artifact
org.apache.geronimo.specs:geronimo-jaxrs_1.1_spec:jar:sources:1.0 from/to central (http://repo1.maven.org/maven2):
Error transferring file: Server returned HTTP response code: 503 for URL: http://repo1.maven.org/maven2/org/apache/geronimo/specs/geronimo-jaxrs_1.1_spec/1.0/geronimo-jaxrs_1.1_spec-1.0-sources.jar
	at org.sonatype.aether.connector.wagon.WagonRepositoryConnector$4.wrap(WagonRepositoryConnector.java:949)
	at org.sonatype.aether.connector.wagon.WagonRepositoryConnector$4.wrap(WagonRepositoryConnector.java:940)
	at org.sonatype.aether.connector.wagon.WagonRepositoryConnector$GetTask.flush(WagonRepositoryConnector.java:695)
	at org.sonatype.aether.connector.wagon.WagonRepositoryConnector$GetTask.flush(WagonRepositoryConnector.java:689)
	at org.sonatype.aether.connector.wagon.WagonRepositoryConnector.get(WagonRepositoryConnector.java:445)
	at org.sonatype.aether.impl.internal.DefaultArtifactResolver.resolve(DefaultArtifactResolver.java:460)
	... 26 more
Caused by: org.apache.maven.wagon.TransferFailedException: Error transferring file: Server
returned HTTP response code: 503 for URL: http://repo1.maven.org/maven2/org/apache/geronimo/specs/geronimo-jaxrs_1.1_spec/1.0/geronimo-jaxrs_1.1_spec-1.0-sources.jar
	at org.apache.maven.wagon.providers.http.LightweightHttpWagon.fillInputData(LightweightHttpWagon.java:143)
	at org.apache.maven.wagon.StreamWagon.getInputStream(StreamWagon.java:116)
	at org.apache.maven.wagon.StreamWagon.getIfNewer(StreamWagon.java:88)
	at org.apache.maven.wagon.StreamWagon.get(StreamWagon.java:61)
	at org.sonatype.aether.connector.wagon.WagonRepositoryConnector$GetTask.run(WagonRepositoryConnector.java:608)
	at org.sonatype.aether.util.concurrency.RunnableErrorForwarder$1.run(RunnableErrorForwarder.java:64)
	at java.util.concurrent.ThreadPoolExecutor.runWorker(ThreadPoolExecutor.java:1145)
	at java.util.concurrent.ThreadPoolExecutor$Worker.run(ThreadPoolExecutor.java:615)
	at java.lang.Thread.run(Thread.java:724)
Caused by: java.io.IOException: Server returned HTTP response code: 503 for URL: http://repo1.maven.org/maven2/org/apache/geronimo/specs/geronimo-jaxrs_1.1_spec/1.0/geronimo-jaxrs_1.1_spec-1.0-sources.jar
	at sun.reflect.NativeConstructorAccessorImpl.newInstance0(Native Method)
	at sun.reflect.NativeConstructorAccessorImpl.newInstance(NativeConstructorAccessorImpl.java:57)
	at sun.reflect.DelegatingConstructorAccessorImpl.newInstance(DelegatingConstructorAccessorImpl.java:45)
	at java.lang.reflect.Constructor.newInstance(Constructor.java:526)
	at sun.net.www.protocol.http.HttpURLConnection$6.run(HttpURLConnection.java:1674)
	at sun.net.www.protocol.http.HttpURLConnection$6.run(HttpURLConnection.java:1672)
	at java.security.AccessController.doPrivileged(Native Method)
	at sun.net.www.protocol.http.HttpURLConnection.getChainedException(HttpURLConnection.java:1670)
	at sun.net.www.protocol.http.HttpURLConnection.getInputStream(HttpURLConnection.java:1243)
	at org.apache.maven.wagon.providers.http.LightweightHttpWagon.fillInputData(LightweightHttpWagon.java:122)
	... 8 more
Caused by: java.io.IOException: Server returned HTTP response code: 503 for URL: http://repo1.maven.org/maven2/org/apache/geronimo/specs/geronimo-jaxrs_1.1_spec/1.0/geronimo-jaxrs_1.1_spec-1.0-sources.jar
	at sun.net.www.protocol.http.HttpURLConnection.getInputStream(HttpURLConnection.java:1625)
	at java.net.HttpURLConnection.getResponseCode(HttpURLConnection.java:468)
	at org.apache.maven.wagon.providers.http.LightweightHttpWagon.fillInputData(LightweightHttpWagon.java:115)
	... 8 more
[ERROR] 
[ERROR] Re-run Maven using the -X switch to enable full debug logging.
[ERROR] 
[ERROR] For more information about the errors and possible solutions, please read the following
articles:
[ERROR] [Help 1] http://cwiki.apache.org/confluence/display/MAVEN/DependencyResolutionException
[ERROR] 
[ERROR] After correcting the problems, you can resume the build with the command
[ERROR]   mvn <goals> -rf :org.apache.aries.ejb.modeller
Build step 'Invoke top-level Maven targets' marked build as failure

Mime
View raw message