aries-dev mailing list archives

Site index · List index
Message view « Date » · « Thread »
Top « Date » · « Thread »
From Apache Jenkins Server <jenk...@builds.apache.org>
Subject Build failed in Jenkins: AriesWithSnapshotDependencies #464
Date Wed, 04 Jun 2014 19:25:02 GMT
See <https://builds.apache.org/job/AriesWithSnapshotDependencies/464/changes>

Changes:

[dkulp] Add a skip option
Also skip the version check for "pom" packaging

[dkulp] Fix a typo

------------------------------------------
[...truncated 16999 lines...]
[INFO] Apache Aries Test Support ......................... SUCCESS [0.281s]
[INFO] Apache Aries Util classes compiled under r 42 framework  SUCCESS [9.093s]
[INFO] Apache Aries Util ................................. SUCCESS [10.416s]
[INFO] Apache Aries Util ................................. SUCCESS [0.020s]
[INFO] org.apache.aries.versioning.checker ............... SUCCESS [3.056s]
[INFO] org.apache.aries.versioning.plugin Maven Mojo ..... SUCCESS [3.307s]
[INFO] Apache Aries Semantic Versioning Checker .......... SUCCESS [0.019s]
[INFO] Apache Aries Proxy API ............................ SUCCESS [1.092s]
[INFO] Apache Aries Proxy Service ........................ SUCCESS [4.016s]
[INFO] Apache Aries Proxy Bundle ......................... SUCCESS [0.658s]
[INFO] Apache Aries Proxy iTests ......................... SUCCESS [24.398s]
[INFO] Apache Aries Class Proxy .......................... SUCCESS [0.024s]
[INFO] Apache Aries Quiesce API .......................... SUCCESS [0.391s]
[INFO] Apache Aries Quiesce Manager ...................... SUCCESS [0.918s]
[INFO] Aries Quiesce Manager iTests ...................... SUCCESS [8.724s]
[INFO] Apache Aries Quiesce .............................. SUCCESS [0.020s]
[INFO] Apache Aries Blueprint API ........................ SUCCESS [1.386s]
[INFO] Apache Aries Blueprint Parser ..................... SUCCESS [0.904s]
[INFO] Apache Aries Blueprint Core ....................... SUCCESS [5.677s]
[INFO] Apache Aries Blueprint CM ......................... SUCCESS [4.183s]
[INFO] Apache Aries Blueprint Bundle ..................... SUCCESS [2.947s]
[INFO] Apache Aries Blueprint Compatiblity Fragment Bundle  SUCCESS [0.242s]
[INFO] Apache Aries Blueprint Core Compatiblity Fragment Bundle  SUCCESS [0.659s]
[INFO] Apache Aries Blueprint no-OSGI .................... SUCCESS [1.354s]
[INFO] Apache Aries Blueprint Web ........................ SUCCESS [3.077s]
[INFO] Apache Aries Blueprint Web OSGI ................... SUCCESS [0.775s]
[INFO] Apache Aries Blueprint JEXL evaluator ............. SUCCESS [1.303s]
[INFO] Apache Aries Blueprint Sample ..................... SUCCESS [0.175s]
[INFO] Apache Aries Blueprint Annotation API ............. SUCCESS [0.199s]
[INFO] Apache Aries Blueprint Annotation Impl ............ SUCCESS [2.792s]
[INFO] Apache Aries Blueprint Sample for Testing Annotation  SUCCESS [0.167s]
[INFO] Apache Aries Blueprint Sample Fragment for Testing Annotation  SUCCESS [0.130s]
[INFO] Apache Aries Blueprint WAR Sample ................. SUCCESS [1.020s]
[INFO] Apache Aries Blueprint Test Bundle A .............. SUCCESS [0.421s]
[INFO] Apache Aries Blueprint Test Bundle B .............. SUCCESS [0.397s]
[INFO] Apache Aries Blueprint Test Quiesce Bundle ........ SUCCESS [0.177s]
[INFO] Apache Aries Blueprint iTests ..................... SUCCESS [5.732s]
[INFO] Apache Aries Blueprint ............................ SUCCESS [0.018s]
[INFO] Apache Aries JNDI API ............................. SUCCESS [0.319s]
[INFO] Apache Aries JNDI Core ............................ SUCCESS [0.860s]
[INFO] Apache Aries JNDI URL Handler ..................... SUCCESS [0.861s]
[INFO] Apache Aries JNDI RMI Handler ..................... SUCCESS [0.372s]
[INFO] Apache Aries JNDI Bundle .......................... SUCCESS [0.889s]
[INFO] Apache Aries JNDI Support for Legacy Runtimes ..... SUCCESS [2.083s]
[INFO] Apache Aries JNDI "business logic" test bundle for Aries jndi-url iTests  SUCCESS [0.097s]
[INFO] Apache Aries JNDI Test Bundle for Aries jndi-url iTests  SUCCESS [0.136s]
[INFO] Apache Aries JNDI iTests for jndi-url ............. SUCCESS [22.640s]
[INFO] Apache Aries JNDI ................................. SUCCESS [0.056s]
[INFO] Apache Aries Transaction Manager .................. SUCCESS [10.258s]
[INFO] Apache Aries Transaction Blueprint ................ SUCCESS [0.521s]
[INFO] Apache Aries Transaction Enlisting JDBC Datasource  SUCCESS [6.433s]
[INFO] Apache Aries JMS Pool ............................. SUCCESS [1.879s]
[INFO] Apache Aries Transaction Test Datasource Configuration  SUCCESS [0.808s]
[INFO] Apache Aries Transaction Test Bundle .............. SUCCESS [0.128s]
[INFO] Apache Aries Transaction Integration Tests ........ SUCCESS [1.900s]
[INFO] Apache Aries Transaction - reactor pom ............ SUCCESS [0.017s]
[INFO] Apache Aries Web Url handler ...................... SUCCESS [0.684s]
[INFO] Apache Aries Web integration tests ................ SUCCESS [1.455s]
[INFO] Apache Aries Web Component ........................ SUCCESS [0.015s]
[INFO] Apache Aries Application API ...................... SUCCESS [0.658s]
[INFO] Apache Aries Application Utils .................... SUCCESS [0.847s]
[INFO] Apache Aries Application Bundle ................... SUCCESS [4.804s]
[INFO] Apache Aries Application Converters ............... SUCCESS [0.521s]
[INFO] Apache Aries Application Default local platform ... SUCCESS [0.478s]
[INFO] Apache Aries Application Deployment Management .... SUCCESS [0.260s]
[INFO] Apache Aries Application Installer ................ SUCCESS [1.143s]
[INFO] Apache Aries Application itests sample application interface  SUCCESS [0.113s]
[INFO] Apache Aries Application integration tests ........ SUCCESS [5.345s]
[INFO] Apache Aries Application Management ............... SUCCESS [0.266s]
[INFO] Apache Aries Application Modelling ................ SUCCESS [0.526s]
[INFO] Apache Aries Application Modelling Standalone ..... SUCCESS [34.669s]
[INFO] Apache Aries Application Modelling tests .......... SUCCESS [1.091s]
[INFO] Apache Aries Application No-op Resolver ........... SUCCESS [0.153s]
[INFO] Apache Aries Application OBR Resolver ............. SUCCESS [0.385s]
[INFO] Apache Aries Application Resolve CM Transform ..... SUCCESS [0.163s]
[INFO] Apache Aries Application Resolve CM Transform iTests  SUCCESS [0.134s]
[INFO] Apache Aries Application Runtime .................. SUCCESS [0.224s]
[INFO] Apache Aries Isolated Application Runtime ......... SUCCESS [0.208s]
[INFO] Apache Aries Bundle Framework provider ............ SUCCESS [0.258s]
[INFO] Apache Aries Bundle Framework Manager provider .... SUCCESS [0.226s]
[INFO] Apache Aries repository generator tool ............ SUCCESS [4.539s]
[INFO] Apache Aries Bundle Repository provider ........... SUCCESS [0.189s]
[INFO] Application distribution .......................... SUCCESS [1.881s]
[INFO] Application distribution for isolated application support  SUCCESS [1.103s]
[INFO] Apache Aries Application .......................... SUCCESS [0.016s]
[INFO] Apache Aries Subsystem API ........................ SUCCESS [1.159s]
[INFO] Apache Aries Subsystem Core ....................... SUCCESS [4.874s]
[INFO] Apache Aries Subsystem OBR ........................ SUCCESS [0.632s]
[INFO] Apache Aries Subsystem iTests interfaces bundle ... SUCCESS [0.120s]
[INFO] Apache Aries Subsystem iTests ..................... SUCCESS [4.491s]
[INFO] Apache Aries Subsystems Bundle .................... SUCCESS [1.862s]
[INFO] Apache Aries Subsystem ............................ SUCCESS [0.015s]
[INFO] Aries EJB Modelling Integration ................... SUCCESS [13.364s]
[INFO] Aries EJB Modelling iTests ........................ SUCCESS [16.953s]
[INFO] Aries OpenEJB Runtime Extender .................... SUCCESS [1.178s]
[INFO] Aries EJB Extender iTests ......................... SUCCESS [3.735s]
[INFO] Aries EJB Component ............................... SUCCESS [0.015s]
[INFO] Apache Aries JMX API .............................. SUCCESS [0.459s]
[INFO] Apache Aries JMX Blueprint API .................... SUCCESS [0.376s]
[INFO] Apache Aries JMX Core ............................. SUCCESS [1.719s]
[INFO] Apache Aries JMX Core via Whiteboards ............. SUCCESS [0.691s]
[INFO] Apache Aries Whiteboard support for JMX DynamicMBean services  SUCCESS [20.382s]
[INFO] Apache Aries JMX Blueprint Core ................... SUCCESS [5.759s]
[INFO] Apache Aries JMX Bundle ........................... SUCCESS [0.301s]
[INFO] Apache Aries JMX Blueprint Bundle ................. SUCCESS [1.566s]
[INFO] Apache Aries JMX integration tests ................ SUCCESS [0.628s]
[INFO] Apache Aries JMX .................................. SUCCESS [0.016s]
[INFO] Aries JPA Container API ........................... SUCCESS [0.177s]
[INFO] Aries JPA Container ............................... FAILURE [1.137s]
[INFO] Aries JPA Container Managed Contexts .............. SKIPPED
[INFO] Aries JPA Container blueprint integration for Aries blueprint  SKIPPED
[INFO] Test Bundle for Aries JPA Container iTests ........ SKIPPED
[INFO] Test Bundle for Aries JPA Container advanced iTests  SKIPPED
[INFO] Aries JPA iTests .................................. SKIPPED
[INFO] Test Bundle for Aries JPA Blueprint iTests ........ SKIPPED
[INFO] Aries JPA Component ............................... SKIPPED
[INFO] Apache Aries SPI Fly Core (internal module) ....... SKIPPED
[INFO] Apache Aries SPI Fly Weaver (internal module) ..... SKIPPED
[INFO] Apache Aries SPI Fly Dynamic Weaving Bundle ....... SKIPPED
[INFO] Apache Aries SPI Fly Static Weaving Tool .......... SKIPPED
[INFO] Apache Aries SPI Fly Static Weaving Bundle ........ SKIPPED
[INFO] Apache Aries SPI Fly Examples ..................... SKIPPED
[INFO] Apache Aries Example SPI Interface ................ SKIPPED
[INFO] Apache Aries Example SPI Provider Jar 1 ........... SKIPPED
[INFO] Apache Aries Example SPI Provider Bundle 1 ........ SKIPPED
[INFO] Apache Aries Example SPI Provider Bundle 2 ........ SKIPPED
[INFO] Apache Aries Example SPI Client Jar 1 ............. SKIPPED
[INFO] Apache Aries Example SPI Client Bundle 1 .......... SKIPPED
[INFO] Apache Aries Example SPI Client Bundle 2 .......... SKIPPED
[INFO] Apache Aries Example SPI Provider Consumer Bundle . SKIPPED
[INFO] Apache Aries Example Resource Provider Bundle ..... SKIPPED
[INFO] Apache Aries Example Resource Client Bundle ....... SKIPPED
[INFO] Apache Aries SPI Fly .............................. SKIPPED
[INFO] Apache Aries Samples .............................. SKIPPED
[INFO] Apache Aries blog sample .......................... SKIPPED
[INFO] Apache Aries blog sample API ...................... SKIPPED
[INFO] Apache Aries blog sample transaction enlisting JDBC datasource  SKIPPED
[INFO] Apache Aries blog sample assembly ................. SKIPPED
[INFO] Apache Aries blog sample .......................... SKIPPED
[INFO] Apache Aries blog sample web component ............ SKIPPED
[INFO] Apache Aries blog sample persistence .............. SKIPPED
[INFO] Apache Aries Blog Sample EBA using JDBC ........... SKIPPED
[INFO] Apache Aries blog sample persistence .............. SKIPPED
[INFO] Apache Aries Blog Sample EBA using JPA ............ SKIPPED
[INFO] Apache Aries blog sample commenting EJB ........... SKIPPED
[INFO] Apache Aries Blog sample iTests ................... SKIPPED
[INFO] AriesTrader :: Performance Benchmark Sample ....... SKIPPED
[INFO] AriesTrader :: Modules ............................ SKIPPED
[INFO] AriesTrader :: Modules - Util ..................... SKIPPED
[INFO] AriesTrader :: Modules - API ...................... SKIPPED
[INFO] AriesTrader :: Modules - Core ..................... SKIPPED
[INFO] AriesTrader :: Modules - Web ...................... SKIPPED
[INFO] AriesTrader :: Modules - Beans .................... SKIPPED
[INFO] AriesTrader :: Modules - Entities ................. SKIPPED
[INFO] AriesTrader :: Modules - Derby DataSource ......... SKIPPED
[INFO] AriesTrader :: Modules - Persist JDBC ............. SKIPPED
[INFO] AriesTrader :: Modules - Persist JPA App Managed .. SKIPPED
[INFO] AriesTrader :: Modules - Persist JPA Container Managed  SKIPPED
[INFO] AriesTrader :: Assemblies ......................... SKIPPED
[INFO] AriesTrader :: Assemblies - EBA - JDBC ............ SKIPPED
[INFO] AriesTrader :: Assemblies - EBA - ALL ............. SKIPPED
[INFO] Equinox test harness that can be used to install sample EBAs  SKIPPED
[INFO] Apache Aries Blueprint samples .................... SKIPPED
[INFO] Apache Aries Blueprint HelloWorld ................. SKIPPED
[INFO] Apache Aries Blueprint HelloWorld API ............. SKIPPED
[INFO] Apache Aries Blueprint HelloWorldServer ........... SKIPPED
[INFO] Apache Aries Blueprint HelloWorldClient ........... SKIPPED
[INFO] Apache Aries Blueprint HelloWorld Assembly ........ SKIPPED
[INFO] Apache Aries Blueprint HelloWorld EBA ............. SKIPPED
[INFO] Apache Aries Blueprint sample iTests .............. SKIPPED
[INFO] Apache Aries Blueprint Sample - ID Verifier ....... SKIPPED
[INFO] Apache Aries Blueprint Sample - ID Verifier API ... SKIPPED
[INFO] Apache Aries Blueprint Sample - ID Verifier Server  SKIPPED
[INFO] Apache Aries Blueprint Sample - ID Verifier Client  SKIPPED
[INFO] Apache Aries Blueprint Sample - ID Verifier Assembly  SKIPPED
[INFO] Apache Aries Twitter sample ....................... SKIPPED
[INFO] Apache Aries Bundlise Twitter4j ................... SKIPPED
[INFO] Apache Aries Twitter bundle ....................... SKIPPED
[INFO] Apache Aries Twitter EBA .......................... SKIPPED
[INFO] Apache Aries Twitter sample integration tests ..... SKIPPED
[INFO] Apache Aries ...................................... SKIPPED
[INFO] ------------------------------------------------------------------------
[INFO] BUILD FAILURE
[INFO] ------------------------------------------------------------------------
[INFO] Total time: 5:10.956s
[INFO] Finished at: Wed Jun 04 19:24:50 UTC 2014
[INFO] Final Memory: 114M/596M
[INFO] ------------------------------------------------------------------------
[ERROR] Failed to execute goal org.apache.maven.plugins:maven-compiler-plugin:3.1:compile
(default-compile) on project org.apache.aries.jpa.container: Compilation failure: Compilation
failure:
[ERROR] <https://builds.apache.org/job/AriesWithSnapshotDependencies/ws/aries-current-snapshots/jpa/jpa-container/src/main/java/org/apache/aries/jpa/container/tx/impl/ConnectionWrapper.java>:[164,19]
cannot find symbol
[ERROR] symbol  : method setSchema(java.lang.String)
[ERROR] location: interface java.sql.Connection
[ERROR] <https://builds.apache.org/job/AriesWithSnapshotDependencies/ws/aries-current-snapshots/jpa/jpa-container/src/main/java/org/apache/aries/jpa/container/tx/impl/ConnectionWrapper.java>:[162,5]
method does not override or implement a method from a supertype
[ERROR] <https://builds.apache.org/job/AriesWithSnapshotDependencies/ws/aries-current-snapshots/jpa/jpa-container/src/main/java/org/apache/aries/jpa/container/tx/impl/ConnectionWrapper.java>:[169,26]
cannot find symbol
[ERROR] symbol  : method getSchema()
[ERROR] location: interface java.sql.Connection
[ERROR] <https://builds.apache.org/job/AriesWithSnapshotDependencies/ws/aries-current-snapshots/jpa/jpa-container/src/main/java/org/apache/aries/jpa/container/tx/impl/ConnectionWrapper.java>:[167,5]
method does not override or implement a method from a supertype
[ERROR] <https://builds.apache.org/job/AriesWithSnapshotDependencies/ws/aries-current-snapshots/jpa/jpa-container/src/main/java/org/apache/aries/jpa/container/tx/impl/ConnectionWrapper.java>:[174,19]
cannot find symbol
[ERROR] symbol  : method abort(java.util.concurrent.Executor)
[ERROR] location: interface java.sql.Connection
[ERROR] <https://builds.apache.org/job/AriesWithSnapshotDependencies/ws/aries-current-snapshots/jpa/jpa-container/src/main/java/org/apache/aries/jpa/container/tx/impl/ConnectionWrapper.java>:[172,5]
method does not override or implement a method from a supertype
[ERROR] <https://builds.apache.org/job/AriesWithSnapshotDependencies/ws/aries-current-snapshots/jpa/jpa-container/src/main/java/org/apache/aries/jpa/container/tx/impl/ConnectionWrapper.java>:[179,19]
cannot find symbol
[ERROR] symbol  : method setNetworkTimeout(java.util.concurrent.Executor,int)
[ERROR] location: interface java.sql.Connection
[ERROR] <https://builds.apache.org/job/AriesWithSnapshotDependencies/ws/aries-current-snapshots/jpa/jpa-container/src/main/java/org/apache/aries/jpa/container/tx/impl/ConnectionWrapper.java>:[177,5]
method does not override or implement a method from a supertype
[ERROR] <https://builds.apache.org/job/AriesWithSnapshotDependencies/ws/aries-current-snapshots/jpa/jpa-container/src/main/java/org/apache/aries/jpa/container/tx/impl/ConnectionWrapper.java>:[184,26]
cannot find symbol
[ERROR] symbol  : method getNetworkTimeout()
[ERROR] location: interface java.sql.Connection
[ERROR] <https://builds.apache.org/job/AriesWithSnapshotDependencies/ws/aries-current-snapshots/jpa/jpa-container/src/main/java/org/apache/aries/jpa/container/tx/impl/ConnectionWrapper.java>:[182,5]
method does not override or implement a method from a supertype
[ERROR] <https://builds.apache.org/job/AriesWithSnapshotDependencies/ws/aries-current-snapshots/jpa/jpa-container/src/main/java/org/apache/aries/jpa/container/tx/impl/XADatasourceEnlistingWrapper.java>:[158,5]
method does not override or implement a method from a supertype
[ERROR] <https://builds.apache.org/job/AriesWithSnapshotDependencies/ws/aries-current-snapshots/jpa/jpa-container/src/main/java/org/apache/aries/jpa/container/unit/impl/JndiDataSource.java>:[93,3]
method does not override or implement a method from a supertype
[ERROR] <https://builds.apache.org/job/AriesWithSnapshotDependencies/ws/aries-current-snapshots/jpa/jpa-container/src/main/java/org/apache/aries/jpa/container/unit/impl/DataSourceFactoryDataSource.java>:[131,3]
method does not override or implement a method from a supertype
[ERROR] -> [Help 1]
org.apache.maven.lifecycle.LifecycleExecutionException: Failed to execute goal org.apache.maven.plugins:maven-compiler-plugin:3.1:compile
(default-compile) on project org.apache.aries.jpa.container: Compilation failure
	at org.apache.maven.lifecycle.internal.MojoExecutor.execute(MojoExecutor.java:213)
	at org.apache.maven.lifecycle.internal.MojoExecutor.execute(MojoExecutor.java:153)
	at org.apache.maven.lifecycle.internal.MojoExecutor.execute(MojoExecutor.java:145)
	at org.apache.maven.lifecycle.internal.LifecycleModuleBuilder.buildProject(LifecycleModuleBuilder.java:84)
	at org.apache.maven.lifecycle.internal.LifecycleModuleBuilder.buildProject(LifecycleModuleBuilder.java:59)
	at org.apache.maven.lifecycle.internal.LifecycleStarter.singleThreadedBuild(LifecycleStarter.java:183)
	at org.apache.maven.lifecycle.internal.LifecycleStarter.execute(LifecycleStarter.java:161)
	at org.apache.maven.DefaultMaven.doExecute(DefaultMaven.java:319)
	at org.apache.maven.DefaultMaven.execute(DefaultMaven.java:156)
	at org.apache.maven.cli.MavenCli.execute(MavenCli.java:537)
	at org.apache.maven.cli.MavenCli.doMain(MavenCli.java:196)
	at org.apache.maven.cli.MavenCli.main(MavenCli.java:141)
	at sun.reflect.NativeMethodAccessorImpl.invoke0(Native Method)
	at sun.reflect.NativeMethodAccessorImpl.invoke(NativeMethodAccessorImpl.java:39)
	at sun.reflect.DelegatingMethodAccessorImpl.invoke(DelegatingMethodAccessorImpl.java:25)
	at java.lang.reflect.Method.invoke(Method.java:597)
	at org.codehaus.plexus.classworlds.launcher.Launcher.launchEnhanced(Launcher.java:290)
	at org.codehaus.plexus.classworlds.launcher.Launcher.launch(Launcher.java:230)
	at org.codehaus.plexus.classworlds.launcher.Launcher.mainWithExitCode(Launcher.java:409)
	at org.codehaus.plexus.classworlds.launcher.Launcher.main(Launcher.java:352)
Caused by: org.apache.maven.plugin.compiler.CompilationFailureException: Compilation failure
	at org.apache.maven.plugin.compiler.AbstractCompilerMojo.execute(AbstractCompilerMojo.java:858)
	at org.apache.maven.plugin.compiler.CompilerMojo.execute(CompilerMojo.java:129)
	at org.apache.maven.plugin.DefaultBuildPluginManager.executeMojo(DefaultBuildPluginManager.java:101)
	at org.apache.maven.lifecycle.internal.MojoExecutor.execute(MojoExecutor.java:209)
	... 19 more
[ERROR] 
[ERROR] Re-run Maven using the -X switch to enable full debug logging.
[ERROR] 
[ERROR] For more information about the errors and possible solutions, please read the following
articles:
[ERROR] [Help 1] http://cwiki.apache.org/confluence/display/MAVEN/MojoFailureException
[ERROR] 
[ERROR] After correcting the problems, you can resume the build with the command
[ERROR]   mvn <goals> -rf :org.apache.aries.jpa.container
Build step 'Invoke top-level Maven targets' marked build as failure

Mime
View raw message