aries-dev mailing list archives

Site index · List index
Message view « Date » · « Thread »
Top « Date » · « Thread »
From Apache Jenkins Server <jenk...@builds.apache.org>
Subject Build failed in Jenkins: AriesWithSnapshotDependencies #507
Date Thu, 19 Jun 2014 07:40:37 GMT
See <https://builds.apache.org/job/AriesWithSnapshotDependencies/507/changes>

Changes:

[gnodet] [ARIES-1216] Error when creating proxies with an invisible super class in the hierarchy

------------------------------------------
[...truncated 6307 lines...]
A         jpa/jpa-container-testbundle-eclipselink/src/main/java/org/apache/aries/jpa/container/itest/entities
A         jpa/jpa-container-testbundle-eclipselink/src/main/java/org/apache/aries/jpa/container/itest/entities/Car.java
A         jpa/jpa-container-testbundle-eclipselink/src/main/java/org/apache/aries/jpa/container/itest/entities/packageinfo
A         jpa/jpa-container-testbundle-eclipselink/src/main/resources
A         jpa/jpa-container-testbundle-eclipselink/src/main/resources/OSGI-INF
A         jpa/jpa-container-testbundle-eclipselink/src/main/resources/OSGI-INF/blueprint
A         jpa/jpa-container-testbundle-eclipselink/src/main/resources/OSGI-INF/blueprint/config.xml
A         jpa/jpa-container-testbundle-eclipselink/src/main/resources/META-INF
A         jpa/jpa-container-testbundle-eclipselink/src/main/resources/META-INF/persistence.xml
A         jpa/jpa-container-testbundle-eclipselink/pom.xml
AU        jpa/LICENSE
A         jpa/jpa-blueprint-testbundle
A         jpa/jpa-blueprint-testbundle/LICENSE
A         jpa/jpa-blueprint-testbundle/.gitignore
A         jpa/jpa-blueprint-testbundle/src
A         jpa/jpa-blueprint-testbundle/src/main
A         jpa/jpa-blueprint-testbundle/src/main/resources
A         jpa/jpa-blueprint-testbundle/src/main/resources/OSGI-INF
A         jpa/jpa-blueprint-testbundle/src/main/resources/OSGI-INF/blueprint
AU        jpa/jpa-blueprint-testbundle/src/main/resources/OSGI-INF/blueprint/injection.xml
A         jpa/jpa-blueprint-testbundle/src/main/resources/OSGI-INF/blueprint/injection2.xml
A         jpa/jpa-blueprint-testbundle/src/main/resources/OSGI-INF/persistence
AU        jpa/jpa-blueprint-testbundle/src/main/resources/OSGI-INF/persistence/persistence.xml
A         jpa/jpa-blueprint-testbundle/src/main/java
A         jpa/jpa-blueprint-testbundle/src/main/java/org
A         jpa/jpa-blueprint-testbundle/src/main/java/org/apache
A         jpa/jpa-blueprint-testbundle/src/main/java/org/apache/aries
A         jpa/jpa-blueprint-testbundle/src/main/java/org/apache/aries/jpa
A         jpa/jpa-blueprint-testbundle/src/main/java/org/apache/aries/jpa/blueprint
A         jpa/jpa-blueprint-testbundle/src/main/java/org/apache/aries/jpa/blueprint/itest
A         jpa/jpa-blueprint-testbundle/src/main/java/org/apache/aries/jpa/blueprint/itest/entities
AU        jpa/jpa-blueprint-testbundle/src/main/java/org/apache/aries/jpa/blueprint/itest/entities/Car.java
A         jpa/jpa-blueprint-testbundle/src/main/java/org/apache/aries/jpa/blueprint/itest/entities/packageinfo
AU        jpa/jpa-blueprint-testbundle/src/main/java/org/apache/aries/jpa/blueprint/itest/JPATestBean.java
AU        jpa/jpa-blueprint-testbundle/pom.xml
A         jpa/jpa-blueprint-testbundle/NOTICE
A         jpa/jpa-container-advancedtestbundle
A         jpa/jpa-container-advancedtestbundle/NOTICE
A         jpa/jpa-container-advancedtestbundle/LICENSE
A         jpa/jpa-container-advancedtestbundle/.gitignore
A         jpa/jpa-container-advancedtestbundle/src
A         jpa/jpa-container-advancedtestbundle/src/main
A         jpa/jpa-container-advancedtestbundle/src/main/resources
A         jpa/jpa-container-advancedtestbundle/src/main/resources/META-INF
A         jpa/jpa-container-advancedtestbundle/src/main/resources/META-INF/persistence.xml
A         jpa/jpa-container-advancedtestbundle/src/main/java
A         jpa/jpa-container-advancedtestbundle/src/main/java/org
A         jpa/jpa-container-advancedtestbundle/src/main/java/org/apache
A         jpa/jpa-container-advancedtestbundle/src/main/java/org/apache/aries
A         jpa/jpa-container-advancedtestbundle/src/main/java/org/apache/aries/jpa
A         jpa/jpa-container-advancedtestbundle/src/main/java/org/apache/aries/jpa/container
A         jpa/jpa-container-advancedtestbundle/src/main/java/org/apache/aries/jpa/container/advanced
A         jpa/jpa-container-advancedtestbundle/src/main/java/org/apache/aries/jpa/container/advanced/itest
A         jpa/jpa-container-advancedtestbundle/src/main/java/org/apache/aries/jpa/container/advanced/itest/bundle
A         jpa/jpa-container-advancedtestbundle/src/main/java/org/apache/aries/jpa/container/advanced/itest/bundle/entities
A         jpa/jpa-container-advancedtestbundle/src/main/java/org/apache/aries/jpa/container/advanced/itest/bundle/entities/Car.java
A         jpa/jpa-container-advancedtestbundle/src/main/java/org/apache/aries/jpa/container/advanced/itest/bundle/entities/packageinfo
A         jpa/jpa-container-advancedtestbundle/pom.xml
A         jpa/jpa-container-eclipselink-adapter
A         jpa/jpa-container-eclipselink-adapter/src
A         jpa/jpa-container-eclipselink-adapter/src/main
A         jpa/jpa-container-eclipselink-adapter/src/main/resources
A         jpa/jpa-container-eclipselink-adapter/src/main/resources/org
A         jpa/jpa-container-eclipselink-adapter/src/main/resources/org/apache
A         jpa/jpa-container-eclipselink-adapter/src/main/resources/org/apache/aries
A         jpa/jpa-container-eclipselink-adapter/src/main/resources/org/apache/aries/jpa
A         jpa/jpa-container-eclipselink-adapter/src/main/resources/org/apache/aries/jpa/eclipselink
A         jpa/jpa-container-eclipselink-adapter/src/main/resources/org/apache/aries/jpa/eclipselink/adapter
AU        jpa/jpa-container-eclipselink-adapter/src/main/resources/org/apache/aries/jpa/eclipselink/adapter/jpaEclipseLinkAdapter.properties
A         jpa/jpa-container-eclipselink-adapter/src/main/java
A         jpa/jpa-container-eclipselink-adapter/src/main/java/org
A         jpa/jpa-container-eclipselink-adapter/src/main/java/org/apache
A         jpa/jpa-container-eclipselink-adapter/src/main/java/org/apache/aries
A         jpa/jpa-container-eclipselink-adapter/src/main/java/org/apache/aries/jpa
A         jpa/jpa-container-eclipselink-adapter/src/main/java/org/apache/aries/jpa/eclipselink
A         jpa/jpa-container-eclipselink-adapter/src/main/java/org/apache/aries/jpa/eclipselink/adapter
A         jpa/jpa-container-eclipselink-adapter/src/main/java/org/apache/aries/jpa/eclipselink/adapter/Activator.java
A         jpa/jpa-container-eclipselink-adapter/src/main/java/org/apache/aries/jpa/eclipselink/adapter/EclipseLinkProviderService.java
A         jpa/jpa-container-eclipselink-adapter/src/main/java/org/apache/aries/jpa/eclipselink/adapter/PersistenceUnitProxyWithTargetServer.java
A         jpa/jpa-container-eclipselink-adapter/src/main/java/org/apache/aries/jpa/eclipselink/adapter/platform
A         jpa/jpa-container-eclipselink-adapter/src/main/java/org/apache/aries/jpa/eclipselink/adapter/platform/OSGiTSWrapper.java
A         jpa/jpa-container-eclipselink-adapter/src/main/java/org/apache/aries/jpa/eclipselink/adapter/platform/OSGiTSServer.java
A         jpa/jpa-container-eclipselink-adapter/src/main/java/org/apache/aries/jpa/eclipselink/adapter/UnionClassLoader.java
A         jpa/jpa-container-eclipselink-adapter/pom.xml
A         testsupport
A         testsupport/testsupport-unit
A         testsupport/testsupport-unit/LICENSE
A         testsupport/testsupport-unit/src
A         testsupport/testsupport-unit/src/main
A         testsupport/testsupport-unit/src/main/java
A         testsupport/testsupport-unit/src/main/java/org
A         testsupport/testsupport-unit/src/main/java/org/apache
A         testsupport/testsupport-unit/src/main/java/org/apache/aries
A         testsupport/testsupport-unit/src/main/java/org/apache/aries/itest
A         testsupport/testsupport-unit/src/main/java/org/apache/aries/itest/RichBundleContext.java
A         testsupport/testsupport-unit/src/main/java/org/apache/aries/itest/AbstractIntegrationTest.java
A         testsupport/testsupport-unit/src/main/java/org/apache/aries/itest/packageinfo
A         testsupport/testsupport-unit/src/main/java/org/apache/aries/mocks
AU        testsupport/testsupport-unit/src/main/java/org/apache/aries/mocks/BundleMock.java
AU        testsupport/testsupport-unit/src/main/java/org/apache/aries/mocks/MockInitialContextFactoryBuilder.java
A         testsupport/testsupport-unit/src/main/java/org/apache/aries/mocks/packageinfo
AU        testsupport/testsupport-unit/src/main/java/org/apache/aries/mocks/BundleContextMock.java
A         testsupport/testsupport-unit/src/main/java/org/apache/aries/unittest
A         testsupport/testsupport-unit/src/main/java/org/apache/aries/unittest/mocks
AU        testsupport/testsupport-unit/src/main/java/org/apache/aries/unittest/mocks/MethodCallHandler.java
AU        testsupport/testsupport-unit/src/main/java/org/apache/aries/unittest/mocks/DefaultInvocationHandler.java
AU        testsupport/testsupport-unit/src/main/java/org/apache/aries/unittest/mocks/MethodCall.java
A         testsupport/testsupport-unit/src/main/java/org/apache/aries/unittest/mocks/annotations
A         testsupport/testsupport-unit/src/main/java/org/apache/aries/unittest/mocks/annotations/packageinfo
AU        testsupport/testsupport-unit/src/main/java/org/apache/aries/unittest/mocks/annotations/InjectSkeleton.java
AU        testsupport/testsupport-unit/src/main/java/org/apache/aries/unittest/mocks/annotations/Singleton.java
AU        testsupport/testsupport-unit/src/main/java/org/apache/aries/unittest/mocks/ReturnTypeHandler.java
AU        testsupport/testsupport-unit/src/main/java/org/apache/aries/unittest/mocks/DefaultMethodCallHandlers.java
AU        testsupport/testsupport-unit/src/main/java/org/apache/aries/unittest/mocks/ExceptionListener.java
AU        testsupport/testsupport-unit/src/main/java/org/apache/aries/unittest/mocks/Skeleton.java
AU        testsupport/testsupport-unit/src/main/java/org/apache/aries/unittest/mocks/DefaultReturnTypeHandlers.java
A         testsupport/testsupport-unit/src/main/java/org/apache/aries/unittest/mocks/packageinfo
A         testsupport/testsupport-unit/src/main/java/org/apache/aries/unittest/fixture
A         testsupport/testsupport-unit/src/main/java/org/apache/aries/unittest/fixture/packageinfo
A         testsupport/testsupport-unit/src/main/java/org/apache/aries/unittest/fixture/ArchiveFixture.java
A         testsupport/testsupport-unit/src/main/java/org/apache/aries/unittest/junit
AU        testsupport/testsupport-unit/src/main/java/org/apache/aries/unittest/junit/Assert.java
A         testsupport/testsupport-unit/src/main/java/org/apache/aries/unittest/junit/packageinfo
AU        testsupport/testsupport-unit/pom.xml
A         testsupport/testsupport-unit/NOTICE
AU        testsupport/pom.xml
A         testsupport/NOTICE
AU        testsupport/LICENSE
 U        .
At revision 1603741
[aries-current-snapshots] $ /home/jenkins/jenkins-slave/tools/hudson.tasks.Maven_MavenInstallation/Maven_3.0.3/bin/mvn
-Dmaven.repo.local=<https://builds.apache.org/job/AriesWithSnapshotDependencies/ws/.repository>
-U -cpu -e -B -f parent/pom.xml clean install
[INFO] Error stacktraces are turned on.
[WARNING] Command line option -cpu is deprecated and will be removed in future Maven versions.
[INFO] Scanning for projects...
Downloading: http://repository.apache.org/snapshots/org/apache/felix/maven-bundle-plugin/2.4.1-SNAPSHOT/maven-metadata.xml
Downloading: http://snapshots.repository.codehaus.org/org/apache/felix/maven-bundle-plugin/2.4.1-SNAPSHOT/maven-metadata.xml
[WARNING] Could not transfer metadata org.apache.felix:maven-bundle-plugin:2.4.1-SNAPSHOT/maven-metadata.xml
from/to Nexus (http://repository.apache.org/snapshots): Error transferring file: Server returned
HTTP response code: 503 for URL: http://repository.apache.org/snapshots/org/apache/felix/maven-bundle-plugin/2.4.1-SNAPSHOT/maven-metadata.xml
Downloading: http://repository.apache.org/snapshots/org/apache/felix/maven-bundle-plugin/2.4.1-SNAPSHOT/maven-metadata.xml
Downloading: http://snapshots.repository.codehaus.org/org/apache/felix/maven-bundle-plugin/2.4.1-SNAPSHOT/maven-metadata.xml
[WARNING] Could not transfer metadata org.apache.felix:maven-bundle-plugin:2.4.1-SNAPSHOT/maven-metadata.xml
from/to Nexus (http://repository.apache.org/snapshots): Error transferring file: Server returned
HTTP response code: 503 for URL: http://repository.apache.org/snapshots/org/apache/felix/maven-bundle-plugin/2.4.1-SNAPSHOT/maven-metadata.xml
Downloading: http://repository.apache.org/snapshots/org/apache/felix/maven-bundle-plugin/2.4.1-SNAPSHOT/maven-bundle-plugin-2.4.1-SNAPSHOT.pom
Downloading: http://snapshots.repository.codehaus.org/org/apache/felix/maven-bundle-plugin/2.4.1-SNAPSHOT/maven-bundle-plugin-2.4.1-SNAPSHOT.pom
[ERROR] The build could not read 1 project -> [Help 1]
org.apache.maven.project.ProjectBuildingException: Some problems were encountered while processing
the POMs:
[ERROR] Unresolveable build extension: Plugin org.apache.felix:maven-bundle-plugin:2.4.1-SNAPSHOT
or one of its dependencies could not be resolved: Failed to collect dependencies for org.apache.felix:maven-bundle-plugin:jar:2.4.1-SNAPSHOT
() @ 

	at org.apache.maven.project.DefaultProjectBuilder.build(DefaultProjectBuilder.java:339)
	at org.apache.maven.DefaultMaven.collectProjects(DefaultMaven.java:632)
	at org.apache.maven.DefaultMaven.getProjectsForMavenReactor(DefaultMaven.java:581)
	at org.apache.maven.DefaultMaven.doExecute(DefaultMaven.java:233)
	at org.apache.maven.DefaultMaven.execute(DefaultMaven.java:156)
	at org.apache.maven.cli.MavenCli.execute(MavenCli.java:537)
	at org.apache.maven.cli.MavenCli.doMain(MavenCli.java:196)
	at org.apache.maven.cli.MavenCli.main(MavenCli.java:141)
	at sun.reflect.NativeMethodAccessorImpl.invoke0(Native Method)
	at sun.reflect.NativeMethodAccessorImpl.invoke(NativeMethodAccessorImpl.java:57)
	at sun.reflect.DelegatingMethodAccessorImpl.invoke(DelegatingMethodAccessorImpl.java:43)
	at java.lang.reflect.Method.invoke(Method.java:606)
	at org.codehaus.plexus.classworlds.launcher.Launcher.launchEnhanced(Launcher.java:290)
	at org.codehaus.plexus.classworlds.launcher.Launcher.launch(Launcher.java:230)
	at org.codehaus.plexus.classworlds.launcher.Launcher.mainWithExitCode(Launcher.java:409)
	at org.codehaus.plexus.classworlds.launcher.Launcher.main(Launcher.java:352)
[ERROR]   
[ERROR]   The project org.apache.aries:parent:1.0.1-SNAPSHOT (/home/hudson/jenkins-slave/workspace/AriesWithSnapshotDependencies/aries-current-snapshots/parent/pom.xml)
has 1 error
[ERROR]     Unresolveable build extension: Plugin org.apache.felix:maven-bundle-plugin:2.4.1-SNAPSHOT
or one of its dependencies could not be resolved: Failed to collect dependencies for org.apache.felix:maven-bundle-plugin:jar:2.4.1-SNAPSHOT
(): Failed to read artifact descriptor for org.apache.felix:maven-bundle-plugin:jar:2.4.1-SNAPSHOT:
Could not transfer artifact org.apache.felix:maven-bundle-plugin:pom:2.4.1-SNAPSHOT from/to
Nexus (http://repository.apache.org/snapshots): Error transferring file: Server returned HTTP
response code: 503 for URL: http://repository.apache.org/snapshots/org/apache/felix/maven-bundle-plugin/2.4.1-SNAPSHOT/maven-bundle-plugin-2.4.1-SNAPSHOT.pom
-> [Help 2]
org.apache.maven.plugin.PluginResolutionException: Plugin org.apache.felix:maven-bundle-plugin:2.4.1-SNAPSHOT
or one of its dependencies could not be resolved: Failed to collect dependencies for org.apache.felix:maven-bundle-plugin:jar:2.4.1-SNAPSHOT
()
	at org.apache.maven.plugin.internal.DefaultPluginDependenciesResolver.resolve(DefaultPluginDependenciesResolver.java:211)
	at org.apache.maven.project.DefaultProjectBuildingHelper.resolveExtensionArtifacts(DefaultProjectBuildingHelper.java:377)
	at org.apache.maven.project.DefaultProjectBuildingHelper.createProjectRealm(DefaultProjectBuildingHelper.java:237)
	at org.apache.maven.project.DefaultModelBuildingListener.buildExtensionsAssembled(DefaultModelBuildingListener.java:106)
	at org.apache.maven.model.building.ModelBuildingEventCatapult$1.fire(ModelBuildingEventCatapult.java:43)
	at org.apache.maven.model.building.DefaultModelBuilder.fireEvent(DefaultModelBuilder.java:1041)
	at org.apache.maven.model.building.DefaultModelBuilder.build(DefaultModelBuilder.java:391)
	at org.apache.maven.model.building.DefaultModelBuilder.build(DefaultModelBuilder.java:374)
	at org.apache.maven.project.DefaultProjectBuilder.build(DefaultProjectBuilder.java:536)
	at org.apache.maven.project.DefaultProjectBuilder.build(DefaultProjectBuilder.java:328)
	at org.apache.maven.DefaultMaven.collectProjects(DefaultMaven.java:632)
	at org.apache.maven.DefaultMaven.getProjectsForMavenReactor(DefaultMaven.java:581)
	at org.apache.maven.DefaultMaven.doExecute(DefaultMaven.java:233)
	at org.apache.maven.DefaultMaven.execute(DefaultMaven.java:156)
	at org.apache.maven.cli.MavenCli.execute(MavenCli.java:537)
	at org.apache.maven.cli.MavenCli.doMain(MavenCli.java:196)
	at org.apache.maven.cli.MavenCli.main(MavenCli.java:141)
	at sun.reflect.NativeMethodAccessorImpl.invoke0(Native Method)
	at sun.reflect.NativeMethodAccessorImpl.invoke(NativeMethodAccessorImpl.java:57)
	at sun.reflect.DelegatingMethodAccessorImpl.invoke(DelegatingMethodAccessorImpl.java:43)
	at java.lang.reflect.Method.invoke(Method.java:606)
	at org.codehaus.plexus.classworlds.launcher.Launcher.launchEnhanced(Launcher.java:290)
	at org.codehaus.plexus.classworlds.launcher.Launcher.launch(Launcher.java:230)
	at org.codehaus.plexus.classworlds.launcher.Launcher.mainWithExitCode(Launcher.java:409)
	at org.codehaus.plexus.classworlds.launcher.Launcher.main(Launcher.java:352)
Caused by: org.sonatype.aether.collection.DependencyCollectionException: Failed to collect
dependencies for org.apache.felix:maven-bundle-plugin:jar:2.4.1-SNAPSHOT ()
	at org.sonatype.aether.impl.internal.DefaultDependencyCollector.collectDependencies(DefaultDependencyCollector.java:202)
	at org.sonatype.aether.impl.internal.DefaultRepositorySystem.collectDependencies(DefaultRepositorySystem.java:345)
	at org.apache.maven.plugin.internal.DefaultPluginDependenciesResolver.resolve(DefaultPluginDependenciesResolver.java:199)
	... 24 more
Caused by: org.sonatype.aether.resolution.ArtifactDescriptorException: Failed to read artifact
descriptor for org.apache.felix:maven-bundle-plugin:jar:2.4.1-SNAPSHOT
	at org.apache.maven.repository.internal.DefaultArtifactDescriptorReader.loadPom(DefaultArtifactDescriptorReader.java:282)
	at org.apache.maven.repository.internal.DefaultArtifactDescriptorReader.readArtifactDescriptor(DefaultArtifactDescriptorReader.java:172)
	at org.sonatype.aether.impl.internal.DefaultDependencyCollector.collectDependencies(DefaultDependencyCollector.java:196)
	... 26 more
Caused by: org.sonatype.aether.resolution.ArtifactResolutionException: Could not transfer
artifact org.apache.felix:maven-bundle-plugin:pom:2.4.1-SNAPSHOT from/to Nexus (http://repository.apache.org/snapshots):
Error transferring file: Server returned HTTP response code: 503 for URL: http://repository.apache.org/snapshots/org/apache/felix/maven-bundle-plugin/2.4.1-SNAPSHOT/maven-bundle-plugin-2.4.1-SNAPSHOT.pom
	at org.sonatype.aether.impl.internal.DefaultArtifactResolver.resolve(DefaultArtifactResolver.java:541)
	at org.sonatype.aether.impl.internal.DefaultArtifactResolver.resolveArtifacts(DefaultArtifactResolver.java:220)
	at org.sonatype.aether.impl.internal.DefaultArtifactResolver.resolveArtifact(DefaultArtifactResolver.java:197)
	at org.apache.maven.repository.internal.DefaultArtifactDescriptorReader.loadPom(DefaultArtifactDescriptorReader.java:267)
	... 28 more
Caused by: org.sonatype.aether.transfer.ArtifactTransferException: Could not transfer artifact
org.apache.felix:maven-bundle-plugin:pom:2.4.1-SNAPSHOT from/to Nexus (http://repository.apache.org/snapshots):
Error transferring file: Server returned HTTP response code: 503 for URL: http://repository.apache.org/snapshots/org/apache/felix/maven-bundle-plugin/2.4.1-SNAPSHOT/maven-bundle-plugin-2.4.1-SNAPSHOT.pom
	at org.sonatype.aether.connector.wagon.WagonRepositoryConnector$4.wrap(WagonRepositoryConnector.java:949)
	at org.sonatype.aether.connector.wagon.WagonRepositoryConnector$4.wrap(WagonRepositoryConnector.java:940)
	at org.sonatype.aether.connector.wagon.WagonRepositoryConnector$GetTask.flush(WagonRepositoryConnector.java:695)
	at org.sonatype.aether.connector.wagon.WagonRepositoryConnector$GetTask.flush(WagonRepositoryConnector.java:689)
	at org.sonatype.aether.connector.wagon.WagonRepositoryConnector.get(WagonRepositoryConnector.java:445)
	at org.sonatype.aether.impl.internal.DefaultArtifactResolver.resolve(DefaultArtifactResolver.java:460)
	... 31 more
Caused by: org.apache.maven.wagon.TransferFailedException: Error transferring file: Server
returned HTTP response code: 503 for URL: http://repository.apache.org/snapshots/org/apache/felix/maven-bundle-plugin/2.4.1-SNAPSHOT/maven-bundle-plugin-2.4.1-SNAPSHOT.pom
	at org.apache.maven.wagon.providers.http.LightweightHttpWagon.fillInputData(LightweightHttpWagon.java:143)
	at org.apache.maven.wagon.StreamWagon.getInputStream(StreamWagon.java:116)
	at org.apache.maven.wagon.StreamWagon.getIfNewer(StreamWagon.java:88)
	at org.apache.maven.wagon.StreamWagon.get(StreamWagon.java:61)
	at org.sonatype.aether.connector.wagon.WagonRepositoryConnector$GetTask.run(WagonRepositoryConnector.java:608)
	at org.sonatype.aether.util.concurrency.RunnableErrorForwarder$1.run(RunnableErrorForwarder.java:64)
	at java.util.concurrent.ThreadPoolExecutor.runWorker(ThreadPoolExecutor.java:1145)
	at java.util.concurrent.ThreadPoolExecutor$Worker.run(ThreadPoolExecutor.java:615)
	at java.lang.Thread.run(Thread.java:724)
Caused by: java.io.IOException: Server returned HTTP response code: 503 for URL: http://repository.apache.org/snapshots/org/apache/felix/maven-bundle-plugin/2.4.1-SNAPSHOT/maven-bundle-plugin-2.4.1-SNAPSHOT.pom
	at sun.reflect.NativeConstructorAccessorImpl.newInstance0(Native Method)
	at sun.reflect.NativeConstructorAccessorImpl.newInstance(NativeConstructorAccessorImpl.java:57)
	at sun.reflect.DelegatingConstructorAccessorImpl.newInstance(DelegatingConstructorAccessorImpl.java:45)
	at java.lang.reflect.Constructor.newInstance(Constructor.java:526)
	at sun.net.www.protocol.http.HttpURLConnection$6.run(HttpURLConnection.java:1674)
	at sun.net.www.protocol.http.HttpURLConnection$6.run(HttpURLConnection.java:1672)
	at java.security.AccessController.doPrivileged(Native Method)
	at sun.net.www.protocol.http.HttpURLConnection.getChainedException(HttpURLConnection.java:1670)
	at sun.net.www.protocol.http.HttpURLConnection.getInputStream(HttpURLConnection.java:1243)
	at org.apache.maven.wagon.providers.http.LightweightHttpWagon.fillInputData(LightweightHttpWagon.java:122)
	... 8 more
Caused by: java.io.IOException: Server returned HTTP response code: 503 for URL: http://repository.apache.org/snapshots/org/apache/felix/maven-bundle-plugin/2.4.1-SNAPSHOT/maven-bundle-plugin-2.4.1-SNAPSHOT.pom
	at sun.net.www.protocol.http.HttpURLConnection.getInputStream(HttpURLConnection.java:1625)
	at java.net.HttpURLConnection.getResponseCode(HttpURLConnection.java:468)
	at org.apache.maven.wagon.providers.http.LightweightHttpWagon.fillInputData(LightweightHttpWagon.java:115)
	... 8 more
[ERROR] 
[ERROR] Re-run Maven using the -X switch to enable full debug logging.
[ERROR] 
[ERROR] For more information about the errors and possible solutions, please read the following
articles:
[ERROR] [Help 1] http://cwiki.apache.org/confluence/display/MAVEN/ProjectBuildingException
[ERROR] [Help 2] http://cwiki.apache.org/confluence/display/MAVEN/PluginResolutionException
Build step 'Invoke top-level Maven targets' marked build as failure

Mime
View raw message