aries-dev mailing list archives

Site index · List index
Message view « Date » · « Thread »
Top « Date » · « Thread »
From Apache Jenkins Server <jenk...@builds.apache.org>
Subject Build failed in Jenkins: Aries » Aries JPA Container #1948
Date Thu, 05 Jun 2014 00:36:37 GMT
See <https://builds.apache.org/job/Aries/org.apache.aries.jpa$org.apache.aries.jpa.container/1948/>

------------------------------------------
[INFO]                                                                         
[INFO] ------------------------------------------------------------------------
[INFO] Building Aries JPA Container 1.0.1-SNAPSHOT
[INFO] ------------------------------------------------------------------------
[INFO] 
[INFO] --- maven-clean-plugin:2.5:clean (default-clean) @ org.apache.aries.jpa.container ---
[INFO] 
[INFO] --- maven-enforcer-plugin:1.3.1:enforce (default) @ org.apache.aries.jpa.container
---
[INFO] 
[INFO] --- maven-remote-resources-plugin:1.5:process (default) @ org.apache.aries.jpa.container
---
[INFO] 
[INFO] --- maven-resources-plugin:2.6:resources (default-resources) @ org.apache.aries.jpa.container
---
[INFO] Using 'UTF-8' encoding to copy filtered resources.
[INFO] Copying 3 resources
[INFO] skip non existing resourceDirectory <https://builds.apache.org/job/Aries/org.apache.aries.jpa$org.apache.aries.jpa.container/ws/src/main/filtered-resources>
[INFO] Copying 0 resource
[INFO] Copying 3 resources
[INFO] 
[INFO] --- maven-compiler-plugin:3.1:compile (default-compile) @ org.apache.aries.jpa.container
---
[INFO] Changes detected - recompiling the module!
[INFO] Compiling 35 source files to <https://builds.apache.org/job/Aries/org.apache.aries.jpa$org.apache.aries.jpa.container/ws/target/classes>
[INFO] -------------------------------------------------------------
[WARNING] COMPILATION WARNING : 
[INFO] -------------------------------------------------------------
[WARNING] Note: Some input files use unchecked or unsafe operations.
[WARNING] Note: Recompile with -Xlint:unchecked for details.
[INFO] 2 warnings 
[INFO] -------------------------------------------------------------
[INFO] -------------------------------------------------------------
[ERROR] COMPILATION ERROR : 
[INFO] -------------------------------------------------------------
[ERROR] <https://builds.apache.org/job/Aries/org.apache.aries.jpa$org.apache.aries.jpa.container/ws/src/main/java/org/apache/aries/jpa/container/tx/impl/XADatasourceEnlistingWrapper.java>:[158,5]
method does not override or implement a method from a supertype
[ERROR] <https://builds.apache.org/job/Aries/org.apache.aries.jpa$org.apache.aries.jpa.container/ws/src/main/java/org/apache/aries/jpa/container/unit/impl/DataSourceFactoryDataSource.java>:[131,3]
method does not override or implement a method from a supertype
[ERROR] <https://builds.apache.org/job/Aries/org.apache.aries.jpa$org.apache.aries.jpa.container/ws/src/main/java/org/apache/aries/jpa/container/tx/impl/ConnectionWrapper.java>:[164,19]
cannot find symbol
symbol  : method setSchema(java.lang.String)
location: interface java.sql.Connection
[ERROR] <https://builds.apache.org/job/Aries/org.apache.aries.jpa$org.apache.aries.jpa.container/ws/src/main/java/org/apache/aries/jpa/container/tx/impl/ConnectionWrapper.java>:[162,5]
method does not override or implement a method from a supertype
[ERROR] <https://builds.apache.org/job/Aries/org.apache.aries.jpa$org.apache.aries.jpa.container/ws/src/main/java/org/apache/aries/jpa/container/tx/impl/ConnectionWrapper.java>:[169,26]
cannot find symbol
symbol  : method getSchema()
location: interface java.sql.Connection
[ERROR] <https://builds.apache.org/job/Aries/org.apache.aries.jpa$org.apache.aries.jpa.container/ws/src/main/java/org/apache/aries/jpa/container/tx/impl/ConnectionWrapper.java>:[167,5]
method does not override or implement a method from a supertype
[ERROR] <https://builds.apache.org/job/Aries/org.apache.aries.jpa$org.apache.aries.jpa.container/ws/src/main/java/org/apache/aries/jpa/container/tx/impl/ConnectionWrapper.java>:[174,19]
cannot find symbol
symbol  : method abort(java.util.concurrent.Executor)
location: interface java.sql.Connection
[ERROR] <https://builds.apache.org/job/Aries/org.apache.aries.jpa$org.apache.aries.jpa.container/ws/src/main/java/org/apache/aries/jpa/container/tx/impl/ConnectionWrapper.java>:[172,5]
method does not override or implement a method from a supertype
[ERROR] <https://builds.apache.org/job/Aries/org.apache.aries.jpa$org.apache.aries.jpa.container/ws/src/main/java/org/apache/aries/jpa/container/tx/impl/ConnectionWrapper.java>:[179,19]
cannot find symbol
symbol  : method setNetworkTimeout(java.util.concurrent.Executor,int)
location: interface java.sql.Connection
[ERROR] <https://builds.apache.org/job/Aries/org.apache.aries.jpa$org.apache.aries.jpa.container/ws/src/main/java/org/apache/aries/jpa/container/tx/impl/ConnectionWrapper.java>:[177,5]
method does not override or implement a method from a supertype
[ERROR] <https://builds.apache.org/job/Aries/org.apache.aries.jpa$org.apache.aries.jpa.container/ws/src/main/java/org/apache/aries/jpa/container/tx/impl/ConnectionWrapper.java>:[184,26]
cannot find symbol
symbol  : method getNetworkTimeout()
location: interface java.sql.Connection
[ERROR] <https://builds.apache.org/job/Aries/org.apache.aries.jpa$org.apache.aries.jpa.container/ws/src/main/java/org/apache/aries/jpa/container/tx/impl/ConnectionWrapper.java>:[182,5]
method does not override or implement a method from a supertype
[ERROR] <https://builds.apache.org/job/Aries/org.apache.aries.jpa$org.apache.aries.jpa.container/ws/src/main/java/org/apache/aries/jpa/container/unit/impl/JndiDataSource.java>:[93,3]
method does not override or implement a method from a supertype
[INFO] 13 errors 
[INFO] -------------------------------------------------------------

Mime
View raw message