aries-dev mailing list archives

Site index · List index
Message view « Date » · « Thread »
Top « Date » · « Thread »
From Apache Jenkins Server <jenk...@builds.apache.org>
Subject Build failed in Jenkins: AriesWithSnapshotDependencies #542
Date Fri, 01 Aug 2014 12:52:04 GMT
See <https://builds.apache.org/job/AriesWithSnapshotDependencies/542/changes>

Changes:

[mnuttall] Aries-1234: Recreate JPA 2.0 support

[mnuttall] Aries-1234: Recreate JPA 2.0 support

------------------------------------------
[...truncated 13707 lines...]
[INFO] Apache Aries Util ................................. SUCCESS [12.059s]
[INFO] Apache Aries Util ................................. SUCCESS [0.051s]
[INFO] Apache Aries Proxy API ............................ SUCCESS [0.553s]
[INFO] Apache Aries Proxy Service ........................ SUCCESS [1.798s]
[INFO] Apache Aries Proxy Bundle ......................... SUCCESS [0.575s]
[INFO] Apache Aries Proxy iTests ......................... SUCCESS [1.123s]
[INFO] Apache Aries Class Proxy .......................... SUCCESS [0.038s]
[INFO] Apache Aries Quiesce API .......................... SUCCESS [0.405s]
[INFO] Apache Aries Quiesce Manager ...................... SUCCESS [0.370s]
[INFO] Aries Quiesce Manager iTests ...................... SUCCESS [0.208s]
[INFO] Apache Aries Quiesce .............................. SUCCESS [0.037s]
[INFO] Apache Aries Blueprint API ........................ SUCCESS [0.607s]
[INFO] Apache Aries Blueprint Parser ..................... SUCCESS [0.526s]
[INFO] Apache Aries Blueprint Core ....................... SUCCESS [4.106s]
[INFO] Apache Aries Blueprint CM ......................... SUCCESS [0.750s]
[INFO] Apache Aries Blueprint Bundle ..................... SUCCESS [1.769s]
[INFO] Apache Aries Blueprint Compatiblity Fragment Bundle  SUCCESS [0.189s]
[INFO] Apache Aries Blueprint Core Compatiblity Fragment Bundle  SUCCESS [0.185s]
[INFO] Apache Aries Blueprint no-OSGI .................... SUCCESS [0.616s]
[INFO] Apache Aries Blueprint Web ........................ SUCCESS [0.354s]
[INFO] Apache Aries Blueprint Web OSGI ................... SUCCESS [0.567s]
[INFO] Apache Aries Blueprint JEXL evaluator ............. SUCCESS [0.372s]
[INFO] Apache Aries Blueprint Sample ..................... SUCCESS [0.539s]
[INFO] Apache Aries Blueprint Annotation API ............. SUCCESS [0.304s]
[INFO] Apache Aries Blueprint Annotation Impl ............ SUCCESS [0.768s]
[INFO] Aries :: blueprint :: annotation based authorization  SUCCESS [0.279s]
[INFO] Apache Aries Blueprint Sample for Testing Annotation  SUCCESS [0.542s]
[INFO] Apache Aries Blueprint Sample Fragment for Testing Annotation  SUCCESS [0.527s]
[INFO] Apache Aries Blueprint WAR Sample ................. SUCCESS [0.619s]
[INFO] Apache Aries Blueprint Test Bundle A .............. SUCCESS [0.903s]
[INFO] Apache Aries Blueprint Test Bundle B .............. SUCCESS [0.575s]
[INFO] Apache Aries Blueprint Test Quiesce Bundle ........ SUCCESS [0.562s]
[INFO] Apache Aries Blueprint iTests ..................... SUCCESS [0.728s]
[INFO] Apache Aries Blueprint ............................ SUCCESS [0.040s]
[INFO] Apache Aries JNDI API ............................. SUCCESS [0.334s]
[INFO] Apache Aries JNDI Core ............................ SUCCESS [0.444s]
[INFO] Apache Aries JNDI URL Handler ..................... SUCCESS [0.619s]
[INFO] Apache Aries JNDI RMI Handler ..................... SUCCESS [0.320s]
[INFO] Apache Aries JNDI Bundle .......................... SUCCESS [0.589s]
[INFO] Apache Aries JNDI Support for Legacy Runtimes ..... SUCCESS [0.594s]
[INFO] Apache Aries JNDI "business logic" test bundle for Aries jndi-url iTests  SUCCESS [0.415s]
[INFO] Apache Aries JNDI Test Bundle for Aries jndi-url iTests  SUCCESS [0.493s]
[INFO] Apache Aries JNDI iTests for jndi-url ............. SUCCESS [0.319s]
[INFO] Apache Aries JNDI ................................. SUCCESS [0.027s]
[INFO] Apache Aries Transaction Manager .................. SUCCESS [2.027s]
[INFO] Apache Aries Transaction Blueprint ................ SUCCESS [0.476s]
[INFO] Apache Aries Transaction Enlisting JDBC Datasource  SUCCESS [1.116s]
[INFO] Apache Aries JMS Pool ............................. SUCCESS [0.974s]
[INFO] Apache Aries Transaction Test Datasource Configuration  SUCCESS [0.455s]
[INFO] Apache Aries Transaction Test Bundle .............. SUCCESS [0.437s]
[INFO] Apache Aries Transaction Integration Tests ........ SUCCESS [0.176s]
[INFO] Apache Aries Transaction - reactor pom ............ SUCCESS [0.017s]
[INFO] Apache Aries Web Url handler ...................... SUCCESS [0.304s]
[INFO] Apache Aries Web integration tests ................ SUCCESS [0.196s]
[INFO] Apache Aries Web Component ........................ SUCCESS [0.027s]
[INFO] Apache Aries Application API ...................... SUCCESS [0.806s]
[INFO] Apache Aries Application Utils .................... SUCCESS [0.523s]
[INFO] Apache Aries Application Bundle ................... SUCCESS [0.883s]
[INFO] Apache Aries Application Converters ............... SUCCESS [0.403s]
[INFO] Apache Aries Application Default local platform ... SUCCESS [0.479s]
[INFO] Apache Aries Application Deployment Management .... SUCCESS [0.334s]
[INFO] Apache Aries Application Installer ................ SUCCESS [0.369s]
[INFO] Apache Aries Application itests sample application interface  SUCCESS [0.437s]
[INFO] Apache Aries Application integration tests ........ SUCCESS [0.283s]
[INFO] Apache Aries Application Management ............... SUCCESS [0.410s]
[INFO] Apache Aries Application Modelling ................ SUCCESS [0.512s]
[INFO] Apache Aries Application Modelling Standalone ..... SUCCESS [13.553s]
[INFO] Apache Aries Application Modelling tests .......... SUCCESS [0.447s]
[INFO] Apache Aries Application No-op Resolver ........... SUCCESS [0.256s]
[INFO] Apache Aries Application OBR Resolver ............. SUCCESS [0.585s]
[INFO] Apache Aries Application Resolve CM Transform ..... SUCCESS [0.244s]
[INFO] Apache Aries Application Resolve CM Transform iTests  SUCCESS [0.543s]
[INFO] Apache Aries Application Runtime .................. SUCCESS [0.297s]
[INFO] Apache Aries Isolated Application Runtime ......... SUCCESS [0.381s]
[INFO] Apache Aries Bundle Framework provider ............ SUCCESS [0.345s]
[INFO] Apache Aries Bundle Framework Manager provider .... SUCCESS [0.278s]
[INFO] Apache Aries repository generator tool ............ SUCCESS [1.542s]
[INFO] Apache Aries Bundle Repository provider ........... SUCCESS [0.276s]
[INFO] Application distribution .......................... SUCCESS [1.295s]
[INFO] Application distribution for isolated application support  SUCCESS [0.931s]
[INFO] Apache Aries Application .......................... SUCCESS [0.015s]
[INFO] Apache Aries Subsystem API ........................ SUCCESS [0.340s]
[INFO] Apache Aries Subsystem Core ....................... SUCCESS [1.306s]
[INFO] Apache Aries Subsystem OBR ........................ SUCCESS [0.308s]
[INFO] Apache Aries Subsystem iTests interfaces bundle ... SUCCESS [0.157s]
[INFO] Apache Aries Subsystem iTests ..................... SUCCESS [1.477s]
[INFO] Apache Aries Subsystems Bundle .................... SUCCESS [0.930s]
[INFO] Apache Aries Subsystem ............................ SUCCESS [0.016s]
[INFO] Aries EJB Modelling Integration ................... SUCCESS [0.873s]
[INFO] Aries EJB Modelling iTests ........................ SUCCESS [1.172s]
[INFO] Aries OpenEJB Runtime Extender .................... SUCCESS [0.743s]
[INFO] Aries EJB Extender iTests ......................... SUCCESS [0.805s]
[INFO] Aries EJB Component ............................... SUCCESS [0.057s]
[INFO] Apache Aries JMX API .............................. SUCCESS [0.324s]
[INFO] Apache Aries JMX Blueprint API .................... SUCCESS [0.226s]
[INFO] Apache Aries JMX Core ............................. SUCCESS [0.817s]
[INFO] Apache Aries JMX Core via Whiteboards ............. SUCCESS [0.512s]
[INFO] Apache Aries Whiteboard support for JMX DynamicMBean services  SUCCESS [0.920s]
[INFO] Apache Aries JMX Blueprint Core ................... SUCCESS [0.617s]
[INFO] Apache Aries JMX Bundle ........................... SUCCESS [0.570s]
[INFO] Apache Aries JMX Blueprint Bundle ................. SUCCESS [0.443s]
[INFO] Apache Aries JMX integration tests ................ SUCCESS [0.177s]
[INFO] Apache Aries JMX .................................. SUCCESS [0.021s]
[INFO] Aries JPA Container API ........................... SUCCESS [0.225s]
[INFO] Aries JPA Container ............................... SUCCESS [0.599s]
[INFO] Aries JPA Container Managed Contexts .............. SUCCESS [0.402s]
[INFO] Aries JPA Container blueprint integration for Aries blueprint  SUCCESS [0.350s]
[INFO] Test Bundle for Aries JPA Container iTests ........ SUCCESS [1.578s]
[INFO] Test Bundle for Aries JPA Container advanced iTests  SUCCESS [0.405s]
[INFO] Test Bundle for Aries JPA Blueprint iTests ........ SUCCESS [0.479s]
[INFO] Aries JPA iTests .................................. SUCCESS [0.249s]
[INFO] Aries JPA Component ............................... SUCCESS [0.015s]
[INFO] Aries JPA Container API ........................... SUCCESS [0.338s]
[INFO] Aries JPA Container ............................... SUCCESS [1.130s]
[INFO] Aries JPA Container Managed Contexts .............. SUCCESS [0.366s]
[INFO] Aries JPA Container blueprint integration for Aries blueprint  SUCCESS [0.389s]
[INFO] Test Bundle for Aries JPA Container iTests ........ SUCCESS [0.944s]
[INFO] Test Bundle for Aries JPA Container advanced iTests  SUCCESS [0.246s]
[INFO] Aries JPA iTests .................................. FAILURE [2.350s]
[INFO] Test Bundle for Aries JPA Blueprint iTests ........ SKIPPED
[INFO] Aries JPA Component ............................... SKIPPED
[INFO] Apache Aries SPI Fly Core (internal module) ....... SKIPPED
[INFO] Apache Aries SPI Fly Weaver (internal module) ..... SKIPPED
[INFO] Apache Aries SPI Fly Dynamic Weaving Bundle ....... SKIPPED
[INFO] Apache Aries SPI Fly Static Weaving Tool .......... SKIPPED
[INFO] Apache Aries SPI Fly Static Weaving Bundle ........ SKIPPED
[INFO] Apache Aries SPI Fly Examples ..................... SKIPPED
[INFO] Apache Aries Example SPI Interface ................ SKIPPED
[INFO] Apache Aries Example SPI Provider Jar 1 ........... SKIPPED
[INFO] Apache Aries Example SPI Provider Bundle 1 ........ SKIPPED
[INFO] Apache Aries Example SPI Provider Bundle 2 ........ SKIPPED
[INFO] Apache Aries Example SPI Client Jar 1 ............. SKIPPED
[INFO] Apache Aries Example SPI Client Bundle 1 .......... SKIPPED
[INFO] Apache Aries Example SPI Client Bundle 2 .......... SKIPPED
[INFO] Apache Aries Example SPI Provider Consumer Bundle . SKIPPED
[INFO] Apache Aries Example Resource Provider Bundle ..... SKIPPED
[INFO] Apache Aries Example Resource Client Bundle ....... SKIPPED
[INFO] Apache Aries SPI Fly .............................. SKIPPED
[INFO] Apache Aries Samples .............................. SKIPPED
[INFO] Apache Aries blog sample .......................... SKIPPED
[INFO] Apache Aries blog sample API ...................... SKIPPED
[INFO] Apache Aries blog sample transaction enlisting JDBC datasource  SKIPPED
[INFO] Apache Aries blog sample assembly ................. SKIPPED
[INFO] Apache Aries blog sample .......................... SKIPPED
[INFO] Apache Aries blog sample web component ............ SKIPPED
[INFO] Apache Aries blog sample persistence .............. SKIPPED
[INFO] Apache Aries Blog Sample EBA using JDBC ........... SKIPPED
[INFO] Apache Aries blog sample persistence .............. SKIPPED
[INFO] Apache Aries Blog Sample EBA using JPA ............ SKIPPED
[INFO] Apache Aries blog sample commenting EJB ........... SKIPPED
[INFO] Apache Aries Blog sample iTests ................... SKIPPED
[INFO] AriesTrader :: Performance Benchmark Sample ....... SKIPPED
[INFO] AriesTrader :: Modules ............................ SKIPPED
[INFO] AriesTrader :: Modules - Util ..................... SKIPPED
[INFO] AriesTrader :: Modules - API ...................... SKIPPED
[INFO] AriesTrader :: Modules - Core ..................... SKIPPED
[INFO] AriesTrader :: Modules - Web ...................... SKIPPED
[INFO] AriesTrader :: Modules - Beans .................... SKIPPED
[INFO] AriesTrader :: Modules - Entities ................. SKIPPED
[INFO] AriesTrader :: Modules - Derby DataSource ......... SKIPPED
[INFO] AriesTrader :: Modules - Persist JDBC ............. SKIPPED
[INFO] AriesTrader :: Modules - Persist JPA App Managed .. SKIPPED
[INFO] AriesTrader :: Modules - Persist JPA Container Managed  SKIPPED
[INFO] AriesTrader :: Assemblies ......................... SKIPPED
[INFO] AriesTrader :: Assemblies - EBA - JDBC ............ SKIPPED
[INFO] AriesTrader :: Assemblies - EBA - ALL ............. SKIPPED
[INFO] Equinox test harness that can be used to install sample EBAs  SKIPPED
[INFO] Apache Aries Blueprint samples .................... SKIPPED
[INFO] Apache Aries Blueprint HelloWorld ................. SKIPPED
[INFO] Apache Aries Blueprint HelloWorld API ............. SKIPPED
[INFO] Apache Aries Blueprint HelloWorldServer ........... SKIPPED
[INFO] Apache Aries Blueprint HelloWorldClient ........... SKIPPED
[INFO] Apache Aries Blueprint HelloWorld Assembly ........ SKIPPED
[INFO] Apache Aries Blueprint HelloWorld EBA ............. SKIPPED
[INFO] Apache Aries Blueprint sample iTests .............. SKIPPED
[INFO] Apache Aries Blueprint Sample - ID Verifier ....... SKIPPED
[INFO] Apache Aries Blueprint Sample - ID Verifier API ... SKIPPED
[INFO] Apache Aries Blueprint Sample - ID Verifier Server  SKIPPED
[INFO] Apache Aries Blueprint Sample - ID Verifier Client  SKIPPED
[INFO] Apache Aries Blueprint Sample - ID Verifier Assembly  SKIPPED
[INFO] Apache Aries Twitter sample ....................... SKIPPED
[INFO] Apache Aries Bundlise Twitter4j ................... SKIPPED
[INFO] Apache Aries Twitter bundle ....................... SKIPPED
[INFO] Apache Aries Twitter EBA .......................... SKIPPED
[INFO] Apache Aries Twitter sample integration tests ..... SKIPPED
[INFO] Aries Maven ESA Plugin ............................ SKIPPED
[INFO] Apache Aries ...................................... SKIPPED
[INFO] ------------------------------------------------------------------------
[INFO] BUILD FAILURE
[INFO] ------------------------------------------------------------------------
[INFO] Total time: 1:46.800s
[INFO] Finished at: Fri Aug 01 12:49:42 UTC 2014
[INFO] Final Memory: 142M/582M
[INFO] ------------------------------------------------------------------------
[ERROR] Failed to execute goal on project org.apache.aries.jpa.container.itest: Could not
resolve dependencies for project org.apache.aries.jpa20:org.apache.aries.jpa.container.itest:jar:1.0.1-SNAPSHOT:
The following artifacts could not be resolved: org.apache.aries.jpa:org.apache.aries.jpa.container:jar:1.0.1-SNAPSHOT,
org.apache.aries.jpa:org.apache.aries.jpa.container.context:jar:1.0.2-SNAPSHOT, org.apache.aries.jpa:org.apache.aries.jpa.blueprint.aries:jar:1.0.2-SNAPSHOT:
Could not find artifact org.apache.aries.jpa:org.apache.aries.jpa.container:jar:1.0.1-SNAPSHOT
in codehaus.snapshots (http://snapshots.repository.codehaus.org) -> [Help 1]
org.apache.maven.lifecycle.LifecycleExecutionException: Failed to execute goal on project
org.apache.aries.jpa.container.itest: Could not resolve dependencies for project org.apache.aries.jpa20:org.apache.aries.jpa.container.itest:jar:1.0.1-SNAPSHOT:
The following artifacts could not be resolved: org.apache.aries.jpa:org.apache.aries.jpa.container:jar:1.0.1-SNAPSHOT,
org.apache.aries.jpa:org.apache.aries.jpa.container.context:jar:1.0.2-SNAPSHOT, org.apache.aries.jpa:org.apache.aries.jpa.blueprint.aries:jar:1.0.2-SNAPSHOT:
Could not find artifact org.apache.aries.jpa:org.apache.aries.jpa.container:jar:1.0.1-SNAPSHOT
in codehaus.snapshots (http://snapshots.repository.codehaus.org)
	at org.apache.maven.lifecycle.internal.LifecycleDependencyResolver.getDependencies(LifecycleDependencyResolver.java:196)
	at org.apache.maven.lifecycle.internal.LifecycleDependencyResolver.resolveProjectDependencies(LifecycleDependencyResolver.java:108)
	at org.apache.maven.lifecycle.internal.MojoExecutor.ensureDependenciesAreResolved(MojoExecutor.java:258)
	at org.apache.maven.lifecycle.internal.MojoExecutor.execute(MojoExecutor.java:201)
	at org.apache.maven.lifecycle.internal.MojoExecutor.execute(MojoExecutor.java:153)
	at org.apache.maven.lifecycle.internal.MojoExecutor.execute(MojoExecutor.java:145)
	at org.apache.maven.lifecycle.internal.LifecycleModuleBuilder.buildProject(LifecycleModuleBuilder.java:84)
	at org.apache.maven.lifecycle.internal.LifecycleModuleBuilder.buildProject(LifecycleModuleBuilder.java:59)
	at org.apache.maven.lifecycle.internal.LifecycleStarter.singleThreadedBuild(LifecycleStarter.java:183)
	at org.apache.maven.lifecycle.internal.LifecycleStarter.execute(LifecycleStarter.java:161)
	at org.apache.maven.DefaultMaven.doExecute(DefaultMaven.java:319)
	at org.apache.maven.DefaultMaven.execute(DefaultMaven.java:156)
	at org.apache.maven.cli.MavenCli.execute(MavenCli.java:537)
	at org.apache.maven.cli.MavenCli.doMain(MavenCli.java:196)
	at org.apache.maven.cli.MavenCli.main(MavenCli.java:141)
	at sun.reflect.NativeMethodAccessorImpl.invoke0(Native Method)
	at sun.reflect.NativeMethodAccessorImpl.invoke(NativeMethodAccessorImpl.java:57)
	at sun.reflect.DelegatingMethodAccessorImpl.invoke(DelegatingMethodAccessorImpl.java:43)
	at java.lang.reflect.Method.invoke(Method.java:606)
	at org.codehaus.plexus.classworlds.launcher.Launcher.launchEnhanced(Launcher.java:290)
	at org.codehaus.plexus.classworlds.launcher.Launcher.launch(Launcher.java:230)
	at org.codehaus.plexus.classworlds.launcher.Launcher.mainWithExitCode(Launcher.java:409)
	at org.codehaus.plexus.classworlds.launcher.Launcher.main(Launcher.java:352)
Caused by: org.apache.maven.project.DependencyResolutionException: Could not resolve dependencies
for project org.apache.aries.jpa20:org.apache.aries.jpa.container.itest:jar:1.0.1-SNAPSHOT:
The following artifacts could not be resolved: org.apache.aries.jpa:org.apache.aries.jpa.container:jar:1.0.1-SNAPSHOT,
org.apache.aries.jpa:org.apache.aries.jpa.container.context:jar:1.0.2-SNAPSHOT, org.apache.aries.jpa:org.apache.aries.jpa.blueprint.aries:jar:1.0.2-SNAPSHOT:
Could not find artifact org.apache.aries.jpa:org.apache.aries.jpa.container:jar:1.0.1-SNAPSHOT
in codehaus.snapshots (http://snapshots.repository.codehaus.org)
	at org.apache.maven.project.DefaultProjectDependenciesResolver.resolve(DefaultProjectDependenciesResolver.java:170)
	at org.apache.maven.lifecycle.internal.LifecycleDependencyResolver.getDependencies(LifecycleDependencyResolver.java:171)
	... 22 more
Caused by: org.sonatype.aether.resolution.DependencyResolutionException: The following artifacts
could not be resolved: org.apache.aries.jpa:org.apache.aries.jpa.container:jar:1.0.1-SNAPSHOT,
org.apache.aries.jpa:org.apache.aries.jpa.container.context:jar:1.0.2-SNAPSHOT, org.apache.aries.jpa:org.apache.aries.jpa.blueprint.aries:jar:1.0.2-SNAPSHOT:
Could not find artifact org.apache.aries.jpa:org.apache.aries.jpa.container:jar:1.0.1-SNAPSHOT
in codehaus.snapshots (http://snapshots.repository.codehaus.org)
	at org.sonatype.aether.impl.internal.DefaultRepositorySystem.resolveDependencies(DefaultRepositorySystem.java:412)
	at org.apache.maven.project.DefaultProjectDependenciesResolver.resolve(DefaultProjectDependenciesResolver.java:164)
	... 23 more
Caused by: org.sonatype.aether.resolution.ArtifactResolutionException: The following artifacts
could not be resolved: org.apache.aries.jpa:org.apache.aries.jpa.container:jar:1.0.1-SNAPSHOT,
org.apache.aries.jpa:org.apache.aries.jpa.container.context:jar:1.0.2-SNAPSHOT, org.apache.aries.jpa:org.apache.aries.jpa.blueprint.aries:jar:1.0.2-SNAPSHOT:
Could not find artifact org.apache.aries.jpa:org.apache.aries.jpa.container:jar:1.0.1-SNAPSHOT
in codehaus.snapshots (http://snapshots.repository.codehaus.org)
	at org.sonatype.aether.impl.internal.DefaultArtifactResolver.resolve(DefaultArtifactResolver.java:541)
	at org.sonatype.aether.impl.internal.DefaultArtifactResolver.resolveArtifacts(DefaultArtifactResolver.java:220)
	at org.sonatype.aether.impl.internal.DefaultRepositorySystem.resolveDependencies(DefaultRepositorySystem.java:395)
	... 24 more
Caused by: org.sonatype.aether.transfer.ArtifactNotFoundException: Could not find artifact
org.apache.aries.jpa:org.apache.aries.jpa.container:jar:1.0.1-SNAPSHOT in codehaus.snapshots
(http://snapshots.repository.codehaus.org)
	at org.sonatype.aether.connector.wagon.WagonRepositoryConnector$4.wrap(WagonRepositoryConnector.java:945)
	at org.sonatype.aether.connector.wagon.WagonRepositoryConnector$4.wrap(WagonRepositoryConnector.java:940)
	at org.sonatype.aether.connector.wagon.WagonRepositoryConnector$GetTask.flush(WagonRepositoryConnector.java:695)
	at org.sonatype.aether.connector.wagon.WagonRepositoryConnector$GetTask.flush(WagonRepositoryConnector.java:689)
	at org.sonatype.aether.connector.wagon.WagonRepositoryConnector.get(WagonRepositoryConnector.java:445)
	at org.sonatype.aether.impl.internal.DefaultArtifactResolver.resolve(DefaultArtifactResolver.java:460)
	... 26 more
[ERROR] 
[ERROR] Re-run Maven using the -X switch to enable full debug logging.
[ERROR] 
[ERROR] For more information about the errors and possible solutions, please read the following
articles:
[ERROR] [Help 1] http://cwiki.apache.org/confluence/display/MAVEN/DependencyResolutionException
[ERROR] 
[ERROR] After correcting the problems, you can resume the build with the command
[ERROR]   mvn <goals> -rf :org.apache.aries.jpa.container.itest
Build step 'Invoke top-level Maven targets' marked build as failure

Mime
View raw message